FailedOk

th/SRPMS[OK]
th/x32[OK]
th/i686[OK]
th/x86_64[OK]

ac/SRPMS[OK]
ac/i386[OK]
ac/i586[OK]
ac/i686[OK]
ac/alpha[OK]
ac/amd64[OK]
ac/athlon[OK]
ac/ppc[OK]
ac/sparc[OK]
ac/sparc64[OK]

Advanced Search
main()
Powered by PLD Linux
(c) 2002-2023 PLD Team
$Revision: 1.37 $
Powered by /dev/ill.
Your IP: 3.214.216.26

3store 3a375d64-2490-42ad-a9e0-f9c75fda4f5c

Status:Failed
Source URL:https://buildlogs.pld-linux.org/pld/th/x32/FAIL/3store,3a375d64-2490-42ad-a9e0-f9c75fda4f5c.bz2
text/plain URL:View!
rpm -qa of builder:View!
Date:2016/10/18 07:55:13
Runtime:0:00:10.534589

Toc:

  • prep
  • Executing(%prep): /bin/sh -e /tmp/B.BS_P6O/BUILD/tmp/rpm-tmp.43711
  • build
  • Executing(%build): /bin/sh -e /tmp/B.BS_P6O/BUILD/tmp/rpm-tmp.43711
  • error 1
  • rdql.c:538:2: error: format not a string literal and no format arguments [-Werror=format-security]
  • error 2
  • make[4]: *** [Makefile:522: rdql.lo] Error 1
  • error 3
  • make[3]: *** [Makefile:547: all-recursive] Error 1
  • error 4
  • make[2]: *** [Makefile:381: all-recursive] Error 1
  • error 5
  • make[1]: *** [Makefile:320: all] Error 2
  • error 6
  • error: Bad exit status from /tmp/B.BS_P6O/BUILD/tmp/rpm-tmp.43711 (%build)
  • error 7
  • RPM build errors:
  • error 8
  • error: No files produced.

Content:

request from: baggins
checking if we should skip the build
started at: Tue Oct 18 07:54:57 2016
fetching https://srcbuilder.pld-linux.org/th//srpms/3a375d64-2490-42ad-a9e0-f9c75fda4f5c/3store-2.2.22-10.src.rpm
fetched 652270 bytes, 358.7 K/s
installing srpm: 3store-2.2.22-10.src.rpm
+ install -d /tmp/B.BS_P6O/BUILD /tmp/B.BS_P6O/RPMS
+ LC_ALL=en_US.UTF-8
+ rpm -qp --changelog 3store-2.2.22-10.src.rpm
* Tue Oct 18 2016 PLD Linux Team <feedback@pld-linux.org>
- For complete changelog see: http://git.pld-linux.org/?p=packages/3store.git;a=log;h=master
* Tue Oct 18 2016 Jan Rękorajski <baggins@pld-linux.org> 0ae2934
- rebuild with readline 7.0 - release 10 (by relup.sh) + rpm -Uhv --nodeps --define '_topdir /tmp/B.BS_P6O' --define '_specdir %{_topdir}' --define '_sourcedir %{_specdir}' --define '_rpmdir %{_topdir}/RPMS' --define '_builddir %{_topdir}/BUILD' 3store-2.2.22-10.src.rpm Preparing... ################################################## 3store ################################################## + rm -f 3store-2.2.22-10.src.rpm + install -m 700 -d /tmp/B.BS_P6O/BUILD/tmp + TMPDIR=/tmp/B.BS_P6O/BUILD/tmp + exec nice -n 0 rpmbuild -bp --short-circuit --nodeps --define '_topdir /tmp/B.BS_P6O' --define '_specdir %{_topdir}' --define '_sourcedir %{_specdir}' --define '_rpmdir %{_topdir}/RPMS' --define '_builddir %{_topdir}/BUILD' --target x32-pld-linux --define 'prep exit 0' /tmp/B.BS_P6O/3store.spec Building target platforms: x32-pld-linux checking BuildConflict-ing packages no BuildConflicts found checking BR rpm: Building target platforms: x32-pld-linux no BR needed building RPM using: set -ex; : build-id: 3a375d64-2490-42ad-a9e0-f9c75fda4f5c; TMPDIR=/tmp/B.BS_P6O/BUILD/tmp exec nice -n 0 rpmbuild -bb --define '_smp_mflags -j9' --define '_make_opts -Otarget' --define '_pld_builder 1' --define '_topdir /tmp/B.BS_P6O' --define '_specdir %{_topdir}' --define '_sourcedir %{_specdir}' --define '_rpmdir %{_topdir}/RPMS' --define '_builddir %{_topdir}/BUILD' --target x32-pld-linux /tmp/B.BS_P6O/3store.spec + : build-id: 3a375d64-2490-42ad-a9e0-f9c75fda4f5c + TMPDIR=/tmp/B.BS_P6O/BUILD/tmp + exec nice -n 0 rpmbuild -bb --define '_smp_mflags -j9' --define '_make_opts -Otarget' --define '_pld_builder 1' --define '_topdir /tmp/B.BS_P6O' --define '_specdir %{_topdir}' --define '_sourcedir %{_specdir}' --define '_rpmdir %{_topdir}/RPMS' --define '_builddir %{_topdir}/BUILD' --target x32-pld-linux /tmp/B.BS_P6O/3store.spec Building target platforms: x32-pld-linux Executing(%prep): /bin/sh -e /tmp/B.BS_P6O/BUILD/tmp/rpm-tmp.43711 + umask 022 + cd /tmp/B.BS_P6O/BUILD + cd /tmp/B.BS_P6O/BUILD + rm -rf 3store-2.2.22 + /usr/bin/gzip -dc /tmp/B.BS_P6O/3store-2.2.22.tar.gz + /bin/tar -xf - + STATUS=0 + '[' 0 -ne 0 ']' + cd 3store-2.2.22 + /bin/id -u + '[' 1000 '=' 0 ']' + /bin/id -u + '[' 1000 '=' 0 ']' + /bin/chmod -Rf a+rX,u+w,g-w,o-w . + echo 'Patch #0 (3store-ac.patch):' Patch #0 (3store-ac.patch): + '[' -f /tmp/B.BS_P6O/3store-ac.patch ']' + /bin/cat /tmp/B.BS_P6O/3store-ac.patch + /usr/bin/patch -s -p1 + exit 0 Executing(%build): /bin/sh -e /tmp/B.BS_P6O/BUILD/tmp/rpm-tmp.43711 HOME=/home/users/builder PATH=/home/users/builder/GNUstep/Tools:/usr/local/bin:/usr/bin:/bin TMPDIR=/tmp/B.BS_P6O/BUILD/tmp + umask 022 + cd /tmp/B.BS_P6O/BUILD + cd 3store-2.2.22 + libtoolize --copy --force --install libtoolize: putting auxiliary files in '.'. libtoolize: copying file './config.guess' libtoolize: copying file './config.sub' libtoolize: copying file './install-sh' libtoolize: copying file './ltmain.sh' libtoolize: You should add the contents of the following files to 'aclocal.m4': libtoolize: '/usr/share/aclocal/libtool.m4' libtoolize: '/usr/share/aclocal/ltoptions.m4' libtoolize: '/usr/share/aclocal/ltsugar.m4' libtoolize: '/usr/share/aclocal/ltversion.m4' libtoolize: '/usr/share/aclocal/lt~obsolete.m4' libtoolize: Consider adding 'AC_CONFIG_MACRO_DIRS([m4])' to configure.in, libtoolize: and rerunning libtoolize and aclocal. libtoolize: Consider adding '-I m4' to ACLOCAL_AMFLAGS in Makefile.am. + aclocal aclocal: warning: autoconf input should be named 'configure.ac', not 'configure.in' + autoconf + autoheader + automake -a -c -f --foreign automake: warning: autoconf input should be named 'configure.ac', not 'configure.in' configure.in:17: installing './compile' configure.in:3: installing './missing' automake: warning: autoconf input should be named 'configure.ac', not 'configure.in' src/libokbc/Makefile.am: installing './depcomp' configure.in: installing './ylwrap' + ./configure 'LDFLAGS=-Wl,--as-needed -Wl,--no-copy-dt-needed-entries -Wl,-z,relro -Wl,-z,combreloc ' 'CFLAGS=-O2 -fwrapv -pipe -Wformat -Werror=format-security -gdwarf-4 -fno-debug-types-section -fvar-tracking-assignments -g2 -Wp,-D_FORTIFY_SOURCE=2 -fstack-protector-strong --param=ssp-buffer-size=4 -fPIC -mtune=generic -march=x86-64 -gdwarf-4 -fno-debug-types-section -fvar-tracking-assignments -g2 ' 'CXXFLAGS=-O2 -fwrapv -pipe -Wformat -Werror=format-security -gdwarf-4 -fno-debug-types-section -fvar-tracking-assignments -g2 -Wp,-D_FORTIFY_SOURCE=2 -fstack-protector-strong --param=ssp-buffer-size=4 -fPIC -mtune=generic -march=x86-64 -gdwarf-4 -fno-debug-types-section -fvar-tracking-assignments -g2 ' 'FFLAGS=-O2 -fwrapv -pipe -Wformat -Werror=format-security -gdwarf-4 -fno-debug-types-section -fvar-tracking-assignments -g2 -Wp,-D_FORTIFY_SOURCE=2 -fstack-protector-strong --param=ssp-buffer-size=4 -fPIC -mtune=generic -march=x86-64 -gdwarf-4 -fno-debug-types-section -fvar-tracking-assignments -g2 ' 'FCFLAGS=-O2 -fwrapv -pipe -Wformat -Werror=format-security -gdwarf-4 -fno-debug-types-section -fvar-tracking-assignments -g2 -Wp,-D_FORTIFY_SOURCE=2 -fstack-protector-strong --param=ssp-buffer-size=4 -fPIC -mtune=generic -march=x86-64 -gdwarf-4 -fno-debug-types-section -fvar-tracking-assignments -g2 ' 'CPPFLAGS=' 'CC=x86_64-pld-linux-gnux32-gcc' 'CXX=x86_64-pld-linux-gnux32-g++' '--host=x86_64-pld-linux-gnux32' '--build=x86_64-pld-linux-gnux32' '--prefix=/usr' '--exec-prefix=/usr' '--bindir=/usr/bin' '--sbindir=/usr/sbin' '--sysconfdir=/etc' '--datadir=/usr/share' '--includedir=/usr/include' '--libdir=/usr/libx32' '--libexecdir=/usr/libx32' '--localstatedir=/var' '--sharedstatedir=/var/lib' '--mandir=/usr/share/man' '--infodir=/usr/share/info' '--x-libraries=/usr/libx32' checking for a BSD-compatible install... /usr/bin/install -c checking whether build environment is sane... yes checking for a thread-safe mkdir -p... /bin/mkdir -p checking for mawk... mawk checking whether make sets $(MAKE)... yes checking whether make supports nested variables... yes checking for x86_64-pld-linux-gnux32-ranlib... no checking for ranlib... ranlib checking for x86_64-pld-linux-gnux32-gcc... x86_64-pld-linux-gnux32-gcc checking whether the C compiler works... yes checking for C compiler default output file name... a.out checking for suffix of executables... checking whether we are cross compiling... no checking for suffix of object files... o checking whether we are using the GNU C compiler... yes checking whether x86_64-pld-linux-gnux32-gcc accepts -g... yes checking for x86_64-pld-linux-gnux32-gcc option to accept ISO C89... none needed checking whether x86_64-pld-linux-gnux32-gcc understands -c and -o together... yes checking for style of include used by make... GNU checking dependency style of x86_64-pld-linux-gnux32-gcc... gcc3 checking for bison... bison -y checking for flex... flex checking lex output file root... lex.yy checking lex library... -lfl checking whether yytext is a pointer... yes checking build system type... x86_64-pld-linux-gnux32 checking host system type... x86_64-pld-linux-gnux32 checking how to print strings... print -r checking for a sed that does not truncate output... /bin/sed checking for grep that handles long lines and -e... /bin/grep checking for egrep... /bin/grep -E checking for fgrep... /bin/grep -F checking for ld used by x86_64-pld-linux-gnux32-gcc... /usr/bin/ld checking if the linker (/usr/bin/ld) is GNU ld... yes checking for BSD- or MS-compatible name lister (nm)... /usr/bin/nm -B checking the name lister (/usr/bin/nm -B) interface... BSD nm checking whether ln -s works... yes checking the maximum length of command line arguments... 1572864 checking how to convert x86_64-pld-linux-gnux32 file names to x86_64-pld-linux-gnux32 format... func_convert_file_noop checking how to convert x86_64-pld-linux-gnux32 file names to toolchain format... func_convert_file_noop checking for /usr/bin/ld option to reload object files... -r checking for x86_64-pld-linux-gnux32-objdump... no checking for objdump... objdump checking how to recognize dependent libraries... pass_all checking for x86_64-pld-linux-gnux32-dlltool... no checking for dlltool... no checking how to associate runtime and link libraries... print -r -- checking for x86_64-pld-linux-gnux32-ar... no checking for ar... ar checking for archiver @FILE support... @ checking for x86_64-pld-linux-gnux32-strip... no checking for strip... strip checking for x86_64-pld-linux-gnux32-ranlib... ranlib checking command to parse /usr/bin/nm -B output from x86_64-pld-linux-gnux32-gcc object... ok checking for sysroot... no checking for a working dd... /bin/dd checking how to truncate binary pipes... /bin/dd bs=4096 count=1 checking for x86_64-pld-linux-gnux32-mt... no checking for mt... no checking if : is a manifest tool... no checking how to run the C preprocessor... x86_64-pld-linux-gnux32-gcc -E checking for ANSI C header files... yes checking for sys/types.h... yes checking for sys/stat.h... yes checking for stdlib.h... yes checking for string.h... yes checking for memory.h... yes checking for strings.h... yes checking for inttypes.h... yes checking for stdint.h... yes checking for unistd.h... yes checking for dlfcn.h... yes checking for objdir... .libs checking if x86_64-pld-linux-gnux32-gcc supports -fno-rtti -fno-exceptions... no checking for x86_64-pld-linux-gnux32-gcc option to produce PIC... -fPIC -DPIC checking if x86_64-pld-linux-gnux32-gcc PIC flag -fPIC -DPIC works... yes checking if x86_64-pld-linux-gnux32-gcc static flag -static works... yes checking if x86_64-pld-linux-gnux32-gcc supports -c -o file.o... yes checking if x86_64-pld-linux-gnux32-gcc supports -c -o file.o... (cached) yes checking whether the x86_64-pld-linux-gnux32-gcc linker (/usr/bin/ld -m elf32_x86_64) supports shared libraries... yes checking whether -lc should be explicitly linked in... no checking dynamic linker characteristics... GNU/Linux ld.so checking how to hardcode library paths into programs... immediate checking whether stripping libraries is possible... yes checking if libtool supports shared libraries... yes checking whether to build shared libraries... yes checking whether to build static libraries... yes checking for pthread_self in -lpthread... yes checking for mysql_config... /usr/bin/mysql_config checking for glib-config... /usr/bin/glib-config checking for raptor-config... /usr/bin/raptor-config checking for ANSI C header files... (cached) yes checking for stdlib.h... (cached) yes checking for string.h... (cached) yes checking for unistd.h... (cached) yes checking for an ANSI C-conforming const... yes checking for inline... inline checking whether byte ordering is bigendian... no Will not build Apache module support checking that generated files are newer than configure... done configure: creating ./config.status config.status: creating 3store.pc config.status: creating 3store.spec config.status: creating 3store-config config.status: creating Makefile config.status: creating util/Makefile config.status: creating util/tables.sql config.status: creating src/Makefile config.status: creating src/rdfsql/Makefile config.status: creating src/rdfsql/rdfsql/Makefile config.status: creating src/libokbc/Makefile config.status: creating src/tools/Makefile config.status: creating src/perl/Makefile config.status: creating src/perl/RDQL.pm config.status: creating src/http/Makefile config.status: creating src/config.h config.status: executing depfiles commands config.status: executing libtool commands config.status: executing default commands + /usr/bin/make -Otarget -j9 Making all in src /usr/bin/make all-recursive Making all in rdfsql Making all in rdfsql make[4]: Nothing to be done for 'all'. make[4]: Entering directory '/tmp/B.BS_P6O/BUILD/3store-2.2.22/src/rdfsql' /bin/sh ../../libtool --tag=CC --mode=compile x86_64-pld-linux-gnux32-gcc -DHAVE_CONFIG_H -I. -I../../src -Wall -g -I/usr/include/glib-1.2 -I/usr/libx32/glib/include -I/usr/include/mysql -fPIC -fPIC -DNDEBUG -fabi-version=2 -O2 -fwrapv -pipe -Wformat -Werror=format-security -gdwarf-4 -fno-debug-types-section -fvar-tracking-assignments -g2 -Wp,-D_FORTIFY_SOURCE=2 -fstack-protector-strong --param=ssp-buffer-size=4 -fPIC -mtune=generic -march=x86-64 -gdwarf-4 -fno-debug-types-section -fvar-tracking-assignments -g2 -MT rdql_datatypes.lo -MD -MP -MF .deps/rdql_datatypes.Tpo -c -o rdql_datatypes.lo rdql_datatypes.c libtool: compile: x86_64-pld-linux-gnux32-gcc -DHAVE_CONFIG_H -I. -I../../src -Wall -g -I/usr/include/glib-1.2 -I/usr/libx32/glib/include -I/usr/include/mysql -fPIC -fPIC -DNDEBUG -fabi-version=2 -O2 -fwrapv -pipe -Wformat -Werror=format-security -gdwarf-4 -fno-debug-types-section -fvar-tracking-assignments -g2 -Wp,-D_FORTIFY_SOURCE=2 -fstack-protector-strong --param=ssp-buffer-size=4 -fPIC -mtune=generic -march=x86-64 -gdwarf-4 -fno-debug-types-section -fvar-tracking-assignments -g2 -MT rdql_datatypes.lo -MD -MP -MF .deps/rdql_datatypes.Tpo -c rdql_datatypes.c -fPIC -DPIC -o .libs/rdql_datatypes.o libtool: compile: x86_64-pld-linux-gnux32-gcc -DHAVE_CONFIG_H -I. -I../../src -Wall -g -I/usr/include/glib-1.2 -I/usr/libx32/glib/include -I/usr/include/mysql -fPIC -fPIC -DNDEBUG -fabi-version=2 -O2 -fwrapv -pipe -Wformat -Werror=format-security -gdwarf-4 -fno-debug-types-section -fvar-tracking-assignments -g2 -Wp,-D_FORTIFY_SOURCE=2 -fstack-protector-strong --param=ssp-buffer-size=4 -fPIC -mtune=generic -march=x86-64 -gdwarf-4 -fno-debug-types-section -fvar-tracking-assignments -g2 -MT rdql_datatypes.lo -MD -MP -MF .deps/rdql_datatypes.Tpo -c rdql_datatypes.c -o rdql_datatypes.o >/dev/null 2>&1 mv -f .deps/rdql_datatypes.Tpo .deps/rdql_datatypes.Plo make[4]: Leaving directory '/tmp/B.BS_P6O/BUILD/3store-2.2.22/src/rdfsql' make[4]: Entering directory '/tmp/B.BS_P6O/BUILD/3store-2.2.22/src/rdfsql' /bin/sh ../../libtool --tag=CC --mode=compile x86_64-pld-linux-gnux32-gcc -DHAVE_CONFIG_H -I. -I../../src -Wall -g -I/usr/include/glib-1.2 -I/usr/libx32/glib/include -I/usr/include/mysql -fPIC -fPIC -DNDEBUG -fabi-version=2 -O2 -fwrapv -pipe -Wformat -Werror=format-security -gdwarf-4 -fno-debug-types-section -fvar-tracking-assignments -g2 -Wp,-D_FORTIFY_SOURCE=2 -fstack-protector-strong --param=ssp-buffer-size=4 -fPIC -mtune=generic -march=x86-64 -gdwarf-4 -fno-debug-types-section -fvar-tracking-assignments -g2 -MT rdql.lo -MD -MP -MF .deps/rdql.Tpo -c -o rdql.lo rdql.c libtool: compile: x86_64-pld-linux-gnux32-gcc -DHAVE_CONFIG_H -I. -I../../src -Wall -g -I/usr/include/glib-1.2 -I/usr/libx32/glib/include -I/usr/include/mysql -fPIC -fPIC -DNDEBUG -fabi-version=2 -O2 -fwrapv -pipe -Wformat -Werror=format-security -gdwarf-4 -fno-debug-types-section -fvar-tracking-assignments -g2 -Wp,-D_FORTIFY_SOURCE=2 -fstack-protector-strong --param=ssp-buffer-size=4 -fPIC -mtune=generic -march=x86-64 -gdwarf-4 -fno-debug-types-section -fvar-tracking-assignments -g2 -MT rdql.lo -MD -MP -MF .deps/rdql.Tpo -c rdql.c -fPIC -DPIC -o .libs/rdql.o rdql.c: In function 'st_free': rdql.c:25:25: warning: passing argument 1 of 'free' discards 'const' qualifier from pointer target type [-Wdiscarded-qualifiers] if (v->column) free(v->column); ^ In file included from rdql.c:2:0: /usr/include/stdlib.h:444:13: note: expected 'void *' but argument is of type 'const char *' extern void free (void *__ptr) __THROW; ^ rdql.c:26:29: warning: passing argument 1 of 'free' discards 'const' qualifier from pointer target type [-Wdiscarded-qualifiers] if (v->val_column) free(v->val_column); ^ In file included from rdql.c:2:0: /usr/include/stdlib.h:444:13: note: expected 'void *' but argument is of type 'const char *' extern void free (void *__ptr) __THROW; ^ rdql.c:27:30: warning: passing argument 1 of 'free' discards 'const' qualifier from pointer target type [-Wdiscarded-qualifiers] if (v->hash_column) free(v->hash_column); ^ In file included from rdql.c:2:0: /usr/include/stdlib.h:444:13: note: expected 'void *' but argument is of type 'const char *' extern void free (void *__ptr) __THROW; ^ rdql.c: In function 'rs_rdql_query': rdql.c:538:2: error: format not a string literal and no format arguments [-Werror=format-security] fprintf(stderr, res->error_str); ^ cc1: some warnings being treated as errors make[4]: *** [Makefile:522: rdql.lo] Error 1 make[4]: Leaving directory '/tmp/B.BS_P6O/BUILD/3store-2.2.22/src/rdfsql' make[4]: *** Waiting for unfinished jobs.... make[4]: Entering directory '/tmp/B.BS_P6O/BUILD/3store-2.2.22/src/rdfsql' /bin/sh ../../libtool --tag=CC --mode=compile x86_64-pld-linux-gnux32-gcc -DHAVE_CONFIG_H -I. -I../../src -Wall -g -I/usr/include/glib-1.2 -I/usr/libx32/glib/include -I/usr/include/mysql -fPIC -fPIC -DNDEBUG -fabi-version=2 -O2 -fwrapv -pipe -Wformat -Werror=format-security -gdwarf-4 -fno-debug-types-section -fvar-tracking-assignments -g2 -Wp,-D_FORTIFY_SOURCE=2 -fstack-protector-strong --param=ssp-buffer-size=4 -fPIC -mtune=generic -march=x86-64 -gdwarf-4 -fno-debug-types-section -fvar-tracking-assignments -g2 -MT import.lo -MD -MP -MF .deps/import.Tpo -c -o import.lo import.c libtool: compile: x86_64-pld-linux-gnux32-gcc -DHAVE_CONFIG_H -I. -I../../src -Wall -g -I/usr/include/glib-1.2 -I/usr/libx32/glib/include -I/usr/include/mysql -fPIC -fPIC -DNDEBUG -fabi-version=2 -O2 -fwrapv -pipe -Wformat -Werror=format-security -gdwarf-4 -fno-debug-types-section -fvar-tracking-assignments -g2 -Wp,-D_FORTIFY_SOURCE=2 -fstack-protector-strong --param=ssp-buffer-size=4 -fPIC -mtune=generic -march=x86-64 -gdwarf-4 -fno-debug-types-section -fvar-tracking-assignments -g2 -MT import.lo -MD -MP -MF .deps/import.Tpo -c import.c -fPIC -DPIC -o .libs/import.o import.c: In function 'rs_import2': import.c:145:27: warning: pointer targets in passing argument 1 of 'raptor_new_uri' differ in signedness [-Wpointer-sign] ruri = raptor_new_uri(uri); ^ In file included from import.c:26:0: /usr/include/raptor.h:1149:13: note: expected 'const unsigned char *' but argument is of type 'char *' raptor_uri* raptor_new_uri(const unsigned char *uri_string); ^ import.c:146:27: warning: pointer targets in passing argument 1 of 'raptor_new_uri' differ in signedness [-Wpointer-sign] muri = raptor_new_uri(model); ^ In file included from import.c:26:0: /usr/include/raptor.h:1149:13: note: expected 'const unsigned char *' but argument is of type 'char *' raptor_uri* raptor_new_uri(const unsigned char *uri_string); ^ import.c: In function 'store_stmt': import.c:208:18: warning: pointer targets in initialization differ in signedness [-Wpointer-sign] char *subj = raptor_uri_as_string((raptor_uri *)statement->subject), ^ import.c:209:11: warning: pointer targets in initialization differ in signedness [-Wpointer-sign] *pred = raptor_uri_as_string((raptor_uri *)statement->predicate), ^ import.c:210:18: warning: pointer targets in initialization differ in signedness [-Wpointer-sign] *obj = raptor_uri_as_string((raptor_uri *)statement->object); ^ import.c:212:2: warning: pointer targets in initialization differ in signedness [-Wpointer-sign] raptor_uri_as_string(statement->object_literal_datatype); ^ libtool: compile: x86_64-pld-linux-gnux32-gcc -DHAVE_CONFIG_H -I. -I../../src -Wall -g -I/usr/include/glib-1.2 -I/usr/libx32/glib/include -I/usr/include/mysql -fPIC -fPIC -DNDEBUG -fabi-version=2 -O2 -fwrapv -pipe -Wformat -Werror=format-security -gdwarf-4 -fno-debug-types-section -fvar-tracking-assignments -g2 -Wp,-D_FORTIFY_SOURCE=2 -fstack-protector-strong --param=ssp-buffer-size=4 -fPIC -mtune=generic -march=x86-64 -gdwarf-4 -fno-debug-types-section -fvar-tracking-assignments -g2 -MT import.lo -MD -MP -MF .deps/import.Tpo -c import.c -o import.o >/dev/null 2>&1 mv -f .deps/import.Tpo .deps/import.Plo make[4]: Leaving directory '/tmp/B.BS_P6O/BUILD/3store-2.2.22/src/rdfsql' make[4]: Entering directory '/tmp/B.BS_P6O/BUILD/3store-2.2.22/src/rdfsql' /bin/sh ../../libtool --tag=CC --mode=compile x86_64-pld-linux-gnux32-gcc -DHAVE_CONFIG_H -I. -I../../src -Wall -g -I/usr/include/glib-1.2 -I/usr/libx32/glib/include -I/usr/include/mysql -fPIC -fPIC -DNDEBUG -fabi-version=2 -O2 -fwrapv -pipe -Wformat -Werror=format-security -gdwarf-4 -fno-debug-types-section -fvar-tracking-assignments -g2 -Wp,-D_FORTIFY_SOURCE=2 -fstack-protector-strong --param=ssp-buffer-size=4 -fPIC -mtune=generic -march=x86-64 -gdwarf-4 -fno-debug-types-section -fvar-tracking-assignments -g2 -MT rdql_parser.lo -MD -MP -MF .deps/rdql_parser.Tpo -c -o rdql_parser.lo rdql_parser.c libtool: compile: x86_64-pld-linux-gnux32-gcc -DHAVE_CONFIG_H -I. -I../../src -Wall -g -I/usr/include/glib-1.2 -I/usr/libx32/glib/include -I/usr/include/mysql -fPIC -fPIC -DNDEBUG -fabi-version=2 -O2 -fwrapv -pipe -Wformat -Werror=format-security -gdwarf-4 -fno-debug-types-section -fvar-tracking-assignments -g2 -Wp,-D_FORTIFY_SOURCE=2 -fstack-protector-strong --param=ssp-buffer-size=4 -fPIC -mtune=generic -march=x86-64 -gdwarf-4 -fno-debug-types-section -fvar-tracking-assignments -g2 -MT rdql_parser.lo -MD -MP -MF .deps/rdql_parser.Tpo -c rdql_parser.c -fPIC -DPIC -o .libs/rdql_parser.o libtool: compile: x86_64-pld-linux-gnux32-gcc -DHAVE_CONFIG_H -I. -I../../src -Wall -g -I/usr/include/glib-1.2 -I/usr/libx32/glib/include -I/usr/include/mysql -fPIC -fPIC -DNDEBUG -fabi-version=2 -O2 -fwrapv -pipe -Wformat -Werror=format-security -gdwarf-4 -fno-debug-types-section -fvar-tracking-assignments -g2 -Wp,-D_FORTIFY_SOURCE=2 -fstack-protector-strong --param=ssp-buffer-size=4 -fPIC -mtune=generic -march=x86-64 -gdwarf-4 -fno-debug-types-section -fvar-tracking-assignments -g2 -MT rdql_parser.lo -MD -MP -MF .deps/rdql_parser.Tpo -c rdql_parser.c -o rdql_parser.o >/dev/null 2>&1 mv -f .deps/rdql_parser.Tpo .deps/rdql_parser.Plo make[4]: Leaving directory '/tmp/B.BS_P6O/BUILD/3store-2.2.22/src/rdfsql' make[4]: Entering directory '/tmp/B.BS_P6O/BUILD/3store-2.2.22/src/rdfsql' /bin/sh ../../libtool --tag=CC --mode=compile x86_64-pld-linux-gnux32-gcc -DHAVE_CONFIG_H -I. -I../../src -Wall -g -I/usr/include/glib-1.2 -I/usr/libx32/glib/include -I/usr/include/mysql -fPIC -fPIC -DNDEBUG -fabi-version=2 -O2 -fwrapv -pipe -Wformat -Werror=format-security -gdwarf-4 -fno-debug-types-section -fvar-tracking-assignments -g2 -Wp,-D_FORTIFY_SOURCE=2 -fstack-protector-strong --param=ssp-buffer-size=4 -fPIC -mtune=generic -march=x86-64 -gdwarf-4 -fno-debug-types-section -fvar-tracking-assignments -g2 -MT md5.lo -MD -MP -MF .deps/md5.Tpo -c -o md5.lo md5.c libtool: compile: x86_64-pld-linux-gnux32-gcc -DHAVE_CONFIG_H -I. -I../../src -Wall -g -I/usr/include/glib-1.2 -I/usr/libx32/glib/include -I/usr/include/mysql -fPIC -fPIC -DNDEBUG -fabi-version=2 -O2 -fwrapv -pipe -Wformat -Werror=format-security -gdwarf-4 -fno-debug-types-section -fvar-tracking-assignments -g2 -Wp,-D_FORTIFY_SOURCE=2 -fstack-protector-strong --param=ssp-buffer-size=4 -fPIC -mtune=generic -march=x86-64 -gdwarf-4 -fno-debug-types-section -fvar-tracking-assignments -g2 -MT md5.lo -MD -MP -MF .deps/md5.Tpo -c md5.c -fPIC -DPIC -o .libs/md5.o libtool: compile: x86_64-pld-linux-gnux32-gcc -DHAVE_CONFIG_H -I. -I../../src -Wall -g -I/usr/include/glib-1.2 -I/usr/libx32/glib/include -I/usr/include/mysql -fPIC -fPIC -DNDEBUG -fabi-version=2 -O2 -fwrapv -pipe -Wformat -Werror=format-security -gdwarf-4 -fno-debug-types-section -fvar-tracking-assignments -g2 -Wp,-D_FORTIFY_SOURCE=2 -fstack-protector-strong --param=ssp-buffer-size=4 -fPIC -mtune=generic -march=x86-64 -gdwarf-4 -fno-debug-types-section -fvar-tracking-assignments -g2 -MT md5.lo -MD -MP -MF .deps/md5.Tpo -c md5.c -o md5.o >/dev/null 2>&1 mv -f .deps/md5.Tpo .deps/md5.Plo make[4]: Leaving directory '/tmp/B.BS_P6O/BUILD/3store-2.2.22/src/rdfsql' make[4]: Entering directory '/tmp/B.BS_P6O/BUILD/3store-2.2.22/src/rdfsql' /bin/sh ../../libtool --tag=CC --mode=compile x86_64-pld-linux-gnux32-gcc -DHAVE_CONFIG_H -I. -I../../src -Wall -g -I/usr/include/glib-1.2 -I/usr/libx32/glib/include -I/usr/include/mysql -fPIC -fPIC -DNDEBUG -fabi-version=2 -O2 -fwrapv -pipe -Wformat -Werror=format-security -gdwarf-4 -fno-debug-types-section -fvar-tracking-assignments -g2 -Wp,-D_FORTIFY_SOURCE=2 -fstack-protector-strong --param=ssp-buffer-size=4 -fPIC -mtune=generic -march=x86-64 -gdwarf-4 -fno-debug-types-section -fvar-tracking-assignments -g2 -MT cache.lo -MD -MP -MF .deps/cache.Tpo -c -o cache.lo cache.c libtool: compile: x86_64-pld-linux-gnux32-gcc -DHAVE_CONFIG_H -I. -I../../src -Wall -g -I/usr/include/glib-1.2 -I/usr/libx32/glib/include -I/usr/include/mysql -fPIC -fPIC -DNDEBUG -fabi-version=2 -O2 -fwrapv -pipe -Wformat -Werror=format-security -gdwarf-4 -fno-debug-types-section -fvar-tracking-assignments -g2 -Wp,-D_FORTIFY_SOURCE=2 -fstack-protector-strong --param=ssp-buffer-size=4 -fPIC -mtune=generic -march=x86-64 -gdwarf-4 -fno-debug-types-section -fvar-tracking-assignments -g2 -MT cache.lo -MD -MP -MF .deps/cache.Tpo -c cache.c -fPIC -DPIC -o .libs/cache.o cache.c: In function 'rebuild_latice_inline': cache.c:166:9: warning: variable 'pass' set but not used [-Wunused-but-set-variable] int pass, count; ^ libtool: compile: x86_64-pld-linux-gnux32-gcc -DHAVE_CONFIG_H -I. -I../../src -Wall -g -I/usr/include/glib-1.2 -I/usr/libx32/glib/include -I/usr/include/mysql -fPIC -fPIC -DNDEBUG -fabi-version=2 -O2 -fwrapv -pipe -Wformat -Werror=format-security -gdwarf-4 -fno-debug-types-section -fvar-tracking-assignments -g2 -Wp,-D_FORTIFY_SOURCE=2 -fstack-protector-strong --param=ssp-buffer-size=4 -fPIC -mtune=generic -march=x86-64 -gdwarf-4 -fno-debug-types-section -fvar-tracking-assignments -g2 -MT cache.lo -MD -MP -MF .deps/cache.Tpo -c cache.c -o cache.o >/dev/null 2>&1 mv -f .deps/cache.Tpo .deps/cache.Plo make[4]: Leaving directory '/tmp/B.BS_P6O/BUILD/3store-2.2.22/src/rdfsql' make[4]: Entering directory '/tmp/B.BS_P6O/BUILD/3store-2.2.22/src/rdfsql' /bin/sh ../../libtool --tag=CC --mode=compile x86_64-pld-linux-gnux32-gcc -DHAVE_CONFIG_H -I. -I../../src -Wall -g -I/usr/include/glib-1.2 -I/usr/libx32/glib/include -I/usr/include/mysql -fPIC -fPIC -DNDEBUG -fabi-version=2 -O2 -fwrapv -pipe -Wformat -Werror=format-security -gdwarf-4 -fno-debug-types-section -fvar-tracking-assignments -g2 -Wp,-D_FORTIFY_SOURCE=2 -fstack-protector-strong --param=ssp-buffer-size=4 -fPIC -mtune=generic -march=x86-64 -gdwarf-4 -fno-debug-types-section -fvar-tracking-assignments -g2 -MT rdql_lex.lo -MD -MP -MF .deps/rdql_lex.Tpo -c -o rdql_lex.lo rdql_lex.c libtool: compile: x86_64-pld-linux-gnux32-gcc -DHAVE_CONFIG_H -I. -I../../src -Wall -g -I/usr/include/glib-1.2 -I/usr/libx32/glib/include -I/usr/include/mysql -fPIC -fPIC -DNDEBUG -fabi-version=2 -O2 -fwrapv -pipe -Wformat -Werror=format-security -gdwarf-4 -fno-debug-types-section -fvar-tracking-assignments -g2 -Wp,-D_FORTIFY_SOURCE=2 -fstack-protector-strong --param=ssp-buffer-size=4 -fPIC -mtune=generic -march=x86-64 -gdwarf-4 -fno-debug-types-section -fvar-tracking-assignments -g2 -MT rdql_lex.lo -MD -MP -MF .deps/rdql_lex.Tpo -c rdql_lex.c -fPIC -DPIC -o .libs/rdql_lex.o libtool: compile: x86_64-pld-linux-gnux32-gcc -DHAVE_CONFIG_H -I. -I../../src -Wall -g -I/usr/include/glib-1.2 -I/usr/libx32/glib/include -I/usr/include/mysql -fPIC -fPIC -DNDEBUG -fabi-version=2 -O2 -fwrapv -pipe -Wformat -Werror=format-security -gdwarf-4 -fno-debug-types-section -fvar-tracking-assignments -g2 -Wp,-D_FORTIFY_SOURCE=2 -fstack-protector-strong --param=ssp-buffer-size=4 -fPIC -mtune=generic -march=x86-64 -gdwarf-4 -fno-debug-types-section -fvar-tracking-assignments -g2 -MT rdql_lex.lo -MD -MP -MF .deps/rdql_lex.Tpo -c rdql_lex.c -o rdql_lex.o >/dev/null 2>&1 mv -f .deps/rdql_lex.Tpo .deps/rdql_lex.Plo make[4]: Leaving directory '/tmp/B.BS_P6O/BUILD/3store-2.2.22/src/rdfsql' make[4]: Entering directory '/tmp/B.BS_P6O/BUILD/3store-2.2.22/src/rdfsql' /bin/sh ../../libtool --tag=CC --mode=compile x86_64-pld-linux-gnux32-gcc -DHAVE_CONFIG_H -I. -I../../src -Wall -g -I/usr/include/glib-1.2 -I/usr/libx32/glib/include -I/usr/include/mysql -fPIC -fPIC -DNDEBUG -fabi-version=2 -O2 -fwrapv -pipe -Wformat -Werror=format-security -gdwarf-4 -fno-debug-types-section -fvar-tracking-assignments -g2 -Wp,-D_FORTIFY_SOURCE=2 -fstack-protector-strong --param=ssp-buffer-size=4 -fPIC -mtune=generic -march=x86-64 -gdwarf-4 -fno-debug-types-section -fvar-tracking-assignments -g2 -MT rdfsql.lo -MD -MP -MF .deps/rdfsql.Tpo -c -o rdfsql.lo rdfsql.c libtool: compile: x86_64-pld-linux-gnux32-gcc -DHAVE_CONFIG_H -I. -I../../src -Wall -g -I/usr/include/glib-1.2 -I/usr/libx32/glib/include -I/usr/include/mysql -fPIC -fPIC -DNDEBUG -fabi-version=2 -O2 -fwrapv -pipe -Wformat -Werror=format-security -gdwarf-4 -fno-debug-types-section -fvar-tracking-assignments -g2 -Wp,-D_FORTIFY_SOURCE=2 -fstack-protector-strong --param=ssp-buffer-size=4 -fPIC -mtune=generic -march=x86-64 -gdwarf-4 -fno-debug-types-section -fvar-tracking-assignments -g2 -MT rdfsql.lo -MD -MP -MF .deps/rdfsql.Tpo -c rdfsql.c -fPIC -DPIC -o .libs/rdfsql.o libtool: compile: x86_64-pld-linux-gnux32-gcc -DHAVE_CONFIG_H -I. -I../../src -Wall -g -I/usr/include/glib-1.2 -I/usr/libx32/glib/include -I/usr/include/mysql -fPIC -fPIC -DNDEBUG -fabi-version=2 -O2 -fwrapv -pipe -Wformat -Werror=format-security -gdwarf-4 -fno-debug-types-section -fvar-tracking-assignments -g2 -Wp,-D_FORTIFY_SOURCE=2 -fstack-protector-strong --param=ssp-buffer-size=4 -fPIC -mtune=generic -march=x86-64 -gdwarf-4 -fno-debug-types-section -fvar-tracking-assignments -g2 -MT rdfsql.lo -MD -MP -MF .deps/rdfsql.Tpo -c rdfsql.c -o rdfsql.o >/dev/null 2>&1 mv -f .deps/rdfsql.Tpo .deps/rdfsql.Plo make[4]: Leaving directory '/tmp/B.BS_P6O/BUILD/3store-2.2.22/src/rdfsql' make[3]: *** [Makefile:547: all-recursive] Error 1 make[2]: *** [Makefile:381: all-recursive] Error 1 make[1]: *** [Makefile:320: all] Error 2 make: *** [Makefile:490: all-recursive] Error 1 error: Bad exit status from /tmp/B.BS_P6O/BUILD/tmp/rpm-tmp.43711 (%build) RPM build errors: Bad exit status from /tmp/B.BS_P6O/BUILD/tmp/rpm-tmp.43711 (%build) ended at: Tue Oct 18 07:55:13 2016, done in 0:00:10.534589 error: No files produced. + chmod -R u+rwX /tmp/B.BS_P6O/BUILD + rm -rf /tmp/B.BS_P6O/tmp /tmp/B.BS_P6O/BUILD + rm -rf /tmp/B.BS_P6O Begin-PLD-Builder-Info Build-Time: user:13.88s sys:1.03s real:16.49s (faults io:0 non-io:567850) End-PLD-Builder-Info
[Back to list of logs] [View rpm -qa of builder]