FailedOk

th/SRPMS[OK]
th/x32[OK]
th/i686[OK]
th/x86_64[OK]

ac/SRPMS[OK]
ac/i386[OK]
ac/i586[OK]
ac/i686[OK]
ac/alpha[OK]
ac/amd64[OK]
ac/athlon[OK]
ac/ppc[OK]
ac/sparc[OK]
ac/sparc64[OK]

Advanced Search
main()
Powered by PLD Linux
(c) 2002-2023 PLD Team
$Revision: 1.37 $
Powered by Real Programmer.
Your IP: 44.212.99.248

3store 3a375d64-2490-42ad-a9e0-f9c75fda4f5c

Status:Failed
Source URL:https://buildlogs.pld-linux.org/pld/th/x32/FAIL/3store,3a375d64-2490-42ad-a9e0-f9c75fda4f5c.bz2
text/plain URL:View!
full text:View!
rpm -qa of builder:View!
Date:2016/10/18 07:55:13
Runtime:0:00:10.534589

Toc:

  • error 1
  • rdql.c:538:2: error: format not a string literal and no format arguments [-Werror=format-security]
  • error 2
  • make[4]: *** [Makefile:522: rdql.lo] Error 1
  • error 3
  • make[3]: *** [Makefile:547: all-recursive] Error 1
  • error 4
  • make[2]: *** [Makefile:381: all-recursive] Error 1
  • error 5
  • make[1]: *** [Makefile:320: all] Error 2
  • error 6
  • error: Bad exit status from /tmp/B.BS_P6O/BUILD/tmp/rpm-tmp.43711 (%build)
  • error 7
  • RPM build errors:
  • error 8
  • error: No files produced.

Content:

checking how to run the C preprocessor... x86_64-pld-linux-gnux32-gcc -E
checking for ANSI C header files... yes
checking for sys/types.h... yes
checking for sys/stat.h... yes
checking for stdlib.h... yes
checking for string.h... yes
checking for memory.h... yes
checking for strings.h... yes
checking for inttypes.h... yes
checking for stdint.h... yes
checking for unistd.h... yes
checking for dlfcn.h... yes
checking for objdir... .libs
checking if x86_64-pld-linux-gnux32-gcc supports -fno-rtti -fno-exceptions... no
checking for x86_64-pld-linux-gnux32-gcc option to produce PIC... -fPIC -DPIC
checking if x86_64-pld-linux-gnux32-gcc PIC flag -fPIC -DPIC works... yes
checking if x86_64-pld-linux-gnux32-gcc static flag -static works... yes
checking if x86_64-pld-linux-gnux32-gcc supports -c -o file.o... yes
checking if x86_64-pld-linux-gnux32-gcc supports -c -o file.o... (cached) yes
checking whether the x86_64-pld-linux-gnux32-gcc linker (/usr/bin/ld -m elf32_x86_64) supports shared libraries... yes
checking whether -lc should be explicitly linked in... no
checking dynamic linker characteristics... GNU/Linux ld.so
checking how to hardcode library paths into programs... immediate
checking whether stripping libraries is possible... yes
checking if libtool supports shared libraries... yes
checking whether to build shared libraries... yes
checking whether to build static libraries... yes
checking for pthread_self in -lpthread... yes
checking for mysql_config... /usr/bin/mysql_config
checking for glib-config... /usr/bin/glib-config
checking for raptor-config... /usr/bin/raptor-config
checking for ANSI C header files... (cached) yes
checking for stdlib.h... (cached) yes
checking for string.h... (cached) yes
checking for unistd.h... (cached) yes
checking for an ANSI C-conforming const... yes
checking for inline... inline
checking whether byte ordering is bigendian... no

Will not build Apache module support

checking that generated files are newer than configure... done
configure: creating ./config.status
config.status: creating 3store.pc
config.status: creating 3store.spec
config.status: creating 3store-config
config.status: creating Makefile
config.status: creating util/Makefile
config.status: creating util/tables.sql
config.status: creating src/Makefile
config.status: creating src/rdfsql/Makefile
config.status: creating src/rdfsql/rdfsql/Makefile
config.status: creating src/libokbc/Makefile
config.status: creating src/tools/Makefile
config.status: creating src/perl/Makefile
config.status: creating src/perl/RDQL.pm
config.status: creating src/http/Makefile
config.status: creating src/config.h
config.status: executing depfiles commands
config.status: executing libtool commands
config.status: executing default commands
+ /usr/bin/make -Otarget -j9
Making all in src
/usr/bin/make  all-recursive
Making all in rdfsql
Making all in rdfsql
make[4]: Nothing to be done for 'all'.
make[4]: Entering directory '/tmp/B.BS_P6O/BUILD/3store-2.2.22/src/rdfsql'
/bin/sh ../../libtool  --tag=CC   --mode=compile x86_64-pld-linux-gnux32-gcc -DHAVE_CONFIG_H -I. -I../../src    -Wall -g -I/usr/include/glib-1.2 -I/usr/libx32/glib/include -I/usr/include/mysql  -fPIC  -fPIC -DNDEBUG -fabi-version=2  -O2 -fwrapv -pipe -Wformat -Werror=format-security -gdwarf-4 -fno-debug-types-section -fvar-tracking-assignments -g2 -Wp,-D_FORTIFY_SOURCE=2 -fstack-protector-strong --param=ssp-buffer-size=4 -fPIC -mtune=generic -march=x86-64 -gdwarf-4 -fno-debug-types-section -fvar-tracking-assignments -g2  -MT rdql_datatypes.lo -MD -MP -MF .deps/rdql_datatypes.Tpo -c -o rdql_datatypes.lo rdql_datatypes.c
libtool: compile:  x86_64-pld-linux-gnux32-gcc -DHAVE_CONFIG_H -I. -I../../src -Wall -g -I/usr/include/glib-1.2 -I/usr/libx32/glib/include -I/usr/include/mysql -fPIC -fPIC -DNDEBUG -fabi-version=2 -O2 -fwrapv -pipe -Wformat -Werror=format-security -gdwarf-4 -fno-debug-types-section -fvar-tracking-assignments -g2 -Wp,-D_FORTIFY_SOURCE=2 -fstack-protector-strong --param=ssp-buffer-size=4 -fPIC -mtune=generic -march=x86-64 -gdwarf-4 -fno-debug-types-section -fvar-tracking-assignments -g2 -MT rdql_datatypes.lo -MD -MP -MF .deps/rdql_datatypes.Tpo -c rdql_datatypes.c  -fPIC -DPIC -o .libs/rdql_datatypes.o
libtool: compile:  x86_64-pld-linux-gnux32-gcc -DHAVE_CONFIG_H -I. -I../../src -Wall -g -I/usr/include/glib-1.2 -I/usr/libx32/glib/include -I/usr/include/mysql -fPIC -fPIC -DNDEBUG -fabi-version=2 -O2 -fwrapv -pipe -Wformat -Werror=format-security -gdwarf-4 -fno-debug-types-section -fvar-tracking-assignments -g2 -Wp,-D_FORTIFY_SOURCE=2 -fstack-protector-strong --param=ssp-buffer-size=4 -fPIC -mtune=generic -march=x86-64 -gdwarf-4 -fno-debug-types-section -fvar-tracking-assignments -g2 -MT rdql_datatypes.lo -MD -MP -MF .deps/rdql_datatypes.Tpo -c rdql_datatypes.c -o rdql_datatypes.o >/dev/null 2>&1
mv -f .deps/rdql_datatypes.Tpo .deps/rdql_datatypes.Plo
make[4]: Leaving directory '/tmp/B.BS_P6O/BUILD/3store-2.2.22/src/rdfsql'
make[4]: Entering directory '/tmp/B.BS_P6O/BUILD/3store-2.2.22/src/rdfsql'
/bin/sh ../../libtool  --tag=CC   --mode=compile x86_64-pld-linux-gnux32-gcc -DHAVE_CONFIG_H -I. -I../../src    -Wall -g -I/usr/include/glib-1.2 -I/usr/libx32/glib/include -I/usr/include/mysql  -fPIC  -fPIC -DNDEBUG -fabi-version=2  -O2 -fwrapv -pipe -Wformat -Werror=format-security -gdwarf-4 -fno-debug-types-section -fvar-tracking-assignments -g2 -Wp,-D_FORTIFY_SOURCE=2 -fstack-protector-strong --param=ssp-buffer-size=4 -fPIC -mtune=generic -march=x86-64 -gdwarf-4 -fno-debug-types-section -fvar-tracking-assignments -g2  -MT rdql.lo -MD -MP -MF .deps/rdql.Tpo -c -o rdql.lo rdql.c
libtool: compile:  x86_64-pld-linux-gnux32-gcc -DHAVE_CONFIG_H -I. -I../../src -Wall -g -I/usr/include/glib-1.2 -I/usr/libx32/glib/include -I/usr/include/mysql -fPIC -fPIC -DNDEBUG -fabi-version=2 -O2 -fwrapv -pipe -Wformat -Werror=format-security -gdwarf-4 -fno-debug-types-section -fvar-tracking-assignments -g2 -Wp,-D_FORTIFY_SOURCE=2 -fstack-protector-strong --param=ssp-buffer-size=4 -fPIC -mtune=generic -march=x86-64 -gdwarf-4 -fno-debug-types-section -fvar-tracking-assignments -g2 -MT rdql.lo -MD -MP -MF .deps/rdql.Tpo -c rdql.c  -fPIC -DPIC -o .libs/rdql.o
rdql.c: In function 'st_free':
rdql.c:25:25: warning: passing argument 1 of 'free' discards 'const' qualifier from pointer target type [-Wdiscarded-qualifiers]
     if (v->column) free(v->column);
                         ^
In file included from rdql.c:2:0:
/usr/include/stdlib.h:444:13: note: expected 'void *' but argument is of type 'const char *'
 extern void free (void *__ptr) __THROW;
             ^
rdql.c:26:29: warning: passing argument 1 of 'free' discards 'const' qualifier from pointer target type [-Wdiscarded-qualifiers]
     if (v->val_column) free(v->val_column);
                             ^
In file included from rdql.c:2:0:
/usr/include/stdlib.h:444:13: note: expected 'void *' but argument is of type 'const char *'
 extern void free (void *__ptr) __THROW;
             ^
rdql.c:27:30: warning: passing argument 1 of 'free' discards 'const' qualifier from pointer target type [-Wdiscarded-qualifiers]
     if (v->hash_column) free(v->hash_column);
                              ^
In file included from rdql.c:2:0:
/usr/include/stdlib.h:444:13: note: expected 'void *' but argument is of type 'const char *'
 extern void free (void *__ptr) __THROW;
             ^
rdql.c: In function 'rs_rdql_query':
rdql.c:538:2: error: format not a string literal and no format arguments [-Werror=format-security]
  fprintf(stderr, res->error_str);
  ^
cc1: some warnings being treated as errors
make[4]: *** [Makefile:522: rdql.lo] Error 1
make[4]: Leaving directory '/tmp/B.BS_P6O/BUILD/3store-2.2.22/src/rdfsql'
make[4]: *** Waiting for unfinished jobs....
make[4]: Entering directory '/tmp/B.BS_P6O/BUILD/3store-2.2.22/src/rdfsql'
/bin/sh ../../libtool  --tag=CC   --mode=compile x86_64-pld-linux-gnux32-gcc -DHAVE_CONFIG_H -I. -I../../src    -Wall -g -I/usr/include/glib-1.2 -I/usr/libx32/glib/include -I/usr/include/mysql  -fPIC  -fPIC -DNDEBUG -fabi-version=2  -O2 -fwrapv -pipe -Wformat -Werror=format-security -gdwarf-4 -fno-debug-types-section -fvar-tracking-assignments -g2 -Wp,-D_FORTIFY_SOURCE=2 -fstack-protector-strong --param=ssp-buffer-size=4 -fPIC -mtune=generic -march=x86-64 -gdwarf-4 -fno-debug-types-section -fvar-tracking-assignments -g2  -MT import.lo -MD -MP -MF .deps/import.Tpo -c -o import.lo import.c
libtool: compile:  x86_64-pld-linux-gnux32-gcc -DHAVE_CONFIG_H -I. -I../../src -Wall -g -I/usr/include/glib-1.2 -I/usr/libx32/glib/include -I/usr/include/mysql -fPIC -fPIC -DNDEBUG -fabi-version=2 -O2 -fwrapv -pipe -Wformat -Werror=format-security -gdwarf-4 -fno-debug-types-section -fvar-tracking-assignments -g2 -Wp,-D_FORTIFY_SOURCE=2 -fstack-protector-strong --param=ssp-buffer-size=4 -fPIC -mtune=generic -march=x86-64 -gdwarf-4 -fno-debug-types-section -fvar-tracking-assignments -g2 -MT import.lo -MD -MP -MF .deps/import.Tpo -c import.c  -fPIC -DPIC -o .libs/import.o
import.c: In function 'rs_import2':
import.c:145:27: warning: pointer targets in passing argument 1 of 'raptor_new_uri' differ in signedness [-Wpointer-sign]
     ruri = raptor_new_uri(uri);
                           ^
In file included from import.c:26:0:
/usr/include/raptor.h:1149:13: note: expected 'const unsigned char *' but argument is of type 'char *'
 raptor_uri* raptor_new_uri(const unsigned char *uri_string);
             ^
import.c:146:27: warning: pointer targets in passing argument 1 of 'raptor_new_uri' differ in signedness [-Wpointer-sign]
     muri = raptor_new_uri(model);
                           ^
In file included from import.c:26:0:
/usr/include/raptor.h:1149:13: note: expected 'const unsigned char *' but argument is of type 'char *'
 raptor_uri* raptor_new_uri(const unsigned char *uri_string);
             ^
import.c: In function 'store_stmt':
import.c:208:18: warning: pointer targets in initialization differ in signedness [-Wpointer-sign]
     char *subj = raptor_uri_as_string((raptor_uri *)statement->subject),
                  ^
import.c:209:11: warning: pointer targets in initialization differ in signedness [-Wpointer-sign]
   *pred = raptor_uri_as_string((raptor_uri *)statement->predicate),
           ^
import.c:210:18: warning: pointer targets in initialization differ in signedness [-Wpointer-sign]
          *obj  = raptor_uri_as_string((raptor_uri *)statement->object);
                  ^
import.c:212:2: warning: pointer targets in initialization differ in signedness [-Wpointer-sign]
  raptor_uri_as_string(statement->object_literal_datatype);
  ^
libtool: compile:  x86_64-pld-linux-gnux32-gcc -DHAVE_CONFIG_H -I. -I../../src -Wall -g -I/usr/include/glib-1.2 -I/usr/libx32/glib/include -I/usr/include/mysql -fPIC -fPIC -DNDEBUG -fabi-version=2 -O2 -fwrapv -pipe -Wformat -Werror=format-security -gdwarf-4 -fno-debug-types-section -fvar-tracking-assignments -g2 -Wp,-D_FORTIFY_SOURCE=2 -fstack-protector-strong --param=ssp-buffer-size=4 -fPIC -mtune=generic -march=x86-64 -gdwarf-4 -fno-debug-types-section -fvar-tracking-assignments -g2 -MT import.lo -MD -MP -MF .deps/import.Tpo -c import.c -o import.o >/dev/null 2>&1
mv -f .deps/import.Tpo .deps/import.Plo
make[4]: Leaving directory '/tmp/B.BS_P6O/BUILD/3store-2.2.22/src/rdfsql'
make[4]: Entering directory '/tmp/B.BS_P6O/BUILD/3store-2.2.22/src/rdfsql'
/bin/sh ../../libtool  --tag=CC   --mode=compile x86_64-pld-linux-gnux32-gcc -DHAVE_CONFIG_H -I. -I../../src    -Wall -g -I/usr/include/glib-1.2 -I/usr/libx32/glib/include -I/usr/include/mysql  -fPIC  -fPIC -DNDEBUG -fabi-version=2  -O2 -fwrapv -pipe -Wformat -Werror=format-security -gdwarf-4 -fno-debug-types-section -fvar-tracking-assignments -g2 -Wp,-D_FORTIFY_SOURCE=2 -fstack-protector-strong --param=ssp-buffer-size=4 -fPIC -mtune=generic -march=x86-64 -gdwarf-4 -fno-debug-types-section -fvar-tracking-assignments -g2  -MT rdql_parser.lo -MD -MP -MF .deps/rdql_parser.Tpo -c -o rdql_parser.lo rdql_parser.c
libtool: compile:  x86_64-pld-linux-gnux32-gcc -DHAVE_CONFIG_H -I. -I../../src -Wall -g -I/usr/include/glib-1.2 -I/usr/libx32/glib/include -I/usr/include/mysql -fPIC -fPIC -DNDEBUG -fabi-version=2 -O2 -fwrapv -pipe -Wformat -Werror=format-security -gdwarf-4 -fno-debug-types-section -fvar-tracking-assignments -g2 -Wp,-D_FORTIFY_SOURCE=2 -fstack-protector-strong --param=ssp-buffer-size=4 -fPIC -mtune=generic -march=x86-64 -gdwarf-4 -fno-debug-types-section -fvar-tracking-assignments -g2 -MT rdql_parser.lo -MD -MP -MF .deps/rdql_parser.Tpo -c rdql_parser.c  -fPIC -DPIC -o .libs/rdql_parser.o
libtool: compile:  x86_64-pld-linux-gnux32-gcc -DHAVE_CONFIG_H -I. -I../../src -Wall -g -I/usr/include/glib-1.2 -I/usr/libx32/glib/include -I/usr/include/mysql -fPIC -fPIC -DNDEBUG -fabi-version=2 -O2 -fwrapv -pipe -Wformat -Werror=format-security -gdwarf-4 -fno-debug-types-section -fvar-tracking-assignments -g2 -Wp,-D_FORTIFY_SOURCE=2 -fstack-protector-strong --param=ssp-buffer-size=4 -fPIC -mtune=generic -march=x86-64 -gdwarf-4 -fno-debug-types-section -fvar-tracking-assignments -g2 -MT rdql_parser.lo -MD -MP -MF .deps/rdql_parser.Tpo -c rdql_parser.c -o rdql_parser.o >/dev/null 2>&1
mv -f .deps/rdql_parser.Tpo .deps/rdql_parser.Plo
make[4]: Leaving directory '/tmp/B.BS_P6O/BUILD/3store-2.2.22/src/rdfsql'
make[4]: Entering directory '/tmp/B.BS_P6O/BUILD/3store-2.2.22/src/rdfsql'
/bin/sh ../../libtool  --tag=CC   --mode=compile x86_64-pld-linux-gnux32-gcc -DHAVE_CONFIG_H -I. -I../../src    -Wall -g -I/usr/include/glib-1.2 -I/usr/libx32/glib/include -I/usr/include/mysql  -fPIC  -fPIC -DNDEBUG -fabi-version=2  -O2 -fwrapv -pipe -Wformat -Werror=format-security -gdwarf-4 -fno-debug-types-section -fvar-tracking-assignments -g2 -Wp,-D_FORTIFY_SOURCE=2 -fstack-protector-strong --param=ssp-buffer-size=4 -fPIC -mtune=generic -march=x86-64 -gdwarf-4 -fno-debug-types-section -fvar-tracking-assignments -g2  -MT md5.lo -MD -MP -MF .deps/md5.Tpo -c -o md5.lo md5.c
libtool: compile:  x86_64-pld-linux-gnux32-gcc -DHAVE_CONFIG_H -I. -I../../src -Wall -g -I/usr/include/glib-1.2 -I/usr/libx32/glib/include -I/usr/include/mysql -fPIC -fPIC -DNDEBUG -fabi-version=2 -O2 -fwrapv -pipe -Wformat -Werror=format-security -gdwarf-4 -fno-debug-types-section -fvar-tracking-assignments -g2 -Wp,-D_FORTIFY_SOURCE=2 -fstack-protector-strong --param=ssp-buffer-size=4 -fPIC -mtune=generic -march=x86-64 -gdwarf-4 -fno-debug-types-section -fvar-tracking-assignments -g2 -MT md5.lo -MD -MP -MF .deps/md5.Tpo -c md5.c  -fPIC -DPIC -o .libs/md5.o
libtool: compile:  x86_64-pld-linux-gnux32-gcc -DHAVE_CONFIG_H -I. -I../../src -Wall -g -I/usr/include/glib-1.2 -I/usr/libx32/glib/include -I/usr/include/mysql -fPIC -fPIC -DNDEBUG -fabi-version=2 -O2 -fwrapv -pipe -Wformat -Werror=format-security -gdwarf-4 -fno-debug-types-section -fvar-tracking-assignments -g2 -Wp,-D_FORTIFY_SOURCE=2 -fstack-protector-strong --param=ssp-buffer-size=4 -fPIC -mtune=generic -march=x86-64 -gdwarf-4 -fno-debug-types-section -fvar-tracking-assignments -g2 -MT md5.lo -MD -MP -MF .deps/md5.Tpo -c md5.c -o md5.o >/dev/null 2>&1
mv -f .deps/md5.Tpo .deps/md5.Plo
make[4]: Leaving directory '/tmp/B.BS_P6O/BUILD/3store-2.2.22/src/rdfsql'
make[4]: Entering directory '/tmp/B.BS_P6O/BUILD/3store-2.2.22/src/rdfsql'
/bin/sh ../../libtool  --tag=CC   --mode=compile x86_64-pld-linux-gnux32-gcc -DHAVE_CONFIG_H -I. -I../../src    -Wall -g -I/usr/include/glib-1.2 -I/usr/libx32/glib/include -I/usr/include/mysql  -fPIC  -fPIC -DNDEBUG -fabi-version=2  -O2 -fwrapv -pipe -Wformat -Werror=format-security -gdwarf-4 -fno-debug-types-section -fvar-tracking-assignments -g2 -Wp,-D_FORTIFY_SOURCE=2 -fstack-protector-strong --param=ssp-buffer-size=4 -fPIC -mtune=generic -march=x86-64 -gdwarf-4 -fno-debug-types-section -fvar-tracking-assignments -g2  -MT cache.lo -MD -MP -MF .deps/cache.Tpo -c -o cache.lo cache.c
libtool: compile:  x86_64-pld-linux-gnux32-gcc -DHAVE_CONFIG_H -I. -I../../src -Wall -g -I/usr/include/glib-1.2 -I/usr/libx32/glib/include -I/usr/include/mysql -fPIC -fPIC -DNDEBUG -fabi-version=2 -O2 -fwrapv -pipe -Wformat -Werror=format-security -gdwarf-4 -fno-debug-types-section -fvar-tracking-assignments -g2 -Wp,-D_FORTIFY_SOURCE=2 -fstack-protector-strong --param=ssp-buffer-size=4 -fPIC -mtune=generic -march=x86-64 -gdwarf-4 -fno-debug-types-section -fvar-tracking-assignments -g2 -MT cache.lo -MD -MP -MF .deps/cache.Tpo -c cache.c  -fPIC -DPIC -o .libs/cache.o
cache.c: In function 'rebuild_latice_inline':
cache.c:166:9: warning: variable 'pass' set but not used [-Wunused-but-set-variable]
     int pass, count;
         ^
libtool: compile:  x86_64-pld-linux-gnux32-gcc -DHAVE_CONFIG_H -I. -I../../src -Wall -g -I/usr/include/glib-1.2 -I/usr/libx32/glib/include -I/usr/include/mysql -fPIC -fPIC -DNDEBUG -fabi-version=2 -O2 -fwrapv -pipe -Wformat -Werror=format-security -gdwarf-4 -fno-debug-types-section -fvar-tracking-assignments -g2 -Wp,-D_FORTIFY_SOURCE=2 -fstack-protector-strong --param=ssp-buffer-size=4 -fPIC -mtune=generic -march=x86-64 -gdwarf-4 -fno-debug-types-section -fvar-tracking-assignments -g2 -MT cache.lo -MD -MP -MF .deps/cache.Tpo -c cache.c -o cache.o >/dev/null 2>&1
mv -f .deps/cache.Tpo .deps/cache.Plo
make[4]: Leaving directory '/tmp/B.BS_P6O/BUILD/3store-2.2.22/src/rdfsql'
make[4]: Entering directory '/tmp/B.BS_P6O/BUILD/3store-2.2.22/src/rdfsql'
/bin/sh ../../libtool  --tag=CC   --mode=compile x86_64-pld-linux-gnux32-gcc -DHAVE_CONFIG_H -I. -I../../src    -Wall -g -I/usr/include/glib-1.2 -I/usr/libx32/glib/include -I/usr/include/mysql  -fPIC  -fPIC -DNDEBUG -fabi-version=2  -O2 -fwrapv -pipe -Wformat -Werror=format-security -gdwarf-4 -fno-debug-types-section -fvar-tracking-assignments -g2 -Wp,-D_FORTIFY_SOURCE=2 -fstack-protector-strong --param=ssp-buffer-size=4 -fPIC -mtune=generic -march=x86-64 -gdwarf-4 -fno-debug-types-section -fvar-tracking-assignments -g2  -MT rdql_lex.lo -MD -MP -MF .deps/rdql_lex.Tpo -c -o rdql_lex.lo rdql_lex.c
libtool: compile:  x86_64-pld-linux-gnux32-gcc -DHAVE_CONFIG_H -I. -I../../src -Wall -g -I/usr/include/glib-1.2 -I/usr/libx32/glib/include -I/usr/include/mysql -fPIC -fPIC -DNDEBUG -fabi-version=2 -O2 -fwrapv -pipe -Wformat -Werror=format-security -gdwarf-4 -fno-debug-types-section -fvar-tracking-assignments -g2 -Wp,-D_FORTIFY_SOURCE=2 -fstack-protector-strong --param=ssp-buffer-size=4 -fPIC -mtune=generic -march=x86-64 -gdwarf-4 -fno-debug-types-section -fvar-tracking-assignments -g2 -MT rdql_lex.lo -MD -MP -MF .deps/rdql_lex.Tpo -c rdql_lex.c  -fPIC -DPIC -o .libs/rdql_lex.o
libtool: compile:  x86_64-pld-linux-gnux32-gcc -DHAVE_CONFIG_H -I. -I../../src -Wall -g -I/usr/include/glib-1.2 -I/usr/libx32/glib/include -I/usr/include/mysql -fPIC -fPIC -DNDEBUG -fabi-version=2 -O2 -fwrapv -pipe -Wformat -Werror=format-security -gdwarf-4 -fno-debug-types-section -fvar-tracking-assignments -g2 -Wp,-D_FORTIFY_SOURCE=2 -fstack-protector-strong --param=ssp-buffer-size=4 -fPIC -mtune=generic -march=x86-64 -gdwarf-4 -fno-debug-types-section -fvar-tracking-assignments -g2 -MT rdql_lex.lo -MD -MP -MF .deps/rdql_lex.Tpo -c rdql_lex.c -o rdql_lex.o >/dev/null 2>&1
mv -f .deps/rdql_lex.Tpo .deps/rdql_lex.Plo
make[4]: Leaving directory '/tmp/B.BS_P6O/BUILD/3store-2.2.22/src/rdfsql'
make[4]: Entering directory '/tmp/B.BS_P6O/BUILD/3store-2.2.22/src/rdfsql'
/bin/sh ../../libtool  --tag=CC   --mode=compile x86_64-pld-linux-gnux32-gcc -DHAVE_CONFIG_H -I. -I../../src    -Wall -g -I/usr/include/glib-1.2 -I/usr/libx32/glib/include -I/usr/include/mysql  -fPIC  -fPIC -DNDEBUG -fabi-version=2  -O2 -fwrapv -pipe -Wformat -Werror=format-security -gdwarf-4 -fno-debug-types-section -fvar-tracking-assignments -g2 -Wp,-D_FORTIFY_SOURCE=2 -fstack-protector-strong --param=ssp-buffer-size=4 -fPIC -mtune=generic -march=x86-64 -gdwarf-4 -fno-debug-types-section -fvar-tracking-assignments -g2  -MT rdfsql.lo -MD -MP -MF .deps/rdfsql.Tpo -c -o rdfsql.lo rdfsql.c
libtool: compile:  x86_64-pld-linux-gnux32-gcc -DHAVE_CONFIG_H -I. -I../../src -Wall -g -I/usr/include/glib-1.2 -I/usr/libx32/glib/include -I/usr/include/mysql -fPIC -fPIC -DNDEBUG -fabi-version=2 -O2 -fwrapv -pipe -Wformat -Werror=format-security -gdwarf-4 -fno-debug-types-section -fvar-tracking-assignments -g2 -Wp,-D_FORTIFY_SOURCE=2 -fstack-protector-strong --param=ssp-buffer-size=4 -fPIC -mtune=generic -march=x86-64 -gdwarf-4 -fno-debug-types-section -fvar-tracking-assignments -g2 -MT rdfsql.lo -MD -MP -MF .deps/rdfsql.Tpo -c rdfsql.c  -fPIC -DPIC -o .libs/rdfsql.o
libtool: compile:  x86_64-pld-linux-gnux32-gcc -DHAVE_CONFIG_H -I. -I../../src -Wall -g -I/usr/include/glib-1.2 -I/usr/libx32/glib/include -I/usr/include/mysql -fPIC -fPIC -DNDEBUG -fabi-version=2 -O2 -fwrapv -pipe -Wformat -Werror=format-security -gdwarf-4 -fno-debug-types-section -fvar-tracking-assignments -g2 -Wp,-D_FORTIFY_SOURCE=2 -fstack-protector-strong --param=ssp-buffer-size=4 -fPIC -mtune=generic -march=x86-64 -gdwarf-4 -fno-debug-types-section -fvar-tracking-assignments -g2 -MT rdfsql.lo -MD -MP -MF .deps/rdfsql.Tpo -c rdfsql.c -o rdfsql.o >/dev/null 2>&1
mv -f .deps/rdfsql.Tpo .deps/rdfsql.Plo
make[4]: Leaving directory '/tmp/B.BS_P6O/BUILD/3store-2.2.22/src/rdfsql'
make[3]: *** [Makefile:547: all-recursive] Error 1
make[2]: *** [Makefile:381: all-recursive] Error 1
make[1]: *** [Makefile:320: all] Error 2
make: *** [Makefile:490: all-recursive] Error 1
error: Bad exit status from /tmp/B.BS_P6O/BUILD/tmp/rpm-tmp.43711 (%build)


RPM build errors:
    Bad exit status from /tmp/B.BS_P6O/BUILD/tmp/rpm-tmp.43711 (%build)
ended at: Tue Oct 18 07:55:13 2016, done in 0:00:10.534589
error: No files produced.
+ chmod -R u+rwX /tmp/B.BS_P6O/BUILD
+ rm -rf /tmp/B.BS_P6O/tmp /tmp/B.BS_P6O/BUILD
+ rm -rf /tmp/B.BS_P6O
Begin-PLD-Builder-Info
Build-Time: user:13.88s sys:1.03s real:16.49s (faults io:0 non-io:567850)

End-PLD-Builder-Info
[Back to list of logs] [View rpm -qa of builder]