FailedOk

th/SRPMS[OK]
th/x32[OK]
th/i686[OK]
th/x86_64[OK]

ac/SRPMS[OK]
ac/i386[OK]
ac/i586[OK]
ac/i686[OK]
ac/alpha[OK]
ac/amd64[OK]
ac/athlon[OK]
ac/ppc[OK]
ac/sparc[OK]
ac/sparc64[OK]

Advanced Search
main()
Powered by PLD Linux
(c) 2002-2023 PLD Team
$Revision: 1.37 $
Powered by Microsoft Windows 2003.
Your IP: 35.172.230.154

AppStream 7777d401-f4da-4e21-8ea3-d0d5795abbc3

Status:Failed
Source URL:https://buildlogs.pld-linux.org/pld/th/x32/FAIL/AppStream,7777d401-f4da-4e21-8ea3-d0d5795abbc3.bz2
text/plain URL:View!
rpm -qa of builder:View!
Date:2015/10/16 18:50:12
Runtime:0:00:22.810266

Toc:

  • prep
  • Executing(%prep): /bin/sh -e /tmp/B.8b41c654-5e80-46cd-9b05-9952cf19df39/BUILD/tmp/rpm-tmp.59898
  • build
  • Executing(%build): /bin/sh -e /tmp/B.8b41c654-5e80-46cd-9b05-9952cf19df39/BUILD/tmp/rpm-tmp.59898
  • error 1
  • /usr/include/xapian/version.h:28:2: error: #error The C++ ABI version of compiler you are using does not match
  • error 2
  • /usr/include/xapian/version.h:29:2: error: #error that of the compiler used to build the library. The versions
  • error 3
  • /usr/include/xapian/version.h:30:2: error: #error must match or your program will not work correctly.
  • error 4
  • /usr/include/xapian/version.h:31:2: error: #error The Xapian library was built with g++ 4.9.2
  • error 5
  • src/CMakeFiles/appstream.dir/build.make:97: recipe for target 'src/CMakeFiles/appstream.dir/xapian/database-read.cpp.o' failed
  • error 6
  • make[2]: *** [src/CMakeFiles/appstream.dir/xapian/database-read.cpp.o] Error 1
  • error 7
  • CMakeFiles/Makefile2:124: recipe for target 'src/CMakeFiles/appstream.dir/all' failed
  • error 8
  • make[1]: *** [src/CMakeFiles/appstream.dir/all] Error 2
  • error 9
  • Makefile:141: recipe for target 'all' failed
  • error 10
  • error: Bad exit status from /tmp/B.8b41c654-5e80-46cd-9b05-9952cf19df39/BUILD/tmp/rpm-tmp.59898 (%build)
  • error 11
  • RPM build errors:
  • error 12
  • error: No files produced.

Content:

request from: qboosh
checking if we should skip the build
started at: Fri Oct 16 18:49:47 2015
fetching https://srcbuilder.pld-linux.org/th//srpms/7777d401-f4da-4e21-8ea3-d0d5795abbc3/AppStream-0.8.5-1.src.rpm
fetched 2118329 bytes, 1527.3 K/s
installing srpm: AppStream-0.8.5-1.src.rpm
+ install -d /tmp/B.8b41c654-5e80-46cd-9b05-9952cf19df39/BUILD /tmp/B.8b41c654-5e80-46cd-9b05-9952cf19df39/RPMS
+ LC_ALL=en_US.UTF-8
+ rpm -qp --changelog AppStream-0.8.5-1.src.rpm
* Fri Oct 16 2015 PLD Linux Team <feedback@pld-linux.org>
- For complete changelog see: http://git.pld-linux.org/?p=packages/AppStream.git;a=log;h=master
* Fri Oct 16 2015 Jakub Bogusz <qboosh@pld-linux.org> 309888e
- updated to 0.8.5 * Fri Sep 11 2015 Jakub Bogusz <qboosh@pld-linux.org> c478a3e
- updated to 0.8.4 - qt4 is no longer supported * Sat Mar 28 2015 Elan Ruusamäe <glen@delfi.ee> e119917
- noarch apidocs * Thu Jan 29 2015 Jakub Bogusz <qboosh@pld-linux.org> 112490e
- updated to 0.8.0; now defaults to qt5 * Sat Jan 17 2015 Jakub Bogusz <qboosh@pld-linux.org> f1db784
- updated to 0.7.6 (note: new soname) * Sun Dec 28 2014 Jan Rękorajski <baggins@pld-linux.org> 6395dea
- updated gettext BR * Sun Dec 21 2014 Jakub Bogusz <qboosh@pld-linux.org> 6778f28
- updated to 0.7.5 * Sat Nov 01 2014 Jakub Bogusz <qboosh@pld-linux.org> 4c88c94
- updated to 0.7.4 - removed obsolete libdir patch - added cmake patch (typo fix) - PackageKit plugin has been dropped upstream (no plugins support in PackageKit 1+) + rpm -Uhv --nodeps --define '_topdir /tmp/B.8b41c654-5e80-46cd-9b05-9952cf19df39' --define '_specdir %{_topdir}' --define '_sourcedir %{_specdir}' --define '_rpmdir %{_topdir}/RPMS' --define '_builddir %{_topdir}/BUILD' AppStream-0.8.5-1.src.rpm Preparing... ################################################## AppStream ################################################## + rm -f AppStream-0.8.5-1.src.rpm + install -m 700 -d /tmp/B.8b41c654-5e80-46cd-9b05-9952cf19df39/BUILD/tmp + TMPDIR=/tmp/B.8b41c654-5e80-46cd-9b05-9952cf19df39/BUILD/tmp + exec nice -n 0 rpmbuild -bp --short-circuit --nodeps --define '_topdir /tmp/B.8b41c654-5e80-46cd-9b05-9952cf19df39' --define '_specdir %{_topdir}' --define '_sourcedir %{_specdir}' --define '_rpmdir %{_topdir}/RPMS' --define '_builddir %{_topdir}/BUILD' --target x32-pld-linux --define 'prep exit 0' /tmp/B.8b41c654-5e80-46cd-9b05-9952cf19df39/AppStream.spec Building target platforms: x32-pld-linux checking BuildConflict-ing packages no BuildConflicts found checking BR rpm: Building target platforms: x32-pld-linux no BR needed building RPM using: set -ex; : build-id: 7777d401-f4da-4e21-8ea3-d0d5795abbc3; TMPDIR=/tmp/B.8b41c654-5e80-46cd-9b05-9952cf19df39/BUILD/tmp exec nice -n 0 rpmbuild -bb --define '_smp_mflags -j9' --define '_make_opts -Otarget' --define '_pld_builder 1' --define '_topdir /tmp/B.8b41c654-5e80-46cd-9b05-9952cf19df39' --define '_specdir %{_topdir}' --define '_sourcedir %{_specdir}' --define '_rpmdir %{_topdir}/RPMS' --define '_builddir %{_topdir}/BUILD' --target x32-pld-linux /tmp/B.8b41c654-5e80-46cd-9b05-9952cf19df39/AppStream.spec + : build-id: 7777d401-f4da-4e21-8ea3-d0d5795abbc3 + TMPDIR=/tmp/B.8b41c654-5e80-46cd-9b05-9952cf19df39/BUILD/tmp + exec nice -n 0 rpmbuild -bb --define '_smp_mflags -j9' --define '_make_opts -Otarget' --define '_pld_builder 1' --define '_topdir /tmp/B.8b41c654-5e80-46cd-9b05-9952cf19df39' --define '_specdir %{_topdir}' --define '_sourcedir %{_specdir}' --define '_rpmdir %{_topdir}/RPMS' --define '_builddir %{_topdir}/BUILD' --target x32-pld-linux /tmp/B.8b41c654-5e80-46cd-9b05-9952cf19df39/AppStream.spec Building target platforms: x32-pld-linux Executing(%prep): /bin/sh -e /tmp/B.8b41c654-5e80-46cd-9b05-9952cf19df39/BUILD/tmp/rpm-tmp.59898 + umask 022 + cd /tmp/B.8b41c654-5e80-46cd-9b05-9952cf19df39/BUILD + cd /tmp/B.8b41c654-5e80-46cd-9b05-9952cf19df39/BUILD + rm -rf AppStream-0.8.5 + /usr/bin/xz -dc /tmp/B.8b41c654-5e80-46cd-9b05-9952cf19df39/AppStream-0.8.5.tar.xz + /bin/tar -xf - + STATUS=0 + '[' 0 -ne 0 ']' + cd AppStream-0.8.5 + /bin/id -u + '[' 1000 '=' 0 ']' + /bin/id -u + '[' 1000 '=' 0 ']' + /bin/chmod -Rf a+rX,u+w,g-w,o-w . + echo 'Patch #0 (AppStream-cmake.patch):' Patch #0 (AppStream-cmake.patch): + '[' -f /tmp/B.8b41c654-5e80-46cd-9b05-9952cf19df39/AppStream-cmake.patch ']' + /bin/cat /tmp/B.8b41c654-5e80-46cd-9b05-9952cf19df39/AppStream-cmake.patch + /usr/bin/patch -s -p1 + exit 0 Executing(%build): /bin/sh -e /tmp/B.8b41c654-5e80-46cd-9b05-9952cf19df39/BUILD/tmp/rpm-tmp.59898 HOME=/home/users/builder PATH=/home/users/builder/GNUstep/Tools:/usr/local/bin:/usr/bin:/bin TMPDIR=/tmp/B.8b41c654-5e80-46cd-9b05-9952cf19df39/BUILD/tmp + umask 022 + cd /tmp/B.8b41c654-5e80-46cd-9b05-9952cf19df39/BUILD + cd AppStream-0.8.5 + install -d build + cd build + CC=x86_64-pld-linux-gnux32-gcc CXX=x86_64-pld-linux-gnux32-g++ CPPFLAGS= /usr/bin/cmake '-DCMAKE_VERBOSE_MAKEFILE=ON' '-DCMAKE_BUILD_TYPE=PLD' '-DCMAKE_INSTALL_BINDIR:PATH=/usr/bin' '-DCMAKE_INSTALL_SBINDIR:PATH=/usr/sbin' '-DCMAKE_INSTALL_LIBEXECDIR:PATH=/usr/libx32' '-DCMAKE_INSTALL_SYSCONFDIR:PATH=/etc' '-DCMAKE_INSTALL_SHAREDSTATEDIRPATH:PATH=/var/lib' '-DCMAKE_INSTALL_LOCALSTATEDIRPATH:PATH=/var' '-DCMAKE_INSTALL_LIBDIR:PATH=/usr/libx32' '-DCMAKE_INSTALL_INCLUDEDIR:PATH=/usr/include' '-DCMAKE_INSTALL_OLDINCLUDEDIR:PATH=/usr/include' '-DCMAKE_INSTALL_DATAROOTDIR:PATH=/usr/share' '-DCMAKE_INSTALL_DATADIR:PATH=/usr/share' '-DCMAKE_INSTALL_INFODIR:PATH=/usr/share/info' '-DCMAKE_INSTALL_LOCALEDIR:PATH=/usr/share/locale' '-DCMAKE_INSTALL_MANDIR:PATH=/usr/share/man' '-DCMAKE_INSTALL_DOCDIR:PATH=/usr/share/doc' '-DCMAKE_INSTALL_PREFIX:PATH=/usr' '-DSYSCONF_INSTALL_DIR:PATH=/etc' '-DCMAKE_CXX_FLAGS_PLD=-O2 -fwrapv -pipe -Wformat -Werror=format-security -gdwarf-4 -fno-debug-types-section -fvar-tracking-assignments -g2 -Wp,-D_FORTIFY_SOURCE=2 -fstack-protector-strong --param=ssp-buffer-size=4 -fPIC -mtune=generic -march=x86-64 -gdwarf-4 -fno-debug-types-section -fvar-tracking-assignments -g2 -DNDEBUG -DQT_NO_DEBUG' '-DCMAKE_C_FLAGS_PLD=-O2 -fwrapv -pipe -Wformat -Werror=format-security -gdwarf-4 -fno-debug-types-section -fvar-tracking-assignments -g2 -Wp,-D_FORTIFY_SOURCE=2 -fstack-protector-strong --param=ssp-buffer-size=4 -fPIC -mtune=generic -march=x86-64 -gdwarf-4 -fno-debug-types-section -fvar-tracking-assignments -g2 -DNDEBUG -DQT_NO_DEBUG' '-DCMAKE_Fortran_FLAGS_PLD=-O2 -fwrapv -pipe -Wformat -Werror=format-security -gdwarf-4 -fno-debug-types-section -fvar-tracking-assignments -g2 -Wp,-D_FORTIFY_SOURCE=2 -fstack-protector-strong --param=ssp-buffer-size=4 -fPIC -mtune=generic -march=x86-64 -gdwarf-4 -fno-debug-types-section -fvar-tracking-assignments -g2 -DNDEBUG -DQT_NO_DEBUG' '-DCMAKE_EXE_LINKER_FLAGS_PLD=-Wl,--as-needed -Wl,--no-copy-dt-needed-entries -Wl,-z,relro -Wl,-z,combreloc ' '-DCMAKE_SHARED_LINKER_FLAGS_PLD=-Wl,--as-needed -Wl,--no-copy-dt-needed-entries -Wl,-z,relro -Wl,-z,combreloc ' '-DCMAKE_MODULE_LINKER_FLAGS_PLD=-Wl,--as-needed -Wl,--no-copy-dt-needed-entries -Wl,-z,relro -Wl,-z,combreloc ' '-DLIB_SUFFIX=x32' '-DBUILD_SHARED_LIBS:BOOL=ON' .. '-DDOCUMENTATION=ON' '-DQT=ON' '-DVAPI=ON' -- The C compiler identification is GNU 5.2.0 -- The CXX compiler identification is GNU 5.2.0 -- Check for working C compiler: /usr/bin/x86_64-pld-linux-gnux32-gcc -- Check for working C compiler: /usr/bin/x86_64-pld-linux-gnux32-gcc -- works -- Detecting C compiler ABI info -- Detecting C compiler ABI info - done -- Detecting C compile features -- Detecting C compile features - done -- Check for working CXX compiler: /usr/bin/x86_64-pld-linux-gnux32-g++ -- Check for working CXX compiler: /usr/bin/x86_64-pld-linux-gnux32-g++ -- works -- Detecting CXX compiler ABI info -- Detecting CXX compiler ABI info - done -- Detecting CXX compile features -- Detecting CXX compile features - done -- Compiling AppStream version 0.8.5 -- Found Gettext: /usr/bin/msgmerge (found version "0.19.6") -- Found PkgConfig: /usr/bin/pkg-config (found version "0.28") -- Found GLIB2: /usr/libx32/libglib-2.0.so (Required is at least version "2.36") -- checking for module 'gio-2.0' -- found gio-2.0, version 2.46.1 -- checking for module 'gobject-introspection-1.0' -- found gobject-introspection-1.0, version 1.46.0 -- Found LibXml2: /usr/libx32/libxml2.so (found version "2.9.2") -- Looking for include file pthread.h -- Looking for include file pthread.h - found -- Looking for pthread_create -- Looking for pthread_create - not found -- Looking for pthread_create in pthreads -- Looking for pthread_create in pthreads - not found -- Looking for pthread_create in pthread -- Looking for pthread_create in pthread - found -- Found Threads: TRUE -- Found PROTOBUF: /usr/libx32/libprotobuf.so -- checking for module 'yaml-0.1' -- found yaml-0.1, version 0.1.6 -- Found GLIB2: /usr/libx32/libglib-2.0.so -- Performing Test COMPILER_HAS_HIDDEN_VISIBILITY -- Performing Test COMPILER_HAS_HIDDEN_VISIBILITY - Success -- Performing Test COMPILER_HAS_HIDDEN_INLINE_VISIBILITY -- Performing Test COMPILER_HAS_HIDDEN_INLINE_VISIBILITY - Success -- Performing Test COMPILER_HAS_DEPRECATED_ATTR -- Performing Test COMPILER_HAS_DEPRECATED_ATTR - Success -- Configuring done -- Generating done CMake Warning: Manually-specified variables were not used by the project: CMAKE_CXX_FLAGS_PLD CMAKE_C_FLAGS_PLD CMAKE_EXE_LINKER_FLAGS_PLD CMAKE_Fortran_FLAGS_PLD CMAKE_INSTALL_LOCALSTATEDIRPATH CMAKE_INSTALL_SHAREDSTATEDIRPATH CMAKE_MODULE_LINKER_FLAGS_PLD CMAKE_SHARED_LINKER_FLAGS_PLD SYSCONF_INSTALL_DIR -- Build files have been written to: /tmp/B.8b41c654-5e80-46cd-9b05-9952cf19df39/BUILD/AppStream-0.8.5/build + /usr/bin/make -Otarget -j9 -j1 /usr/bin/cmake -H/tmp/B.8b41c654-5e80-46cd-9b05-9952cf19df39/BUILD/AppStream-0.8.5 -B/tmp/B.8b41c654-5e80-46cd-9b05-9952cf19df39/BUILD/AppStream-0.8.5/build --check-build-system CMakeFiles/Makefile.cmake 0 /usr/bin/cmake -E cmake_progress_start /tmp/B.8b41c654-5e80-46cd-9b05-9952cf19df39/BUILD/AppStream-0.8.5/build/CMakeFiles /tmp/B.8b41c654-5e80-46cd-9b05-9952cf19df39/BUILD/AppStream-0.8.5/build/CMakeFiles/progress.marks /usr/bin/make -f CMakeFiles/Makefile2 all /usr/bin/make -f src/CMakeFiles/appstream.dir/build.make src/CMakeFiles/appstream.dir/depend make[2]: Entering directory '/tmp/B.8b41c654-5e80-46cd-9b05-9952cf19df39/BUILD/AppStream-0.8.5/build' [ 1%] Running C++ protocol buffer compiler on xapian/asxentries.proto cd /tmp/B.8b41c654-5e80-46cd-9b05-9952cf19df39/BUILD/AppStream-0.8.5/build/src && /usr/bin/protoc --cpp_out /tmp/B.8b41c654-5e80-46cd-9b05-9952cf19df39/BUILD/AppStream-0.8.5/build/src -I /tmp/B.8b41c654-5e80-46cd-9b05-9952cf19df39/BUILD/AppStream-0.8.5/src/xapian /tmp/B.8b41c654-5e80-46cd-9b05-9952cf19df39/BUILD/AppStream-0.8.5/src/xapian/asxentries.proto make[2]: Leaving directory '/tmp/B.8b41c654-5e80-46cd-9b05-9952cf19df39/BUILD/AppStream-0.8.5/build' make[2]: Entering directory '/tmp/B.8b41c654-5e80-46cd-9b05-9952cf19df39/BUILD/AppStream-0.8.5/build' cd /tmp/B.8b41c654-5e80-46cd-9b05-9952cf19df39/BUILD/AppStream-0.8.5/build && /usr/bin/cmake -E cmake_depends "Unix Makefiles" /tmp/B.8b41c654-5e80-46cd-9b05-9952cf19df39/BUILD/AppStream-0.8.5 /tmp/B.8b41c654-5e80-46cd-9b05-9952cf19df39/BUILD/AppStream-0.8.5/src /tmp/B.8b41c654-5e80-46cd-9b05-9952cf19df39/BUILD/AppStream-0.8.5/build /tmp/B.8b41c654-5e80-46cd-9b05-9952cf19df39/BUILD/AppStream-0.8.5/build/src /tmp/B.8b41c654-5e80-46cd-9b05-9952cf19df39/BUILD/AppStream-0.8.5/build/src/CMakeFiles/appstream.dir/DependInfo.cmake --color= Scanning dependencies of target appstream make[2]: Leaving directory '/tmp/B.8b41c654-5e80-46cd-9b05-9952cf19df39/BUILD/AppStream-0.8.5/build' /usr/bin/make -f src/CMakeFiles/appstream.dir/build.make src/CMakeFiles/appstream.dir/build make[2]: Entering directory '/tmp/B.8b41c654-5e80-46cd-9b05-9952cf19df39/BUILD/AppStream-0.8.5/build' [ 2%] Building CXX object src/CMakeFiles/appstream.dir/asxentries.pb.cc.o cd /tmp/B.8b41c654-5e80-46cd-9b05-9952cf19df39/BUILD/AppStream-0.8.5/build/src && /usr/bin/x86_64-pld-linux-gnux32-g++ -DAS_COMPILATION -DDEBIAN_DEP11 -Dappstream_EXPORTS -g -fPIC -I/tmp/B.8b41c654-5e80-46cd-9b05-9952cf19df39/BUILD/AppStream-0.8.5/src/xapian -I/tmp/B.8b41c654-5e80-46cd-9b05-9952cf19df39/BUILD/AppStream-0.8.5/build -I/tmp/B.8b41c654-5e80-46cd-9b05-9952cf19df39/BUILD/AppStream-0.8.5/build/src -I/usr/include/glib-2.0 -I/usr/libx32/glib-2.0/include -I/usr/include/libxml2 -Werror=implicit-function-declaration -std=gnu++11 -o CMakeFiles/appstream.dir/asxentries.pb.cc.o -c /tmp/B.8b41c654-5e80-46cd-9b05-9952cf19df39/BUILD/AppStream-0.8.5/build/src/asxentries.pb.cc make[2]: Leaving directory '/tmp/B.8b41c654-5e80-46cd-9b05-9952cf19df39/BUILD/AppStream-0.8.5/build' make[2]: Entering directory '/tmp/B.8b41c654-5e80-46cd-9b05-9952cf19df39/BUILD/AppStream-0.8.5/build' [ 3%] Building CXX object src/CMakeFiles/appstream.dir/xapian/database-read.cpp.o cd /tmp/B.8b41c654-5e80-46cd-9b05-9952cf19df39/BUILD/AppStream-0.8.5/build/src && /usr/bin/x86_64-pld-linux-gnux32-g++ -DAS_COMPILATION -DDEBIAN_DEP11 -Dappstream_EXPORTS -g -fPIC -I/tmp/B.8b41c654-5e80-46cd-9b05-9952cf19df39/BUILD/AppStream-0.8.5/src/xapian -I/tmp/B.8b41c654-5e80-46cd-9b05-9952cf19df39/BUILD/AppStream-0.8.5/build -I/tmp/B.8b41c654-5e80-46cd-9b05-9952cf19df39/BUILD/AppStream-0.8.5/build/src -I/usr/include/glib-2.0 -I/usr/libx32/glib-2.0/include -I/usr/include/libxml2 -Werror=implicit-function-declaration -std=gnu++11 -o CMakeFiles/appstream.dir/xapian/database-read.cpp.o -c /tmp/B.8b41c654-5e80-46cd-9b05-9952cf19df39/BUILD/AppStream-0.8.5/src/xapian/database-read.cpp In file included from /usr/include/xapian.h:40:0, from /tmp/B.8b41c654-5e80-46cd-9b05-9952cf19df39/BUILD/AppStream-0.8.5/src/xapian/database-read.hpp:27, from /tmp/B.8b41c654-5e80-46cd-9b05-9952cf19df39/BUILD/AppStream-0.8.5/src/xapian/database-read.cpp:22: /usr/include/xapian/version.h:28:2: error: #error The C++ ABI version of compiler you are using does not match #error The C++ ABI version of compiler you are using does not match ^ /usr/include/xapian/version.h:29:2: error: #error that of the compiler used to build the library. The versions #error that of the compiler used to build the library. The versions ^ /usr/include/xapian/version.h:30:2: error: #error must match or your program will not work correctly. #error must match or your program will not work correctly. ^ /usr/include/xapian/version.h:31:2: error: #error The Xapian library was built with g++ 4.9.2 #error The Xapian library was built with g++ 4.9.2 ^ src/CMakeFiles/appstream.dir/build.make:97: recipe for target 'src/CMakeFiles/appstream.dir/xapian/database-read.cpp.o' failed make[2]: *** [src/CMakeFiles/appstream.dir/xapian/database-read.cpp.o] Error 1 make[2]: Leaving directory '/tmp/B.8b41c654-5e80-46cd-9b05-9952cf19df39/BUILD/AppStream-0.8.5/build' CMakeFiles/Makefile2:124: recipe for target 'src/CMakeFiles/appstream.dir/all' failed make[1]: *** [src/CMakeFiles/appstream.dir/all] Error 2 Makefile:141: recipe for target 'all' failed make: *** [all] Error 2 error: Bad exit status from /tmp/B.8b41c654-5e80-46cd-9b05-9952cf19df39/BUILD/tmp/rpm-tmp.59898 (%build) RPM build errors: Bad exit status from /tmp/B.8b41c654-5e80-46cd-9b05-9952cf19df39/BUILD/tmp/rpm-tmp.59898 (%build) ended at: Fri Oct 16 18:50:12 2015, done in 0:00:22.810266 error: No files produced. + chmod -R u+rwX /tmp/B.8b41c654-5e80-46cd-9b05-9952cf19df39/BUILD + rm -rf /tmp/B.8b41c654-5e80-46cd-9b05-9952cf19df39/tmp /tmp/B.8b41c654-5e80-46cd-9b05-9952cf19df39/BUILD + rm -rf /tmp/B.8b41c654-5e80-46cd-9b05-9952cf19df39 Begin-PLD-Builder-Info Build-Time: user:6.17s sys:1.21s real:26.19s (faults io:14 non-io:302301) End-PLD-Builder-Info
[Back to list of logs] [View rpm -qa of builder]