FailedOk

th/SRPMS[OK]
th/x32[OK]
th/i686[OK]
th/x86_64[OK]

ac/SRPMS[OK]
ac/i386[OK]
ac/i586[OK]
ac/i686[OK]
ac/alpha[OK]
ac/amd64[OK]
ac/athlon[OK]
ac/ppc[OK]
ac/sparc[OK]
ac/sparc64[OK]

Advanced Search
main()
Powered by PLD Linux
(c) 2002-2023 PLD Team
$Revision: 1.37 $
Powered by overclock.
Your IP: 3.238.181.138

AppStream 7777d401-f4da-4e21-8ea3-d0d5795abbc3

Status:Failed
Source URL:https://buildlogs.pld-linux.org/pld/th/x32/FAIL/AppStream,7777d401-f4da-4e21-8ea3-d0d5795abbc3.bz2
text/plain URL:View!
full text:View!
rpm -qa of builder:View!
Date:2015/10/16 18:50:12
Runtime:0:00:22.810266

Toc:

  • error 1
  • /usr/include/xapian/version.h:28:2: error: #error The C++ ABI version of compiler you are using does not match
  • error 2
  • /usr/include/xapian/version.h:29:2: error: #error that of the compiler used to build the library. The versions
  • error 3
  • /usr/include/xapian/version.h:30:2: error: #error must match or your program will not work correctly.
  • error 4
  • /usr/include/xapian/version.h:31:2: error: #error The Xapian library was built with g++ 4.9.2
  • error 5
  • src/CMakeFiles/appstream.dir/build.make:97: recipe for target 'src/CMakeFiles/appstream.dir/xapian/database-read.cpp.o' failed
  • error 6
  • make[2]: *** [src/CMakeFiles/appstream.dir/xapian/database-read.cpp.o] Error 1
  • error 7
  • CMakeFiles/Makefile2:124: recipe for target 'src/CMakeFiles/appstream.dir/all' failed
  • error 8
  • make[1]: *** [src/CMakeFiles/appstream.dir/all] Error 2
  • error 9
  • Makefile:141: recipe for target 'all' failed
  • error 10
  • error: Bad exit status from /tmp/B.8b41c654-5e80-46cd-9b05-9952cf19df39/BUILD/tmp/rpm-tmp.59898 (%build)
  • error 11
  • RPM build errors:
  • error 12
  • error: No files produced.

Content:

+ echo 'Patch #0 (AppStream-cmake.patch):'
Patch #0 (AppStream-cmake.patch):
+ '[' -f /tmp/B.8b41c654-5e80-46cd-9b05-9952cf19df39/AppStream-cmake.patch ']'
+ /bin/cat /tmp/B.8b41c654-5e80-46cd-9b05-9952cf19df39/AppStream-cmake.patch
+ /usr/bin/patch -s -p1
+ exit 0
Executing(%build): /bin/sh -e /tmp/B.8b41c654-5e80-46cd-9b05-9952cf19df39/BUILD/tmp/rpm-tmp.59898
HOME=/home/users/builder
PATH=/home/users/builder/GNUstep/Tools:/usr/local/bin:/usr/bin:/bin
TMPDIR=/tmp/B.8b41c654-5e80-46cd-9b05-9952cf19df39/BUILD/tmp
+ umask 022
+ cd /tmp/B.8b41c654-5e80-46cd-9b05-9952cf19df39/BUILD
+ cd AppStream-0.8.5
+ install -d build
+ cd build
+ CC=x86_64-pld-linux-gnux32-gcc CXX=x86_64-pld-linux-gnux32-g++ CPPFLAGS= /usr/bin/cmake '-DCMAKE_VERBOSE_MAKEFILE=ON' '-DCMAKE_BUILD_TYPE=PLD' '-DCMAKE_INSTALL_BINDIR:PATH=/usr/bin' '-DCMAKE_INSTALL_SBINDIR:PATH=/usr/sbin' '-DCMAKE_INSTALL_LIBEXECDIR:PATH=/usr/libx32' '-DCMAKE_INSTALL_SYSCONFDIR:PATH=/etc' '-DCMAKE_INSTALL_SHAREDSTATEDIRPATH:PATH=/var/lib' '-DCMAKE_INSTALL_LOCALSTATEDIRPATH:PATH=/var' '-DCMAKE_INSTALL_LIBDIR:PATH=/usr/libx32' '-DCMAKE_INSTALL_INCLUDEDIR:PATH=/usr/include' '-DCMAKE_INSTALL_OLDINCLUDEDIR:PATH=/usr/include' '-DCMAKE_INSTALL_DATAROOTDIR:PATH=/usr/share' '-DCMAKE_INSTALL_DATADIR:PATH=/usr/share' '-DCMAKE_INSTALL_INFODIR:PATH=/usr/share/info' '-DCMAKE_INSTALL_LOCALEDIR:PATH=/usr/share/locale' '-DCMAKE_INSTALL_MANDIR:PATH=/usr/share/man' '-DCMAKE_INSTALL_DOCDIR:PATH=/usr/share/doc' '-DCMAKE_INSTALL_PREFIX:PATH=/usr' '-DSYSCONF_INSTALL_DIR:PATH=/etc' '-DCMAKE_CXX_FLAGS_PLD=-O2 -fwrapv -pipe -Wformat -Werror=format-security -gdwarf-4 -fno-debug-types-section -fvar-tracking-assignments -g2 -Wp,-D_FORTIFY_SOURCE=2 -fstack-protector-strong --param=ssp-buffer-size=4 -fPIC -mtune=generic -march=x86-64 -gdwarf-4 -fno-debug-types-section -fvar-tracking-assignments -g2  -DNDEBUG -DQT_NO_DEBUG' '-DCMAKE_C_FLAGS_PLD=-O2 -fwrapv -pipe -Wformat -Werror=format-security -gdwarf-4 -fno-debug-types-section -fvar-tracking-assignments -g2 -Wp,-D_FORTIFY_SOURCE=2 -fstack-protector-strong --param=ssp-buffer-size=4 -fPIC -mtune=generic -march=x86-64 -gdwarf-4 -fno-debug-types-section -fvar-tracking-assignments -g2  -DNDEBUG -DQT_NO_DEBUG' '-DCMAKE_Fortran_FLAGS_PLD=-O2 -fwrapv -pipe -Wformat -Werror=format-security -gdwarf-4 -fno-debug-types-section -fvar-tracking-assignments -g2 -Wp,-D_FORTIFY_SOURCE=2 -fstack-protector-strong --param=ssp-buffer-size=4 -fPIC -mtune=generic -march=x86-64 -gdwarf-4 -fno-debug-types-section -fvar-tracking-assignments -g2  -DNDEBUG -DQT_NO_DEBUG' '-DCMAKE_EXE_LINKER_FLAGS_PLD=-Wl,--as-needed -Wl,--no-copy-dt-needed-entries -Wl,-z,relro -Wl,-z,combreloc ' '-DCMAKE_SHARED_LINKER_FLAGS_PLD=-Wl,--as-needed -Wl,--no-copy-dt-needed-entries -Wl,-z,relro -Wl,-z,combreloc ' '-DCMAKE_MODULE_LINKER_FLAGS_PLD=-Wl,--as-needed -Wl,--no-copy-dt-needed-entries -Wl,-z,relro -Wl,-z,combreloc ' '-DLIB_SUFFIX=x32' '-DBUILD_SHARED_LIBS:BOOL=ON' .. '-DDOCUMENTATION=ON' '-DQT=ON' '-DVAPI=ON'
-- The C compiler identification is GNU 5.2.0
-- The CXX compiler identification is GNU 5.2.0
-- Check for working C compiler: /usr/bin/x86_64-pld-linux-gnux32-gcc
-- Check for working C compiler: /usr/bin/x86_64-pld-linux-gnux32-gcc -- works
-- Detecting C compiler ABI info
-- Detecting C compiler ABI info - done
-- Detecting C compile features
-- Detecting C compile features - done
-- Check for working CXX compiler: /usr/bin/x86_64-pld-linux-gnux32-g++
-- Check for working CXX compiler: /usr/bin/x86_64-pld-linux-gnux32-g++ -- works
-- Detecting CXX compiler ABI info
-- Detecting CXX compiler ABI info - done
-- Detecting CXX compile features
-- Detecting CXX compile features - done
-- Compiling AppStream version 0.8.5
-- Found Gettext: /usr/bin/msgmerge (found version "0.19.6") 
-- Found PkgConfig: /usr/bin/pkg-config (found version "0.28") 
-- Found GLIB2: /usr/libx32/libglib-2.0.so (Required is at least version "2.36") 
-- checking for module 'gio-2.0'
--   found gio-2.0, version 2.46.1
-- checking for module 'gobject-introspection-1.0'
--   found gobject-introspection-1.0, version 1.46.0
-- Found LibXml2: /usr/libx32/libxml2.so (found version "2.9.2") 
-- Looking for include file pthread.h
-- Looking for include file pthread.h - found
-- Looking for pthread_create
-- Looking for pthread_create - not found
-- Looking for pthread_create in pthreads
-- Looking for pthread_create in pthreads - not found
-- Looking for pthread_create in pthread
-- Looking for pthread_create in pthread - found
-- Found Threads: TRUE  
-- Found PROTOBUF: /usr/libx32/libprotobuf.so  
-- checking for module 'yaml-0.1'
--   found yaml-0.1, version 0.1.6
-- Found GLIB2: /usr/libx32/libglib-2.0.so  
-- Performing Test COMPILER_HAS_HIDDEN_VISIBILITY
-- Performing Test COMPILER_HAS_HIDDEN_VISIBILITY - Success
-- Performing Test COMPILER_HAS_HIDDEN_INLINE_VISIBILITY
-- Performing Test COMPILER_HAS_HIDDEN_INLINE_VISIBILITY - Success
-- Performing Test COMPILER_HAS_DEPRECATED_ATTR
-- Performing Test COMPILER_HAS_DEPRECATED_ATTR - Success
-- Configuring done
-- Generating done
CMake Warning:
  Manually-specified variables were not used by the project:

    CMAKE_CXX_FLAGS_PLD
    CMAKE_C_FLAGS_PLD
    CMAKE_EXE_LINKER_FLAGS_PLD
    CMAKE_Fortran_FLAGS_PLD
    CMAKE_INSTALL_LOCALSTATEDIRPATH
    CMAKE_INSTALL_SHAREDSTATEDIRPATH
    CMAKE_MODULE_LINKER_FLAGS_PLD
    CMAKE_SHARED_LINKER_FLAGS_PLD
    SYSCONF_INSTALL_DIR


-- Build files have been written to: /tmp/B.8b41c654-5e80-46cd-9b05-9952cf19df39/BUILD/AppStream-0.8.5/build
+ /usr/bin/make -Otarget -j9 -j1
/usr/bin/cmake -H/tmp/B.8b41c654-5e80-46cd-9b05-9952cf19df39/BUILD/AppStream-0.8.5 -B/tmp/B.8b41c654-5e80-46cd-9b05-9952cf19df39/BUILD/AppStream-0.8.5/build --check-build-system CMakeFiles/Makefile.cmake 0
/usr/bin/cmake -E cmake_progress_start /tmp/B.8b41c654-5e80-46cd-9b05-9952cf19df39/BUILD/AppStream-0.8.5/build/CMakeFiles /tmp/B.8b41c654-5e80-46cd-9b05-9952cf19df39/BUILD/AppStream-0.8.5/build/CMakeFiles/progress.marks
/usr/bin/make -f CMakeFiles/Makefile2 all
/usr/bin/make -f src/CMakeFiles/appstream.dir/build.make src/CMakeFiles/appstream.dir/depend
make[2]: Entering directory '/tmp/B.8b41c654-5e80-46cd-9b05-9952cf19df39/BUILD/AppStream-0.8.5/build'
[  1%] Running C++ protocol buffer compiler on xapian/asxentries.proto
cd /tmp/B.8b41c654-5e80-46cd-9b05-9952cf19df39/BUILD/AppStream-0.8.5/build/src && /usr/bin/protoc --cpp_out /tmp/B.8b41c654-5e80-46cd-9b05-9952cf19df39/BUILD/AppStream-0.8.5/build/src -I /tmp/B.8b41c654-5e80-46cd-9b05-9952cf19df39/BUILD/AppStream-0.8.5/src/xapian /tmp/B.8b41c654-5e80-46cd-9b05-9952cf19df39/BUILD/AppStream-0.8.5/src/xapian/asxentries.proto
make[2]: Leaving directory '/tmp/B.8b41c654-5e80-46cd-9b05-9952cf19df39/BUILD/AppStream-0.8.5/build'
make[2]: Entering directory '/tmp/B.8b41c654-5e80-46cd-9b05-9952cf19df39/BUILD/AppStream-0.8.5/build'
cd /tmp/B.8b41c654-5e80-46cd-9b05-9952cf19df39/BUILD/AppStream-0.8.5/build && /usr/bin/cmake -E cmake_depends "Unix Makefiles" /tmp/B.8b41c654-5e80-46cd-9b05-9952cf19df39/BUILD/AppStream-0.8.5 /tmp/B.8b41c654-5e80-46cd-9b05-9952cf19df39/BUILD/AppStream-0.8.5/src /tmp/B.8b41c654-5e80-46cd-9b05-9952cf19df39/BUILD/AppStream-0.8.5/build /tmp/B.8b41c654-5e80-46cd-9b05-9952cf19df39/BUILD/AppStream-0.8.5/build/src /tmp/B.8b41c654-5e80-46cd-9b05-9952cf19df39/BUILD/AppStream-0.8.5/build/src/CMakeFiles/appstream.dir/DependInfo.cmake --color=
Scanning dependencies of target appstream
make[2]: Leaving directory '/tmp/B.8b41c654-5e80-46cd-9b05-9952cf19df39/BUILD/AppStream-0.8.5/build'
/usr/bin/make -f src/CMakeFiles/appstream.dir/build.make src/CMakeFiles/appstream.dir/build
make[2]: Entering directory '/tmp/B.8b41c654-5e80-46cd-9b05-9952cf19df39/BUILD/AppStream-0.8.5/build'
[  2%] Building CXX object src/CMakeFiles/appstream.dir/asxentries.pb.cc.o
cd /tmp/B.8b41c654-5e80-46cd-9b05-9952cf19df39/BUILD/AppStream-0.8.5/build/src && /usr/bin/x86_64-pld-linux-gnux32-g++   -DAS_COMPILATION -DDEBIAN_DEP11 -Dappstream_EXPORTS -g -fPIC -I/tmp/B.8b41c654-5e80-46cd-9b05-9952cf19df39/BUILD/AppStream-0.8.5/src/xapian -I/tmp/B.8b41c654-5e80-46cd-9b05-9952cf19df39/BUILD/AppStream-0.8.5/build -I/tmp/B.8b41c654-5e80-46cd-9b05-9952cf19df39/BUILD/AppStream-0.8.5/build/src -I/usr/include/glib-2.0 -I/usr/libx32/glib-2.0/include -I/usr/include/libxml2    -Werror=implicit-function-declaration -std=gnu++11 -o CMakeFiles/appstream.dir/asxentries.pb.cc.o -c /tmp/B.8b41c654-5e80-46cd-9b05-9952cf19df39/BUILD/AppStream-0.8.5/build/src/asxentries.pb.cc
make[2]: Leaving directory '/tmp/B.8b41c654-5e80-46cd-9b05-9952cf19df39/BUILD/AppStream-0.8.5/build'
make[2]: Entering directory '/tmp/B.8b41c654-5e80-46cd-9b05-9952cf19df39/BUILD/AppStream-0.8.5/build'
[  3%] Building CXX object src/CMakeFiles/appstream.dir/xapian/database-read.cpp.o
cd /tmp/B.8b41c654-5e80-46cd-9b05-9952cf19df39/BUILD/AppStream-0.8.5/build/src && /usr/bin/x86_64-pld-linux-gnux32-g++   -DAS_COMPILATION -DDEBIAN_DEP11 -Dappstream_EXPORTS -g -fPIC -I/tmp/B.8b41c654-5e80-46cd-9b05-9952cf19df39/BUILD/AppStream-0.8.5/src/xapian -I/tmp/B.8b41c654-5e80-46cd-9b05-9952cf19df39/BUILD/AppStream-0.8.5/build -I/tmp/B.8b41c654-5e80-46cd-9b05-9952cf19df39/BUILD/AppStream-0.8.5/build/src -I/usr/include/glib-2.0 -I/usr/libx32/glib-2.0/include -I/usr/include/libxml2    -Werror=implicit-function-declaration -std=gnu++11 -o CMakeFiles/appstream.dir/xapian/database-read.cpp.o -c /tmp/B.8b41c654-5e80-46cd-9b05-9952cf19df39/BUILD/AppStream-0.8.5/src/xapian/database-read.cpp
In file included from /usr/include/xapian.h:40:0,
                 from /tmp/B.8b41c654-5e80-46cd-9b05-9952cf19df39/BUILD/AppStream-0.8.5/src/xapian/database-read.hpp:27,
                 from /tmp/B.8b41c654-5e80-46cd-9b05-9952cf19df39/BUILD/AppStream-0.8.5/src/xapian/database-read.cpp:22:
/usr/include/xapian/version.h:28:2: error: #error The C++ ABI version of compiler you are using does not match
 #error The C++ ABI version of compiler you are using does not match
  ^
/usr/include/xapian/version.h:29:2: error: #error that of the compiler used to build the library. The versions
 #error that of the compiler used to build the library. The versions
  ^
/usr/include/xapian/version.h:30:2: error: #error must match or your program will not work correctly.
 #error must match or your program will not work correctly.
  ^
/usr/include/xapian/version.h:31:2: error: #error The Xapian library was built with g++ 4.9.2
 #error The Xapian library was built with g++ 4.9.2
  ^
src/CMakeFiles/appstream.dir/build.make:97: recipe for target 'src/CMakeFiles/appstream.dir/xapian/database-read.cpp.o' failed
make[2]: *** [src/CMakeFiles/appstream.dir/xapian/database-read.cpp.o] Error 1
make[2]: Leaving directory '/tmp/B.8b41c654-5e80-46cd-9b05-9952cf19df39/BUILD/AppStream-0.8.5/build'
CMakeFiles/Makefile2:124: recipe for target 'src/CMakeFiles/appstream.dir/all' failed
make[1]: *** [src/CMakeFiles/appstream.dir/all] Error 2
Makefile:141: recipe for target 'all' failed
make: *** [all] Error 2
error: Bad exit status from /tmp/B.8b41c654-5e80-46cd-9b05-9952cf19df39/BUILD/tmp/rpm-tmp.59898 (%build)


RPM build errors:
    Bad exit status from /tmp/B.8b41c654-5e80-46cd-9b05-9952cf19df39/BUILD/tmp/rpm-tmp.59898 (%build)
ended at: Fri Oct 16 18:50:12 2015, done in 0:00:22.810266
error: No files produced.
+ chmod -R u+rwX /tmp/B.8b41c654-5e80-46cd-9b05-9952cf19df39/BUILD
+ rm -rf /tmp/B.8b41c654-5e80-46cd-9b05-9952cf19df39/tmp /tmp/B.8b41c654-5e80-46cd-9b05-9952cf19df39/BUILD
+ rm -rf /tmp/B.8b41c654-5e80-46cd-9b05-9952cf19df39
Begin-PLD-Builder-Info
Build-Time: user:6.17s sys:1.21s real:26.19s (faults io:14 non-io:302301)

End-PLD-Builder-Info
[Back to list of logs] [View rpm -qa of builder]