FailedOk

th/SRPMS[OK]
th/x32[OK]
th/i686[OK]
th/x86_64[OK]

ac/SRPMS[OK]
ac/i386[OK]
ac/i586[OK]
ac/i686[OK]
ac/alpha[OK]
ac/amd64[OK]
ac/athlon[OK]
ac/ppc[OK]
ac/sparc[OK]
ac/sparc64[OK]

Advanced Search
main()
Powered by PLD Linux
(c) 2002-2023 PLD Team
$Revision: 1.37 $
Powered by sqlite3.
Your IP: 3.235.186.94

CCOLAMD b3cebeef-6fcb-4692-a630-7b8265be1eaa

Status:Failed
Source URL:https://buildlogs.pld-linux.org/pld/th/x32/FAIL/CCOLAMD,b3cebeef-6fcb-4692-a630-7b8265be1eaa.bz2
text/plain URL:View!
rpm -qa of builder:View!
Date:2015/02/28 20:28:48
Runtime:0:00:04.867592

Toc:

  • prep
  • Executing(%prep): /bin/sh -e /tmp/B.091e7074-74bf-4031-b384-b1e8eb635c12/BUILD/tmp/rpm-tmp.50455
  • build
  • Executing(%build): /bin/sh -e /tmp/B.091e7074-74bf-4031-b384-b1e8eb635c12/BUILD/tmp/rpm-tmp.50455
  • error 1
  • collect2: error: ld returned 1 exit status
  • error 2
  • Makefile:18: recipe for target 'libccolamd.la' failed
  • error 3
  • make[1]: *** [libccolamd.la] Error 1
  • error 4
  • Makefile:15: recipe for target 'all' failed
  • error 5
  • error: Bad exit status from /tmp/B.091e7074-74bf-4031-b384-b1e8eb635c12/BUILD/tmp/rpm-tmp.50455 (%build)
  • error 6
  • RPM build errors:
  • error 7
  • error: No files produced.

Content:

request from: baggins
checking if we should skip the build
started at: Sat Feb 28 20:28:41 2015
fetching https://srcbuilder.pld-linux.org/th//srpms/b3cebeef-6fcb-4692-a630-7b8265be1eaa/CCOLAMD-2.9.0-1.src.rpm
fetched 74260 bytes, 362.6 K/s
installing srpm: CCOLAMD-2.9.0-1.src.rpm
+ install -d /tmp/B.091e7074-74bf-4031-b384-b1e8eb635c12/BUILD /tmp/B.091e7074-74bf-4031-b384-b1e8eb635c12/RPMS
+ LC_ALL=en_US.UTF-8
+ rpm -qp --changelog CCOLAMD-2.9.0-1.src.rpm
* Sat Feb 28 2015 PLD Linux Team <feedback@pld-linux.org>
- For complete changelog see: http://git.pld-linux.org/?p=packages/CCOLAMD.git;a=log;h=master
* Thu Oct 02 2014 Jakub Bogusz <qboosh@pld-linux.org> 979439c
- updated to 2.9.0 - updated ufconfig,shared patches + rpm -Uhv --nodeps --define '_topdir /tmp/B.091e7074-74bf-4031-b384-b1e8eb635c12' --define '_specdir %{_topdir}' --define '_sourcedir %{_specdir}' --define '_rpmdir %{_topdir}/RPMS' --define '_builddir %{_topdir}/BUILD' CCOLAMD-2.9.0-1.src.rpm Preparing... ################################################## CCOLAMD ################################################## + rm -f CCOLAMD-2.9.0-1.src.rpm + install -m 700 -d /tmp/B.091e7074-74bf-4031-b384-b1e8eb635c12/BUILD/tmp + TMPDIR=/tmp/B.091e7074-74bf-4031-b384-b1e8eb635c12/BUILD/tmp + exec nice -n 0 rpmbuild -bp --short-circuit --nodeps --define '_topdir /tmp/B.091e7074-74bf-4031-b384-b1e8eb635c12' --define '_specdir %{_topdir}' --define '_sourcedir %{_specdir}' --define '_rpmdir %{_topdir}/RPMS' --define '_builddir %{_topdir}/BUILD' --target x32-pld-linux --define 'prep exit 0' /tmp/B.091e7074-74bf-4031-b384-b1e8eb635c12/CCOLAMD.spec Building target platforms: x32-pld-linux checking BuildConflict-ing packages no BuildConflicts found checking BR rpm: Building target platforms: x32-pld-linux no BR needed building RPM using: set -ex; : build-id: b3cebeef-6fcb-4692-a630-7b8265be1eaa; TMPDIR=/tmp/B.091e7074-74bf-4031-b384-b1e8eb635c12/BUILD/tmp exec nice -n 0 rpmbuild -bb --define '_smp_mflags -j9' --define '_make_opts -Otarget' --define '_pld_builder 1' --define '_topdir /tmp/B.091e7074-74bf-4031-b384-b1e8eb635c12' --define '_specdir %{_topdir}' --define '_sourcedir %{_specdir}' --define '_rpmdir %{_topdir}/RPMS' --define '_builddir %{_topdir}/BUILD' --target x32-pld-linux /tmp/B.091e7074-74bf-4031-b384-b1e8eb635c12/CCOLAMD.spec + : build-id: b3cebeef-6fcb-4692-a630-7b8265be1eaa + TMPDIR=/tmp/B.091e7074-74bf-4031-b384-b1e8eb635c12/BUILD/tmp + exec nice -n 0 rpmbuild -bb --define '_smp_mflags -j9' --define '_make_opts -Otarget' --define '_pld_builder 1' --define '_topdir /tmp/B.091e7074-74bf-4031-b384-b1e8eb635c12' --define '_specdir %{_topdir}' --define '_sourcedir %{_specdir}' --define '_rpmdir %{_topdir}/RPMS' --define '_builddir %{_topdir}/BUILD' --target x32-pld-linux /tmp/B.091e7074-74bf-4031-b384-b1e8eb635c12/CCOLAMD.spec Building target platforms: x32-pld-linux Executing(%prep): /bin/sh -e /tmp/B.091e7074-74bf-4031-b384-b1e8eb635c12/BUILD/tmp/rpm-tmp.50455 + umask 022 + cd /tmp/B.091e7074-74bf-4031-b384-b1e8eb635c12/BUILD + cd /tmp/B.091e7074-74bf-4031-b384-b1e8eb635c12/BUILD + rm -rf CCOLAMD + /usr/bin/gzip -dc /tmp/B.091e7074-74bf-4031-b384-b1e8eb635c12/CCOLAMD-2.9.0.tar.gz + /bin/tar -xf - + STATUS=0 + '[' 0 -ne 0 ']' + cd CCOLAMD + /bin/id -u + '[' 1000 '=' 0 ']' + /bin/id -u + '[' 1000 '=' 0 ']' + /bin/chmod -Rf a+rX,u+w,g-w,o-w . + echo 'Patch #0 (ccolamd-ufconfig.patch):' Patch #0 (ccolamd-ufconfig.patch): + '[' -f /tmp/B.091e7074-74bf-4031-b384-b1e8eb635c12/ccolamd-ufconfig.patch ']' + /bin/cat /tmp/B.091e7074-74bf-4031-b384-b1e8eb635c12/ccolamd-ufconfig.patch + /usr/bin/patch -s -p1 + echo 'Patch #1 (ccolamd-shared.patch):' Patch #1 (ccolamd-shared.patch): + '[' -f /tmp/B.091e7074-74bf-4031-b384-b1e8eb635c12/ccolamd-shared.patch ']' + /bin/cat /tmp/B.091e7074-74bf-4031-b384-b1e8eb635c12/ccolamd-shared.patch + /usr/bin/patch -s -p1 + exit 0 Executing(%build): /bin/sh -e /tmp/B.091e7074-74bf-4031-b384-b1e8eb635c12/BUILD/tmp/rpm-tmp.50455 HOME=/home/users/builder PATH=/usr/local/bin:/usr/bin:/bin TMPDIR=/tmp/B.091e7074-74bf-4031-b384-b1e8eb635c12/BUILD/tmp + umask 022 + cd /tmp/B.091e7074-74bf-4031-b384-b1e8eb635c12/BUILD + cd CCOLAMD + /usr/bin/make -Otarget -j9 'CC=x86_64-pld-linux-gnux32-gcc' 'CFLAGS=-O2 -fwrapv -pipe -Wformat -Werror=format-security -gdwarf-4 -fno-debug-types-section -fvar-tracking-assignments -g2 -Wp,-D_FORTIFY_SOURCE=2 -fstack-protector --param=ssp-buffer-size=4 -fPIC -mtune=generic -march=x86-64 -gdwarf-4 -fno-debug-types-section -fvar-tracking-assignments -g2 ' 'LDFLAGS=-Wl,--as-needed -Wl,--no-copy-dt-needed-entries -Wl,-z,relro -Wl,-z,combreloc ' 'libdir=/usr/libx32' ( cd Lib ; /usr/bin/make ) make[1]: Entering directory '/tmp/B.091e7074-74bf-4031-b384-b1e8eb635c12/BUILD/CCOLAMD/Lib' libtool --tag=CC --mode=compile x86_64-pld-linux-gnux32-gcc -O2 -fwrapv -pipe -Wformat -Werror=format-security -gdwarf-4 -fno-debug-types-section -fvar-tracking-assignments -g2 -Wp,-D_FORTIFY_SOURCE=2 -fstack-protector --param=ssp-buffer-size=4 -fPIC -mtune=generic -march=x86-64 -gdwarf-4 -fno-debug-types-section -fvar-tracking-assignments -g2 -fPIC -I../Include -c ../Source/ccolamd.c libtool: compile: x86_64-pld-linux-gnux32-gcc -O2 -fwrapv -pipe -Wformat -Werror=format-security -gdwarf-4 -fno-debug-types-section -fvar-tracking-assignments -g2 -Wp,-D_FORTIFY_SOURCE=2 -fstack-protector --param=ssp-buffer-size=4 -fPIC -mtune=generic -march=x86-64 -gdwarf-4 -fno-debug-types-section -fvar-tracking-assignments -g2 -fPIC -I../Include -c ../Source/ccolamd.c -fPIC -DPIC -o .libs/ccolamd.o libtool: compile: x86_64-pld-linux-gnux32-gcc -O2 -fwrapv -pipe -Wformat -Werror=format-security -gdwarf-4 -fno-debug-types-section -fvar-tracking-assignments -g2 -Wp,-D_FORTIFY_SOURCE=2 -fstack-protector --param=ssp-buffer-size=4 -fPIC -mtune=generic -march=x86-64 -gdwarf-4 -fno-debug-types-section -fvar-tracking-assignments -g2 -fPIC -I../Include -c ../Source/ccolamd.c -o ccolamd.o >/dev/null 2>&1 libtool --tag=CC --mode=compile x86_64-pld-linux-gnux32-gcc -O2 -fwrapv -pipe -Wformat -Werror=format-security -gdwarf-4 -fno-debug-types-section -fvar-tracking-assignments -g2 -Wp,-D_FORTIFY_SOURCE=2 -fstack-protector --param=ssp-buffer-size=4 -fPIC -mtune=generic -march=x86-64 -gdwarf-4 -fno-debug-types-section -fvar-tracking-assignments -g2 -fPIC -I../Include -c ../Source/ccolamd.c -DDLONG -o ccolamd_l.o libtool: compile: x86_64-pld-linux-gnux32-gcc -O2 -fwrapv -pipe -Wformat -Werror=format-security -gdwarf-4 -fno-debug-types-section -fvar-tracking-assignments -g2 -Wp,-D_FORTIFY_SOURCE=2 -fstack-protector --param=ssp-buffer-size=4 -fPIC -mtune=generic -march=x86-64 -gdwarf-4 -fno-debug-types-section -fvar-tracking-assignments -g2 -fPIC -I../Include -c ../Source/ccolamd.c -DDLONG -fPIC -DPIC -o .libs/ccolamd_l.o libtool: compile: x86_64-pld-linux-gnux32-gcc -O2 -fwrapv -pipe -Wformat -Werror=format-security -gdwarf-4 -fno-debug-types-section -fvar-tracking-assignments -g2 -Wp,-D_FORTIFY_SOURCE=2 -fstack-protector --param=ssp-buffer-size=4 -fPIC -mtune=generic -march=x86-64 -gdwarf-4 -fno-debug-types-section -fvar-tracking-assignments -g2 -fPIC -I../Include -c ../Source/ccolamd.c -DDLONG -o ccolamd_l.o >/dev/null 2>&1 libtool --tag=CC --mode=link x86_64-pld-linux-gnux32-gcc -Wl,--as-needed -Wl,--no-copy-dt-needed-entries -Wl,-z,relro -Wl,-z,combreloc -O2 -fwrapv -pipe -Wformat -Werror=format-security -gdwarf-4 -fno-debug-types-section -fvar-tracking-assignments -g2 -Wp,-D_FORTIFY_SOURCE=2 -fstack-protector --param=ssp-buffer-size=4 -fPIC -mtune=generic -march=x86-64 -gdwarf-4 -fno-debug-types-section -fvar-tracking-assignments -g2 -o libccolamd.la -rpath /usr/libx32 ccolamd.lo ccolamd_l.lo -lsuitesparseconfig -lm libtool: link: x86_64-pld-linux-gnux32-gcc -shared -fPIC -DPIC -Wl,--as-needed -Wl,--no-copy-dt-needed-entries -Wl,-z -Wl,relro -Wl,-z -Wl,combreloc -O2 -gdwarf-4 -g2 -fstack-protector -mtune=generic -march=x86-64 -gdwarf-4 -g2 .libs/ccolamd.o .libs/ccolamd_l.o -lsuitesparseconfig -lm -Wl,-soname -Wl,libccolamd.so.0 -o .libs/libccolamd.so.0.0.0 /usr/bin/ld: cannot find -lsuitesparseconfig collect2: error: ld returned 1 exit status Makefile:18: recipe for target 'libccolamd.la' failed make[1]: *** [libccolamd.la] Error 1 make[1]: Leaving directory '/tmp/B.091e7074-74bf-4031-b384-b1e8eb635c12/BUILD/CCOLAMD/Lib' Makefile:15: recipe for target 'all' failed make: *** [all] Error 2 error: Bad exit status from /tmp/B.091e7074-74bf-4031-b384-b1e8eb635c12/BUILD/tmp/rpm-tmp.50455 (%build) RPM build errors: Bad exit status from /tmp/B.091e7074-74bf-4031-b384-b1e8eb635c12/BUILD/tmp/rpm-tmp.50455 (%build) ended at: Sat Feb 28 20:28:48 2015, done in 0:00:04.867592 error: No files produced. + chmod -R u+rwX /tmp/B.091e7074-74bf-4031-b384-b1e8eb635c12/BUILD + rm -rf /tmp/B.091e7074-74bf-4031-b384-b1e8eb635c12/tmp /tmp/B.091e7074-74bf-4031-b384-b1e8eb635c12/BUILD + rm -rf /tmp/B.091e7074-74bf-4031-b384-b1e8eb635c12 Begin-PLD-Builder-Info Build-Time: user:5.88s sys:0.23s real:6.84s (faults io:0 non-io:144246) End-PLD-Builder-Info
[Back to list of logs] [View rpm -qa of builder]