FailedOk

th/SRPMS[OK]
th/x32[OK]
th/i686[OK]
th/x86_64[OK]

ac/SRPMS[OK]
ac/i386[OK]
ac/i586[OK]
ac/i686[OK]
ac/alpha[OK]
ac/amd64[OK]
ac/athlon[OK]
ac/ppc[OK]
ac/sparc[OK]
ac/sparc64[OK]

Advanced Search
main()
Powered by PLD Linux
(c) 2002-2024 PLD Team
$Revision: 1.37 $
Powered by Real Operating System.
Your IP: 44.211.31.134

asymptote 8c1a49d0-aadb-4bcb-a723-e947b619c42c

Status:Failed
Source URL:https://buildlogs.pld-linux.org/pld/th/x32/FAIL/asymptote,8c1a49d0-aadb-4bcb-a723-e947b619c42c.bz2
text/plain URL:View!
rpm -qa of builder:View!
Date:2024/06/11 09:55:03
Runtime:0:00:25.331273

Toc:

  • prep
  • Executing(%prep): /bin/sh -e /tmp/B.ycuf6fjf/BUILD/tmp/rpm-tmp.8b2uWK
  • build
  • Executing(%build): /bin/sh -e /tmp/B.ycuf6fjf/BUILD/tmp/rpm-tmp.6ptPvk
  • error 1
  • /usr/include/GL/osmesa.h:125:1: error: expected initializer before 'OSMesaCreateContext'
  • error 2
  • /usr/include/GL/osmesa.h:138:1: error: expected initializer before 'OSMesaCreateContextExt'
  • error 3
  • /usr/include/GL/osmesa.h:167:1: error: expected initializer before 'OSMesaCreateContextAttribs'
  • error 4
  • /usr/include/GL/osmesa.h:177:1: error: expected initializer before 'OSMesaDestroyContext'
  • error 5
  • /usr/include/GL/osmesa.h:209:1: error: expected initializer before 'OSMesaMakeCurrent'
  • error 6
  • /usr/include/GL/osmesa.h:219:1: error: expected initializer before 'OSMesaGetCurrentContext'
  • error 7
  • /usr/include/GL/osmesa.h:237:1: error: expected initializer before 'OSMesaPixelStore'
  • error 8
  • /usr/include/GL/osmesa.h:253:1: error: expected initializer before 'OSMesaGetIntegerv'
  • error 9
  • /usr/include/GL/osmesa.h:268:1: error: expected initializer before 'OSMesaGetDepthBuffer'
  • error 10
  • /usr/include/GL/osmesa.h:284:1: error: expected initializer before 'OSMesaGetColorBuffer'
  • error 11
  • /usr/include/GL/osmesa.h:301:1: error: expected initializer before 'OSMesaGetProcAddress'
  • error 12
  • /usr/include/GL/osmesa.h:310:1: error: expected initializer before 'OSMesaColorClamp'
  • error 13
  • /usr/include/GL/osmesa.h:323:1: error: expected initializer before 'OSMesaPostprocess'
  • error 14
  • /usr/include/GL/osmesa.h:125:1: error: expected initializer before 'OSMesaCreateContext'
  • error 15
  • /usr/include/GL/osmesa.h:138:1: error: expected initializer before 'OSMesaCreateContextExt'
  • error 16
  • /usr/include/GL/osmesa.h:167:1: error: expected initializer before 'OSMesaCreateContextAttribs'
  • error 17
  • /usr/include/GL/osmesa.h:177:1: error: expected initializer before 'OSMesaDestroyContext'
  • error 18
  • /usr/include/GL/osmesa.h:209:1: error: expected initializer before 'OSMesaMakeCurrent'
  • error 19
  • /usr/include/GL/osmesa.h:219:1: error: expected initializer before 'OSMesaGetCurrentContext'
  • error 20
  • /usr/include/GL/osmesa.h:237:1: error: expected initializer before 'OSMesaPixelStore'
  • error 21
  • /usr/include/GL/osmesa.h:253:1: error: expected initializer before 'OSMesaGetIntegerv'
  • error 22
  • /usr/include/GL/osmesa.h:268:1: error: expected initializer before 'OSMesaGetDepthBuffer'
  • error 23
  • /usr/include/GL/osmesa.h:284:1: error: expected initializer before 'OSMesaGetColorBuffer'
  • error 24
  • /usr/include/GL/osmesa.h:301:1: error: expected initializer before 'OSMesaGetProcAddress'
  • error 25
  • /usr/include/GL/osmesa.h:310:1: error: expected initializer before 'OSMesaColorClamp'
  • error 26
  • /usr/include/GL/osmesa.h:323:1: error: expected initializer before 'OSMesaPostprocess'
  • error 27
  • /usr/include/GL/osmesa.h:125:1: error: expected initializer before 'OSMesaCreateContext'
  • error 28
  • /usr/include/GL/osmesa.h:138:1: error: expected initializer before 'OSMesaCreateContextExt'
  • error 29
  • /usr/include/GL/osmesa.h:167:1: error: expected initializer before 'OSMesaCreateContextAttribs'
  • error 30
  • /usr/include/GL/osmesa.h:177:1: error: expected initializer before 'OSMesaDestroyContext'
  • error 31
  • /usr/include/GL/osmesa.h:209:1: error: expected initializer before 'OSMesaMakeCurrent'
  • error 32
  • /usr/include/GL/osmesa.h:219:1: error: expected initializer before 'OSMesaGetCurrentContext'
  • error 33
  • /usr/include/GL/osmesa.h:237:1: error: expected initializer before 'OSMesaPixelStore'
  • error 34
  • /usr/include/GL/osmesa.h:253:1: error: expected initializer before 'OSMesaGetIntegerv'
  • error 35
  • /usr/include/GL/osmesa.h:268:1: error: expected initializer before 'OSMesaGetDepthBuffer'
  • error 36
  • /usr/include/GL/osmesa.h:284:1: error: expected initializer before 'OSMesaGetColorBuffer'
  • error 37
  • /usr/include/GL/osmesa.h:301:1: error: expected initializer before 'OSMesaGetProcAddress'
  • error 38
  • /usr/include/GL/osmesa.h:310:1: error: expected initializer before 'OSMesaColorClamp'
  • error 39
  • /usr/include/GL/osmesa.h:323:1: error: expected initializer before 'OSMesaPostprocess'
  • error 40
  • /usr/include/GL/osmesa.h:125:1: error: expected initializer before 'OSMesaCreateContext'
  • error 41
  • /usr/include/GL/osmesa.h:138:1: error: expected initializer before 'OSMesaCreateContextExt'
  • error 42
  • /usr/include/GL/osmesa.h:167:1: error: expected initializer before 'OSMesaCreateContextAttribs'
  • error 43
  • /usr/include/GL/osmesa.h:177:1: error: expected initializer before 'OSMesaDestroyContext'
  • error 44
  • /usr/include/GL/osmesa.h:209:1: error: expected initializer before 'OSMesaMakeCurrent'
  • error 45
  • /usr/include/GL/osmesa.h:219:1: error: expected initializer before 'OSMesaGetCurrentContext'
  • error 46
  • /usr/include/GL/osmesa.h:237:1: error: expected initializer before 'OSMesaPixelStore'
  • error 47
  • /usr/include/GL/osmesa.h:253:1: error: expected initializer before 'OSMesaGetIntegerv'
  • error 48
  • /usr/include/GL/osmesa.h:268:1: error: expected initializer before 'OSMesaGetDepthBuffer'
  • error 49
  • /usr/include/GL/osmesa.h:284:1: error: expected initializer before 'OSMesaGetColorBuffer'
  • error 50
  • /usr/include/GL/osmesa.h:301:1: error: expected initializer before 'OSMesaGetProcAddress'
  • error 51
  • /usr/include/GL/osmesa.h:310:1: error: expected initializer before 'OSMesaColorClamp'
  • error 52
  • /usr/include/GL/osmesa.h:323:1: error: expected initializer before 'OSMesaPostprocess'
  • error 53
  • /usr/include/GL/osmesa.h:125:1: error: expected initializer before 'OSMesaCreateContext'
  • error 54
  • /usr/include/GL/osmesa.h:138:1: error: expected initializer before 'OSMesaCreateContextExt'
  • error 55
  • /usr/include/GL/osmesa.h:167:1: error: expected initializer before 'OSMesaCreateContextAttribs'
  • error 56
  • /usr/include/GL/osmesa.h:177:1: error: expected initializer before 'OSMesaDestroyContext'
  • error 57
  • /usr/include/GL/osmesa.h:209:1: error: expected initializer before 'OSMesaMakeCurrent'
  • error 58
  • /usr/include/GL/osmesa.h:219:1: error: expected initializer before 'OSMesaGetCurrentContext'
  • error 59
  • /usr/include/GL/osmesa.h:237:1: error: expected initializer before 'OSMesaPixelStore'
  • error 60
  • /usr/include/GL/osmesa.h:253:1: error: expected initializer before 'OSMesaGetIntegerv'
  • error 61
  • /usr/include/GL/osmesa.h:268:1: error: expected initializer before 'OSMesaGetDepthBuffer'
  • error 62
  • /usr/include/GL/osmesa.h:284:1: error: expected initializer before 'OSMesaGetColorBuffer'
  • error 63
  • /usr/include/GL/osmesa.h:301:1: error: expected initializer before 'OSMesaGetProcAddress'
  • error 64
  • /usr/include/GL/osmesa.h:310:1: error: expected initializer before 'OSMesaColorClamp'
  • error 65
  • /usr/include/GL/osmesa.h:323:1: error: expected initializer before 'OSMesaPostprocess'
  • error 66
  • /usr/include/GL/osmesa.h:125:1: error: expected initializer before 'OSMesaCreateContext'
  • error 67
  • /usr/include/GL/osmesa.h:138:1: error: expected initializer before 'OSMesaCreateContextExt'
  • error 68
  • /usr/include/GL/osmesa.h:167:1: error: expected initializer before 'OSMesaCreateContextAttribs'
  • error 69
  • /usr/include/GL/osmesa.h:177:1: error: expected initializer before 'OSMesaDestroyContext'
  • error 70
  • /usr/include/GL/osmesa.h:209:1: error: expected initializer before 'OSMesaMakeCurrent'
  • error 71
  • /usr/include/GL/osmesa.h:219:1: error: expected initializer before 'OSMesaGetCurrentContext'
  • error 72
  • /usr/include/GL/osmesa.h:237:1: error: expected initializer before 'OSMesaPixelStore'
  • error 73
  • /usr/include/GL/osmesa.h:253:1: error: expected initializer before 'OSMesaGetIntegerv'
  • error 74
  • /usr/include/GL/osmesa.h:268:1: error: expected initializer before 'OSMesaGetDepthBuffer'
  • error 75
  • /usr/include/GL/osmesa.h:284:1: error: expected initializer before 'OSMesaGetColorBuffer'
  • error 76
  • /usr/include/GL/osmesa.h:301:1: error: expected initializer before 'OSMesaGetProcAddress'
  • error 77
  • /usr/include/GL/osmesa.h:310:1: error: expected initializer before 'OSMesaColorClamp'
  • error 78
  • /usr/include/GL/osmesa.h:323:1: error: expected initializer before 'OSMesaPostprocess'
  • error 79
  • /usr/include/GL/osmesa.h:125:1: error: expected initializer before 'OSMesaCreateContext'
  • error 80
  • /usr/include/GL/osmesa.h:138:1: error: expected initializer before 'OSMesaCreateContextExt'
  • error 81
  • /usr/include/GL/osmesa.h:167:1: error: expected initializer before 'OSMesaCreateContextAttribs'
  • error 82
  • /usr/include/GL/osmesa.h:177:1: error: expected initializer before 'OSMesaDestroyContext'
  • error 83
  • /usr/include/GL/osmesa.h:209:1: error: expected initializer before 'OSMesaMakeCurrent'
  • error 84
  • /usr/include/GL/osmesa.h:219:1: error: expected initializer before 'OSMesaGetCurrentContext'
  • error 85
  • /usr/include/GL/osmesa.h:237:1: error: expected initializer before 'OSMesaPixelStore'
  • error 86
  • /usr/include/GL/osmesa.h:253:1: error: expected initializer before 'OSMesaGetIntegerv'
  • error 87
  • /usr/include/GL/osmesa.h:268:1: error: expected initializer before 'OSMesaGetDepthBuffer'
  • error 88
  • /usr/include/GL/osmesa.h:284:1: error: expected initializer before 'OSMesaGetColorBuffer'
  • error 89
  • /usr/include/GL/osmesa.h:301:1: error: expected initializer before 'OSMesaGetProcAddress'
  • error 90
  • /usr/include/GL/osmesa.h:310:1: error: expected initializer before 'OSMesaColorClamp'
  • error 91
  • /usr/include/GL/osmesa.h:323:1: error: expected initializer before 'OSMesaPostprocess'
  • error 92
  • /usr/include/GL/osmesa.h:125:1: error: expected initializer before 'OSMesaCreateContext'
  • error 93
  • /usr/include/GL/osmesa.h:138:1: error: expected initializer before 'OSMesaCreateContextExt'
  • error 94
  • /usr/include/GL/osmesa.h:167:1: error: expected initializer before 'OSMesaCreateContextAttribs'
  • error 95
  • /usr/include/GL/osmesa.h:177:1: error: expected initializer before 'OSMesaDestroyContext'
  • error 96
  • /usr/include/GL/osmesa.h:209:1: error: expected initializer before 'OSMesaMakeCurrent'
  • error 97
  • /usr/include/GL/osmesa.h:219:1: error: expected initializer before 'OSMesaGetCurrentContext'
  • error 98
  • /usr/include/GL/osmesa.h:237:1: error: expected initializer before 'OSMesaPixelStore'
  • error 99
  • /usr/include/GL/osmesa.h:253:1: error: expected initializer before 'OSMesaGetIntegerv'
  • error 100
  • /usr/include/GL/osmesa.h:268:1: error: expected initializer before 'OSMesaGetDepthBuffer'
  • error 101
  • /usr/include/GL/osmesa.h:284:1: error: expected initializer before 'OSMesaGetColorBuffer'
  • error 102
  • /usr/include/GL/osmesa.h:301:1: error: expected initializer before 'OSMesaGetProcAddress'
  • error 103
  • /usr/include/GL/osmesa.h:310:1: error: expected initializer before 'OSMesaColorClamp'
  • error 104
  • /usr/include/GL/osmesa.h:323:1: error: expected initializer before 'OSMesaPostprocess'
  • error 105
  • /usr/include/GL/osmesa.h:125:1: error: expected initializer before 'OSMesaCreateContext'
  • error 106
  • /usr/include/GL/osmesa.h:138:1: error: expected initializer before 'OSMesaCreateContextExt'
  • error 107
  • /usr/include/GL/osmesa.h:167:1: error: expected initializer before 'OSMesaCreateContextAttribs'
  • error 108
  • /usr/include/GL/osmesa.h:177:1: error: expected initializer before 'OSMesaDestroyContext'
  • error 109
  • /usr/include/GL/osmesa.h:209:1: error: expected initializer before 'OSMesaMakeCurrent'
  • error 110
  • /usr/include/GL/osmesa.h:219:1: error: expected initializer before 'OSMesaGetCurrentContext'
  • error 111
  • /usr/include/GL/osmesa.h:237:1: error: expected initializer before 'OSMesaPixelStore'
  • error 112
  • /usr/include/GL/osmesa.h:253:1: error: expected initializer before 'OSMesaGetIntegerv'
  • error 113
  • /usr/include/GL/osmesa.h:268:1: error: expected initializer before 'OSMesaGetDepthBuffer'
  • error 114
  • /usr/include/GL/osmesa.h:284:1: error: expected initializer before 'OSMesaGetColorBuffer'
  • error 115
  • /usr/include/GL/osmesa.h:301:1: error: expected initializer before 'OSMesaGetProcAddress'
  • error 116
  • /usr/include/GL/osmesa.h:310:1: error: expected initializer before 'OSMesaColorClamp'
  • error 117
  • /usr/include/GL/osmesa.h:323:1: error: expected initializer before 'OSMesaPostprocess'
  • error 118
  • /usr/include/GL/osmesa.h:125:1: error: expected initializer before 'OSMesaCreateContext'
  • error 119
  • /usr/include/GL/osmesa.h:138:1: error: expected initializer before 'OSMesaCreateContextExt'
  • error 120
  • /usr/include/GL/osmesa.h:167:1: error: expected initializer before 'OSMesaCreateContextAttribs'
  • error 121
  • /usr/include/GL/osmesa.h:177:1: error: expected initializer before 'OSMesaDestroyContext'
  • error 122
  • /usr/include/GL/osmesa.h:209:1: error: expected initializer before 'OSMesaMakeCurrent'
  • error 123
  • /usr/include/GL/osmesa.h:219:1: error: expected initializer before 'OSMesaGetCurrentContext'
  • error 124
  • /usr/include/GL/osmesa.h:237:1: error: expected initializer before 'OSMesaPixelStore'
  • error 125
  • /usr/include/GL/osmesa.h:253:1: error: expected initializer before 'OSMesaGetIntegerv'
  • error 126
  • /usr/include/GL/osmesa.h:268:1: error: expected initializer before 'OSMesaGetDepthBuffer'
  • error 127
  • /usr/include/GL/osmesa.h:284:1: error: expected initializer before 'OSMesaGetColorBuffer'
  • error 128
  • /usr/include/GL/osmesa.h:301:1: error: expected initializer before 'OSMesaGetProcAddress'
  • error 129
  • /usr/include/GL/osmesa.h:310:1: error: expected initializer before 'OSMesaColorClamp'
  • error 130
  • /usr/include/GL/osmesa.h:323:1: error: expected initializer before 'OSMesaPostprocess'
  • error 131
  • error: Bad exit status from /tmp/B.ycuf6fjf/BUILD/tmp/rpm-tmp.6ptPvk (%build)
  • error 132
  • RPM build errors:
  • error 133
  • error: No files produced.

Content:

request from: baggins
checking if we should skip the build
started at: Tue Jun 11 09:54:35 2024
killing old processes on a builder
sending signal 9 to pid -1
cleaning up /tmp
fetching https://srcbuilder.pld-linux.org/th//srpms/8c1a49d0-aadb-4bcb-a723-e947b619c42c/asymptote-2.70-1.src.rpm
fetched 4676563 bytes, 8995.2 K/s
installing srpm: asymptote-2.70-1.src.rpm
+ install -d /tmp/B.ycuf6fjf/BUILD /tmp/B.ycuf6fjf/RPMS
+ LC_ALL=en_US.UTF-8
+ rpm -qp --changelog asymptote-2.70-1.src.rpm
* Tue Jun 11 2024 PLD Linux Team <feedback@pld-linux.org>
- For complete changelog see: http://git.pld-linux.org/?p=packages/asymptote.git;a=log;h=master
* Thu May 30 2024 Jakub Bogusz <qboosh@pld-linux.org> b68d878
- updated GLM dependency * Fri Dec 03 2021 Jan Rękorajski <baggins@pld-linux.org> 0c37749
- up to 2.70 * Thu Dec 26 2019 Jakub Bogusz <qboosh@pld-linux.org> 4d13f96
- removed outdated todo * Mon Dec 23 2019 Jakub Bogusz <qboosh@pld-linux.org> 13b8bb6
- despite requirements.txt entry, rsvg-convert is utility from librsvg, not python module * Mon Dec 23 2019 Jakub Bogusz <qboosh@pld-linux.org> d31a944
- updated to 2.61 - added no-env patch (don't place unnecessary shebang in xasyVersion.py) - updated python dependencies in -gui - with fixed libOSMesa docs should build on all archs (supported by Mesa) - enabled OpenImageIO by default * Mon Nov 04 2019 Jan Rękorajski <baggins@pld-linux.org> 6020b85
- release 4 (by relup.sh) * Mon Nov 04 2019 Jan Rękorajski <baggins@pld-linux.org> 73d1211
- add doc bcond * Sun Nov 03 2019 Jan Rękorajski <baggins@pld-linux.org> 7296557
- release 3 (by relup.sh) * Tue Oct 29 2019 Jakub Bogusz <qboosh@pld-linux.org> c83c549
- added info patch (unify direntry) - release 2 (rebuild with gsl 2.6) * Sun Oct 20 2019 Jan Rękorajski <baggins@pld-linux.org> 7586670
- up to 2.59 * Thu Oct 17 2019 Arkadiusz Miśkiewicz <arekm@maven.pl> f0d71ab
- release 2 (by relup.sh) * Sun Jun 25 2017 Jakub Bogusz <qboosh@pld-linux.org> bc62224
- updated to 2.41 - removed obsolete gsl2 patch * Tue Oct 18 2016 Jan Rękorajski <baggins@pld-linux.org> 40f3f24
- rebuild with readline 7.0 - release 5 (by relup.sh) * Sun Dec 27 2015 Jan Rękorajski <baggins@pld-linux.org> 6a8a337
- fix building with gsl 2.x - rel 4 * Fri Dec 25 2015 Jan Rękorajski <baggins@pld-linux.org> a9cdcb7
- release 3 (by relup.sh) * Thu Dec 24 2015 Jan Rękorajski <baggins@pld-linux.org> c054827
- release 2 (by relup.sh) * Thu Aug 06 2015 Jan Rękorajski <baggins@pld-linux.org> 097ab2b
- up to 2.35 * Sun Mar 22 2015 Elan Ruusamäe <glen@delfi.ee> c854ad4
- missing fix-info-dir * Sun Jul 07 2013 Artur Frysiak <artur@frysiak.net> 9425d43
- Up to 2.23 * Thu May 31 2012 Zsolt Udvari <uzsolt@pld-linux.org> acab572
- 2.16 + rpm -Uhv --nodeps --define '_topdir /tmp/B.ycuf6fjf' --define '_specdir %{_topdir}' --define '_sourcedir %{_specdir}' --define '_rpmdir %{_topdir}/RPMS' --define '_builddir %{_topdir}/BUILD' asymptote-2.70-1.src.rpm Updating / installing... asymptote-2.70-1 ######################################## + rm -f asymptote-2.70-1.src.rpm + install -m 700 -d /tmp/B.ycuf6fjf/BUILD/tmp + TMPDIR=/tmp/B.ycuf6fjf/BUILD/tmp + exec nice -n 0 rpmbuild -bp --short-circuit --nodeps --define '_topdir /tmp/B.ycuf6fjf' --define '_specdir %{_topdir}' --define '_sourcedir %{_specdir}' --define '_rpmdir %{_topdir}/RPMS' --define '_builddir %{_topdir}/BUILD' --target x32-pld-linux --define 'prep exit 0' /tmp/B.ycuf6fjf/asymptote.spec Building target platforms: x32-pld-linux Building for target x32-pld-linux checking BuildConflict-ing packages rpm: Building target platforms: x32-pld-linux rpm: Building for target x32-pld-linux no BuildConflicts found checking BR rpm: Building target platforms: x32-pld-linux rpm: Building for target x32-pld-linux no BR needed building RPM using: set -ex; : build-id: 8c1a49d0-aadb-4bcb-a723-e947b619c42c; TMPDIR=/tmp/B.ycuf6fjf/BUILD/tmp exec nice -n 0 rpmbuild -bb --define '__jobs 28' --define '_smp_mflags -j28' --define '_make_opts -Otarget' --define '_pld_builder 1' --define '_topdir /tmp/B.ycuf6fjf' --define '_specdir %{_topdir}' --define '_sourcedir %{_specdir}' --define '_rpmdir %{_topdir}/RPMS' --define '_builddir %{_topdir}/BUILD' --target x32-pld-linux /tmp/B.ycuf6fjf/asymptote.spec + : build-id: 8c1a49d0-aadb-4bcb-a723-e947b619c42c + TMPDIR=/tmp/B.ycuf6fjf/BUILD/tmp + exec nice -n 0 rpmbuild -bb --define '__jobs 28' --define '_smp_mflags -j28' --define '_make_opts -Otarget' --define '_pld_builder 1' --define '_topdir /tmp/B.ycuf6fjf' --define '_specdir %{_topdir}' --define '_sourcedir %{_specdir}' --define '_rpmdir %{_topdir}/RPMS' --define '_builddir %{_topdir}/BUILD' --target x32-pld-linux /tmp/B.ycuf6fjf/asymptote.spec Building target platforms: x32-pld-linux Building for target x32-pld-linux Executing(%prep): /bin/sh -e /tmp/B.ycuf6fjf/BUILD/tmp/rpm-tmp.8b2uWK + umask 022 + cd /tmp/B.ycuf6fjf/BUILD + cd /tmp/B.ycuf6fjf/BUILD + rm -rf asymptote-2.70 + /bin/gzip -dc /tmp/B.ycuf6fjf/asymptote-2.70.src.tgz + /bin/tar -xof - + STATUS=0 + '[' 0 -ne 0 ']' + cd asymptote-2.70 + /bin/chmod -Rf a+rX,u+w,g-w,o-w . + echo 'Patch #0 (asymptote-memrchr.patch):' Patch #0 (asymptote-memrchr.patch): + </tmp/B.ycuf6fjf/asymptote-memrchr.patch + /usr/bin/patch -s -f -p1 '--fuzz=0' + echo 'Patch #1 (asymptote-info.patch):' Patch #1 (asymptote-info.patch): + </tmp/B.ycuf6fjf/asymptote-info.patch + /usr/bin/patch -s -f -p1 '--fuzz=0' + echo 'Patch #2 (asymptote-no-env.patch):' Patch #2 (asymptote-no-env.patch): + </tmp/B.ycuf6fjf/asymptote-no-env.patch + /usr/bin/patch -s -f -p1 '--fuzz=0' + echo 'Patch #3 (texinfo.patch):' Patch #3 (texinfo.patch): + </tmp/B.ycuf6fjf/texinfo.patch + /usr/bin/patch -s -f -p1 '--fuzz=0' + /bin/sed -i -e '1s,/usr/bin/env python3,/usr/bin/python3,' GUI/xasy.py + /bin/sed -i -e 1d GUI/configs/__init__.py GUI/CustMatTransform.py GUI/DebugFlags.py GUI/GuidesManager.py GUI/InplaceAddObj.py GUI/PrimitiveShape.py GUI/SetCustomAnchor.py GUI/Widg_addLabel.py GUI/Widg_addPolyOpt.py GUI/Widg_editBezier.py GUI/Window1.py GUI/__init__.py GUI/labelEditor.py GUI/xasy2asy.py GUI/xasyArgs.py GUI/xasyBezierInterface.py GUI/xasyFile.py GUI/xasyOptions.py GUI/xasyStrings.py GUI/xasySvg.py GUI/xasyTransform.py GUI/xasyUtils.py GUI/xasyValidator.py + /bin/sed -i -e 1d GUI/UndoRedoStack.py base/asymptote.py + RPM_EC=0 + jobs -p + exit 0 Executing(%build): /bin/sh -e /tmp/B.ycuf6fjf/BUILD/tmp/rpm-tmp.6ptPvk HOME=/home/users/builder PATH=/home/users/builder/GNUstep/Tools:/bin:/usr/bin:/usr/local/bin TMPDIR=/tmp/B.ycuf6fjf/BUILD/tmp + umask 022 + cd /tmp/B.ycuf6fjf/BUILD + cd asymptote-2.70 + autoconf configure.ac:102: warning: AC_PROG_LEX without either yywrap or noyywrap is obsolete ./lib/autoconf/programs.m4:743: _AC_PROG_LEX is expanded from... ./lib/autoconf/programs.m4:736: AC_PROG_LEX is expanded from... configure.ac:102: the top level configure.ac:450: warning: The macro 'AC_TYPE_SIGNAL' is obsolete. configure.ac:450: You should run autoupdate. ./lib/autoconf/types.m4:805: AC_TYPE_SIGNAL is expanded from... configure.ac:450: the top level + autoheader + ./configure 'LDFLAGS=-Wl,--as-needed -Wl,--no-copy-dt-needed-entries -Wl,-z,relro -Wl,-z,combreloc ' 'CFLAGS=-O2 -fwrapv -pipe -Wformat -Werror=format-security -gdwarf-4 -fno-debug-types-section -fvar-tracking-assignments -g2 -Wp,-D_FORTIFY_SOURCE=2 -fstack-protector-strong --param=ssp-buffer-size=4 -Werror=trampolines -fPIC -mtune=generic -march=x86-64 -gdwarf-4 -fno-debug-types-section -fvar-tracking-assignments -g2 ' 'CXXFLAGS=-O2 -fwrapv -pipe -Wformat -Werror=format-security -gdwarf-4 -fno-debug-types-section -fvar-tracking-assignments -g2 -Wp,-D_FORTIFY_SOURCE=2 -fstack-protector-strong --param=ssp-buffer-size=4 -Werror=trampolines -fPIC -mtune=generic -march=x86-64 -gdwarf-4 -fno-debug-types-section -fvar-tracking-assignments -g2 ' 'FFLAGS=-O2 -fwrapv -pipe -Wformat -Werror=format-security -gdwarf-4 -fno-debug-types-section -fvar-tracking-assignments -g2 -Wp,-D_FORTIFY_SOURCE=2 -fstack-protector-strong --param=ssp-buffer-size=4 -Werror=trampolines -fPIC -mtune=generic -march=x86-64 -gdwarf-4 -fno-debug-types-section -fvar-tracking-assignments -g2 ' 'FCFLAGS=-O2 -fwrapv -pipe -Wformat -Werror=format-security -gdwarf-4 -fno-debug-types-section -fvar-tracking-assignments -g2 -Wp,-D_FORTIFY_SOURCE=2 -fstack-protector-strong --param=ssp-buffer-size=4 -Werror=trampolines -fPIC -mtune=generic -march=x86-64 -gdwarf-4 -fno-debug-types-section -fvar-tracking-assignments -g2 ' 'CPPFLAGS=' 'CC=x86_64-pld-linux-gnux32-gcc' 'CXX=x86_64-pld-linux-gnux32-g++' '--host=x86_64-pld-linux-gnux32' '--build=x86_64-pld-linux-gnux32' '--prefix=/usr' '--exec-prefix=/usr' '--bindir=/usr/bin' '--sbindir=/usr/sbin' '--sysconfdir=/etc' '--datadir=/usr/share' '--includedir=/usr/include' '--libdir=/usr/libx32' '--libexecdir=/usr/libexec' '--localstatedir=/var' '--sharedstatedir=/var/lib' '--mandir=/usr/share/man' '--infodir=/usr/share/info' '--x-libraries=/usr/libx32' --enable-openimageio '--enable-gc=system' --enable-offscreen '--with-docdir=/usr/share/doc/asymptote-doc' configure: WARNING: unrecognized options: --enable-openimageio checking for x86_64-pld-linux-gnux32-gcc... x86_64-pld-linux-gnux32-gcc checking whether the C compiler works... yes checking for C compiler default output file name... a.out checking for suffix of executables... checking whether we are cross compiling... no checking for suffix of object files... o checking whether the compiler supports GNU C... yes checking whether x86_64-pld-linux-gnux32-gcc accepts -g... yes checking for x86_64-pld-linux-gnux32-gcc option to enable C11 features... none needed checking for stdio.h... yes checking for stdlib.h... yes checking for string.h... yes checking for inttypes.h... yes checking for stdint.h... yes checking for strings.h... yes checking for sys/stat.h... yes checking for sys/types.h... yes checking for unistd.h... yes checking whether byte ordering is bigendian... no checking build system type... x86_64-pld-linux-gnux32 checking host system type... x86_64-pld-linux-gnux32 checking for kpsewhich... true checking for kpsewhich... (cached) true checking for texi2dvi... texi2dvi configure: Using /usr/share/texmf/tex/latex/asymptote for LaTeX style file configure: Using /usr/share/texmf/tex/context/third/asymptote for ConTeXT style file checking whether the compiler supports GNU C++... yes checking whether x86_64-pld-linux-gnux32-g++ accepts -g... yes checking for x86_64-pld-linux-gnux32-g++ option to enable C++11 features... none needed checking for flex... flex checking for lex output file root... lex.yy checking for lex library... none needed checking for library containing yywrap... -lfl checking whether yytext is a pointer... yes checking whether the compiler supports GNU C++... (cached) yes checking whether x86_64-pld-linux-gnux32-g++ accepts -g... (cached) yes checking for x86_64-pld-linux-gnux32-g++ option to enable C++11 features... (cached) none needed checking for a BSD-compatible install... /usr/bin/install -c checking for x86_64-pld-linux-gnux32-gcc... (cached) x86_64-pld-linux-gnux32-gcc checking whether the compiler supports GNU C... (cached) yes checking whether x86_64-pld-linux-gnux32-gcc accepts -g... (cached) yes checking for x86_64-pld-linux-gnux32-gcc option to enable C11 features... (cached) none needed checking whether make sets $(MAKE)... yes checking for bison... bison -y checking for tr1/unordered_map... yes checking for gc-8.0.4.tar.gz... yes checking for gc.h... yes checking for GC_malloc in -lgc... yes configure: enabling system Boehm Garbage Collector checking for getopt_long_only... yes checking for library containing lgamma... none required checking for deflate in -lz... yes checking for the pthreads library -lpthreads... no checking whether pthreads work without any flags... yes checking for joinable pthread attribute... PTHREAD_CREATE_JOINABLE checking if more special flags are required for pthreads... no checking for PTHREAD_PRIO_INHERIT... yes checking for stackoverflow_install_handler in -lsigsegv... yes checking for sched_yield in -lrt... yes checking for curl_easy_init in -lcurl... yes checking for history_list in -lreadline... yes checking for tgetent in -ltinfo... yes checking for ncurses/curses.h... yes checking for setupterm in -lncurses... yes checking for fftw3.h... yes checking for fftw_execute in -lfftw3... yes checking for sys/wait.h that is POSIX.1 compatible... yes checking for fenv.h... yes checking for stddef.h... yes checking for libintl.h... yes checking for fpu_control.h... yes checking for feenableexcept... yes checking for library containing xdrstdio_create... -ltirpc checking for gsl/gsl_sf.h... yes checking for gsl_sf_debye_6 in -lgsl... yes checking for glm/glm.hpp... yes checking for ncurses/curses.h... (cached) yes checking for OpenEXR/ImathVec.h... no checking for GC_throw_bad_alloc in -lgccpp... no checking for glutMainLoop in -lglut... yes checking for glDepthMask in -lGL... yes checking for glXGetProcAddressARB in -lGLX... yes checking for OSMesaCreateContext in -lOSMesa... yes checking for pid_t... yes checking for size_t... yes checking for ptrdiff_t... yes checking for long long... yes checking for long... yes checking for an ANSI C-conforming const... yes checking for inline... inline checking return type of signal handlers... void checking for vfork.h... no checking for fork... yes checking for vfork... yes checking for working fork... yes checking for working vfork... (cached) yes checking for dup2... yes checking for floor... yes checking for memset... yes checking for strchr... yes checking for tgamma... yes checking for lgamma... yes checking for memrchr... yes checking for popcount... no checking for strftime... yes checking for strptime... yes checking for error_at_line... yes checking for declarations of fseeko and ftello... yes configure: creating ./config.status config.status: creating Makefile config.status: creating doc/Makefile config.status: creating doc/png/Makefile config.status: creating config.h configure: WARNING: unrecognized options: --enable-openimageio + /usr/bin/make -Otarget -j28 all perl ./opsymbols.pl Creating camperror.d Creating types.d Creating path.d Creating util.d Creating flatguide.d Creating guide.d Creating stm.d Creating psfile.d Creating knot.d Creating pipestream.d Creating dec.d Creating texfile.d Creating builtin.d Creating env.d Creating settings.d Creating drawlabel.d Creating path3.d Creating errormsg.d Creating genv.d Creating drawpath.d Creating picture.d Creating gsl.d Creating newexp.d Creating entry.d Creating pen.d Creating exp.d Creating callable.d Creating stack.d Creating bezierpatch.d Creating symbol.d Creating beziercurve.d Creating name.d Creating drawpath3.d Creating simpson.d Creating drawfill.d Creating fftw++asy.d Creating camp.tab.d Creating virtualfieldaccess.d Creating absyn.d Creating lex.yy.d Creating drawsurface.d Creating locate.d Creating access.d Creating PRCdouble.d Creating interact.d Creating impdatum.d Creating record.d Creating predicates.d Creating program.d Creating coenv.d Creating parser.d Creating refaccess.d Creating fileio.d Creating coder.d Creating envcompleter.d Creating application.d Creating varinit.d Creating PRCbitStream.d Creating oPRCFile.d Creating array.d Creating fundec.d Creating constructor.d Creating Delaunay.d Creating writePRC.d Creating shaders.d Creating process.d perl ./runtime.pl runbacktrace perl ./runtime.pl runtime perl ./runtime.pl runpicture perl ./runtime.pl runlabel perl ./runtime.pl runhistory perl ./runtime.pl runarray perl ./runtime.pl runfile perl ./runtime.pl runsystem perl ./runtime.pl runpair perl ./runtime.pl runtriple perl ./runtime.pl runpath perl ./runtime.pl runpath3d perl ./runtime.pl runstring perl ./runtime.pl runmath Creating main.d Creating tr.d Creating jsfile.d Creating glrender.d Creating runbacktrace.d Creating runpair.d Creating runpath.d Creating runfile.d Creating runhistory.d Creating runmath.d Creating runsystem.d Creating runstring.d Creating runlabel.d Creating runtriple.d Creating runpicture.d Creating runarray.d Creating runpath3d.d Creating runtime.d Creating symbol.d Creating runbacktrace.d Creating builtin.d Creating runhistory.d Creating runmath.d Creating runstring.d Creating runsystem.d Creating gsl.d Creating types.d Creating runpair.d Creating runfile.d Creating runpath.d Creating runlabel.d Creating runtriple.d Creating runpath3d.d Creating runarray.d Creating runtime.d Creating runpicture.d x86_64-pld-linux-gnux32-g++ -Wall -E -DNOSYM -DHAVE_CONFIG_H -D_FILE_OFFSET_BITS=64 -DUSEGC -DFFTWPP_SINGLE_THREAD -I. -I/usr/include/gc -I/usr/include/gc -I/usr/include/tirpc -O2 -fwrapv -pipe -Wformat -Werror=format-security -gdwarf-4 -fno-debug-types-section -fvar-tracking-assignments -g2 -Wp,-D_FORTIFY_SOURCE=2 -fstack-protector-strong --param=ssp-buffer-size=4 -Werror=trampolines -fPIC -mtune=generic -march=x86-64 -gdwarf-4 -fno-debug-types-section -fvar-tracking-assignments -g2 -O2 -fwrapv -pipe -Wformat -Werror=format-security -gdwarf-4 -fno-debug-types-section -fvar-tracking-assignments -g2 -Wp,-D_FORTIFY_SOURCE=2 -fstack-protector-strong --param=ssp-buffer-size=4 -Werror=trampolines -fPIC -mtune=generic -march=x86-64 -gdwarf-4 -fno-debug-types-section -fvar-tracking-assignments -g2 -fno-var-tracking types.cc | \ perl ./findsym.pl types.symbols.h - x86_64-pld-linux-gnux32-g++ -Wall -E -DNOSYM -DHAVE_CONFIG_H -D_FILE_OFFSET_BITS=64 -DUSEGC -DFFTWPP_SINGLE_THREAD -I. -I/usr/include/gc -I/usr/include/gc -I/usr/include/tirpc -O2 -fwrapv -pipe -Wformat -Werror=format-security -gdwarf-4 -fno-debug-types-section -fvar-tracking-assignments -g2 -Wp,-D_FORTIFY_SOURCE=2 -fstack-protector-strong --param=ssp-buffer-size=4 -Werror=trampolines -fPIC -mtune=generic -march=x86-64 -gdwarf-4 -fno-debug-types-section -fvar-tracking-assignments -g2 -O2 -fwrapv -pipe -Wformat -Werror=format-security -gdwarf-4 -fno-debug-types-section -fvar-tracking-assignments -g2 -Wp,-D_FORTIFY_SOURCE=2 -fstack-protector-strong --param=ssp-buffer-size=4 -Werror=trampolines -fPIC -mtune=generic -march=x86-64 -gdwarf-4 -fno-debug-types-section -fvar-tracking-assignments -g2 -fno-var-tracking runbacktrace.cc | \ perl ./findsym.pl runbacktrace.symbols.h - x86_64-pld-linux-gnux32-g++ -Wall -E -DNOSYM -DHAVE_CONFIG_H -D_FILE_OFFSET_BITS=64 -DUSEGC -DFFTWPP_SINGLE_THREAD -I. -I/usr/include/gc -I/usr/include/gc -I/usr/include/tirpc -O2 -fwrapv -pipe -Wformat -Werror=format-security -gdwarf-4 -fno-debug-types-section -fvar-tracking-assignments -g2 -Wp,-D_FORTIFY_SOURCE=2 -fstack-protector-strong --param=ssp-buffer-size=4 -Werror=trampolines -fPIC -mtune=generic -march=x86-64 -gdwarf-4 -fno-debug-types-section -fvar-tracking-assignments -g2 -O2 -fwrapv -pipe -Wformat -Werror=format-security -gdwarf-4 -fno-debug-types-section -fvar-tracking-assignments -g2 -Wp,-D_FORTIFY_SOURCE=2 -fstack-protector-strong --param=ssp-buffer-size=4 -Werror=trampolines -fPIC -mtune=generic -march=x86-64 -gdwarf-4 -fno-debug-types-section -fvar-tracking-assignments -g2 -fno-var-tracking gsl.cc | \ perl ./findsym.pl gsl.symbols.h - x86_64-pld-linux-gnux32-g++ -Wall -E -DNOSYM -DHAVE_CONFIG_H -D_FILE_OFFSET_BITS=64 -DUSEGC -DFFTWPP_SINGLE_THREAD -I. -I/usr/include/gc -I/usr/include/gc -I/usr/include/tirpc -O2 -fwrapv -pipe -Wformat -Werror=format-security -gdwarf-4 -fno-debug-types-section -fvar-tracking-assignments -g2 -Wp,-D_FORTIFY_SOURCE=2 -fstack-protector-strong --param=ssp-buffer-size=4 -Werror=trampolines -fPIC -mtune=generic -march=x86-64 -gdwarf-4 -fno-debug-types-section -fvar-tracking-assignments -g2 -O2 -fwrapv -pipe -Wformat -Werror=format-security -gdwarf-4 -fno-debug-types-section -fvar-tracking-assignments -g2 -Wp,-D_FORTIFY_SOURCE=2 -fstack-protector-strong --param=ssp-buffer-size=4 -Werror=trampolines -fPIC -mtune=generic -march=x86-64 -gdwarf-4 -fno-debug-types-section -fvar-tracking-assignments -g2 -fno-var-tracking builtin.cc | \ perl ./findsym.pl builtin.symbols.h - x86_64-pld-linux-gnux32-g++ -Wall -E -DNOSYM -DHAVE_CONFIG_H -D_FILE_OFFSET_BITS=64 -DUSEGC -DFFTWPP_SINGLE_THREAD -I. -I/usr/include/gc -I/usr/include/gc -I/usr/include/tirpc -O2 -fwrapv -pipe -Wformat -Werror=format-security -gdwarf-4 -fno-debug-types-section -fvar-tracking-assignments -g2 -Wp,-D_FORTIFY_SOURCE=2 -fstack-protector-strong --param=ssp-buffer-size=4 -Werror=trampolines -fPIC -mtune=generic -march=x86-64 -gdwarf-4 -fno-debug-types-section -fvar-tracking-assignments -g2 -O2 -fwrapv -pipe -Wformat -Werror=format-security -gdwarf-4 -fno-debug-types-section -fvar-tracking-assignments -g2 -Wp,-D_FORTIFY_SOURCE=2 -fstack-protector-strong --param=ssp-buffer-size=4 -Werror=trampolines -fPIC -mtune=generic -march=x86-64 -gdwarf-4 -fno-debug-types-section -fvar-tracking-assignments -g2 -fno-var-tracking runhistory.cc | \ perl ./findsym.pl runhistory.symbols.h - x86_64-pld-linux-gnux32-g++ -Wall -E -DNOSYM -DHAVE_CONFIG_H -D_FILE_OFFSET_BITS=64 -DUSEGC -DFFTWPP_SINGLE_THREAD -I. -I/usr/include/gc -I/usr/include/gc -I/usr/include/tirpc -O2 -fwrapv -pipe -Wformat -Werror=format-security -gdwarf-4 -fno-debug-types-section -fvar-tracking-assignments -g2 -Wp,-D_FORTIFY_SOURCE=2 -fstack-protector-strong --param=ssp-buffer-size=4 -Werror=trampolines -fPIC -mtune=generic -march=x86-64 -gdwarf-4 -fno-debug-types-section -fvar-tracking-assignments -g2 -O2 -fwrapv -pipe -Wformat -Werror=format-security -gdwarf-4 -fno-debug-types-section -fvar-tracking-assignments -g2 -Wp,-D_FORTIFY_SOURCE=2 -fstack-protector-strong --param=ssp-buffer-size=4 -Werror=trampolines -fPIC -mtune=generic -march=x86-64 -gdwarf-4 -fno-debug-types-section -fvar-tracking-assignments -g2 -fno-var-tracking runtime.cc | \ perl ./findsym.pl runtime.symbols.h - x86_64-pld-linux-gnux32-g++ -Wall -E -DNOSYM -DHAVE_CONFIG_H -D_FILE_OFFSET_BITS=64 -DUSEGC -DFFTWPP_SINGLE_THREAD -I. -I/usr/include/gc -I/usr/include/gc -I/usr/include/tirpc -O2 -fwrapv -pipe -Wformat -Werror=format-security -gdwarf-4 -fno-debug-types-section -fvar-tracking-assignments -g2 -Wp,-D_FORTIFY_SOURCE=2 -fstack-protector-strong --param=ssp-buffer-size=4 -Werror=trampolines -fPIC -mtune=generic -march=x86-64 -gdwarf-4 -fno-debug-types-section -fvar-tracking-assignments -g2 -O2 -fwrapv -pipe -Wformat -Werror=format-security -gdwarf-4 -fno-debug-types-section -fvar-tracking-assignments -g2 -Wp,-D_FORTIFY_SOURCE=2 -fstack-protector-strong --param=ssp-buffer-size=4 -Werror=trampolines -fPIC -mtune=generic -march=x86-64 -gdwarf-4 -fno-debug-types-section -fvar-tracking-assignments -g2 -fno-var-tracking runlabel.cc | \ perl ./findsym.pl runlabel.symbols.h - x86_64-pld-linux-gnux32-g++ -Wall -E -DNOSYM -DHAVE_CONFIG_H -D_FILE_OFFSET_BITS=64 -DUSEGC -DFFTWPP_SINGLE_THREAD -I. -I/usr/include/gc -I/usr/include/gc -I/usr/include/tirpc -O2 -fwrapv -pipe -Wformat -Werror=format-security -gdwarf-4 -fno-debug-types-section -fvar-tracking-assignments -g2 -Wp,-D_FORTIFY_SOURCE=2 -fstack-protector-strong --param=ssp-buffer-size=4 -Werror=trampolines -fPIC -mtune=generic -march=x86-64 -gdwarf-4 -fno-debug-types-section -fvar-tracking-assignments -g2 -O2 -fwrapv -pipe -Wformat -Werror=format-security -gdwarf-4 -fno-debug-types-section -fvar-tracking-assignments -g2 -Wp,-D_FORTIFY_SOURCE=2 -fstack-protector-strong --param=ssp-buffer-size=4 -Werror=trampolines -fPIC -mtune=generic -march=x86-64 -gdwarf-4 -fno-debug-types-section -fvar-tracking-assignments -g2 -fno-var-tracking runpicture.cc | \ perl ./findsym.pl runpicture.symbols.h - x86_64-pld-linux-gnux32-g++ -Wall -E -DNOSYM -DHAVE_CONFIG_H -D_FILE_OFFSET_BITS=64 -DUSEGC -DFFTWPP_SINGLE_THREAD -I. -I/usr/include/gc -I/usr/include/gc -I/usr/include/tirpc -O2 -fwrapv -pipe -Wformat -Werror=format-security -gdwarf-4 -fno-debug-types-section -fvar-tracking-assignments -g2 -Wp,-D_FORTIFY_SOURCE=2 -fstack-protector-strong --param=ssp-buffer-size=4 -Werror=trampolines -fPIC -mtune=generic -march=x86-64 -gdwarf-4 -fno-debug-types-section -fvar-tracking-assignments -g2 -O2 -fwrapv -pipe -Wformat -Werror=format-security -gdwarf-4 -fno-debug-types-section -fvar-tracking-assignments -g2 -Wp,-D_FORTIFY_SOURCE=2 -fstack-protector-strong --param=ssp-buffer-size=4 -Werror=trampolines -fPIC -mtune=generic -march=x86-64 -gdwarf-4 -fno-debug-types-section -fvar-tracking-assignments -g2 -fno-var-tracking runsystem.cc | \ perl ./findsym.pl runsystem.symbols.h - x86_64-pld-linux-gnux32-g++ -Wall -E -DNOSYM -DHAVE_CONFIG_H -D_FILE_OFFSET_BITS=64 -DUSEGC -DFFTWPP_SINGLE_THREAD -I. -I/usr/include/gc -I/usr/include/gc -I/usr/include/tirpc -O2 -fwrapv -pipe -Wformat -Werror=format-security -gdwarf-4 -fno-debug-types-section -fvar-tracking-assignments -g2 -Wp,-D_FORTIFY_SOURCE=2 -fstack-protector-strong --param=ssp-buffer-size=4 -Werror=trampolines -fPIC -mtune=generic -march=x86-64 -gdwarf-4 -fno-debug-types-section -fvar-tracking-assignments -g2 -O2 -fwrapv -pipe -Wformat -Werror=format-security -gdwarf-4 -fno-debug-types-section -fvar-tracking-assignments -g2 -Wp,-D_FORTIFY_SOURCE=2 -fstack-protector-strong --param=ssp-buffer-size=4 -Werror=trampolines -fPIC -mtune=generic -march=x86-64 -gdwarf-4 -fno-debug-types-section -fvar-tracking-assignments -g2 -fno-var-tracking runpair.cc | \ perl ./findsym.pl runpair.symbols.h - x86_64-pld-linux-gnux32-g++ -Wall -E -DNOSYM -DHAVE_CONFIG_H -D_FILE_OFFSET_BITS=64 -DUSEGC -DFFTWPP_SINGLE_THREAD -I. -I/usr/include/gc -I/usr/include/gc -I/usr/include/tirpc -O2 -fwrapv -pipe -Wformat -Werror=format-security -gdwarf-4 -fno-debug-types-section -fvar-tracking-assignments -g2 -Wp,-D_FORTIFY_SOURCE=2 -fstack-protector-strong --param=ssp-buffer-size=4 -Werror=trampolines -fPIC -mtune=generic -march=x86-64 -gdwarf-4 -fno-debug-types-section -fvar-tracking-assignments -g2 -O2 -fwrapv -pipe -Wformat -Werror=format-security -gdwarf-4 -fno-debug-types-section -fvar-tracking-assignments -g2 -Wp,-D_FORTIFY_SOURCE=2 -fstack-protector-strong --param=ssp-buffer-size=4 -Werror=trampolines -fPIC -mtune=generic -march=x86-64 -gdwarf-4 -fno-debug-types-section -fvar-tracking-assignments -g2 -fno-var-tracking runfile.cc | \ perl ./findsym.pl runfile.symbols.h - x86_64-pld-linux-gnux32-g++ -Wall -E -DNOSYM -DHAVE_CONFIG_H -D_FILE_OFFSET_BITS=64 -DUSEGC -DFFTWPP_SINGLE_THREAD -I. -I/usr/include/gc -I/usr/include/gc -I/usr/include/tirpc -O2 -fwrapv -pipe -Wformat -Werror=format-security -gdwarf-4 -fno-debug-types-section -fvar-tracking-assignments -g2 -Wp,-D_FORTIFY_SOURCE=2 -fstack-protector-strong --param=ssp-buffer-size=4 -Werror=trampolines -fPIC -mtune=generic -march=x86-64 -gdwarf-4 -fno-debug-types-section -fvar-tracking-assignments -g2 -O2 -fwrapv -pipe -Wformat -Werror=format-security -gdwarf-4 -fno-debug-types-section -fvar-tracking-assignments -g2 -Wp,-D_FORTIFY_SOURCE=2 -fstack-protector-strong --param=ssp-buffer-size=4 -Werror=trampolines -fPIC -mtune=generic -march=x86-64 -gdwarf-4 -fno-debug-types-section -fvar-tracking-assignments -g2 -fno-var-tracking runtriple.cc | \ perl ./findsym.pl runtriple.symbols.h - x86_64-pld-linux-gnux32-g++ -Wall -E -DNOSYM -DHAVE_CONFIG_H -D_FILE_OFFSET_BITS=64 -DUSEGC -DFFTWPP_SINGLE_THREAD -I. -I/usr/include/gc -I/usr/include/gc -I/usr/include/tirpc -O2 -fwrapv -pipe -Wformat -Werror=format-security -gdwarf-4 -fno-debug-types-section -fvar-tracking-assignments -g2 -Wp,-D_FORTIFY_SOURCE=2 -fstack-protector-strong --param=ssp-buffer-size=4 -Werror=trampolines -fPIC -mtune=generic -march=x86-64 -gdwarf-4 -fno-debug-types-section -fvar-tracking-assignments -g2 -O2 -fwrapv -pipe -Wformat -Werror=format-security -gdwarf-4 -fno-debug-types-section -fvar-tracking-assignments -g2 -Wp,-D_FORTIFY_SOURCE=2 -fstack-protector-strong --param=ssp-buffer-size=4 -Werror=trampolines -fPIC -mtune=generic -march=x86-64 -gdwarf-4 -fno-debug-types-section -fvar-tracking-assignments -g2 -fno-var-tracking runarray.cc | \ perl ./findsym.pl runarray.symbols.h - x86_64-pld-linux-gnux32-g++ -Wall -E -DNOSYM -DHAVE_CONFIG_H -D_FILE_OFFSET_BITS=64 -DUSEGC -DFFTWPP_SINGLE_THREAD -I. -I/usr/include/gc -I/usr/include/gc -I/usr/include/tirpc -O2 -fwrapv -pipe -Wformat -Werror=format-security -gdwarf-4 -fno-debug-types-section -fvar-tracking-assignments -g2 -Wp,-D_FORTIFY_SOURCE=2 -fstack-protector-strong --param=ssp-buffer-size=4 -Werror=trampolines -fPIC -mtune=generic -march=x86-64 -gdwarf-4 -fno-debug-types-section -fvar-tracking-assignments -g2 -O2 -fwrapv -pipe -Wformat -Werror=format-security -gdwarf-4 -fno-debug-types-section -fvar-tracking-assignments -g2 -Wp,-D_FORTIFY_SOURCE=2 -fstack-protector-strong --param=ssp-buffer-size=4 -Werror=trampolines -fPIC -mtune=generic -march=x86-64 -gdwarf-4 -fno-debug-types-section -fvar-tracking-assignments -g2 -fno-var-tracking runstring.cc | \ perl ./findsym.pl runstring.symbols.h - x86_64-pld-linux-gnux32-g++ -Wall -E -DNOSYM -DHAVE_CONFIG_H -D_FILE_OFFSET_BITS=64 -DUSEGC -DFFTWPP_SINGLE_THREAD -I. -I/usr/include/gc -I/usr/include/gc -I/usr/include/tirpc -O2 -fwrapv -pipe -Wformat -Werror=format-security -gdwarf-4 -fno-debug-types-section -fvar-tracking-assignments -g2 -Wp,-D_FORTIFY_SOURCE=2 -fstack-protector-strong --param=ssp-buffer-size=4 -Werror=trampolines -fPIC -mtune=generic -march=x86-64 -gdwarf-4 -fno-debug-types-section -fvar-tracking-assignments -g2 -O2 -fwrapv -pipe -Wformat -Werror=format-security -gdwarf-4 -fno-debug-types-section -fvar-tracking-assignments -g2 -Wp,-D_FORTIFY_SOURCE=2 -fstack-protector-strong --param=ssp-buffer-size=4 -Werror=trampolines -fPIC -mtune=generic -march=x86-64 -gdwarf-4 -fno-debug-types-section -fvar-tracking-assignments -g2 -fno-var-tracking runpath.cc | \ perl ./findsym.pl runpath.symbols.h - x86_64-pld-linux-gnux32-g++ -Wall -E -DNOSYM -DHAVE_CONFIG_H -D_FILE_OFFSET_BITS=64 -DUSEGC -DFFTWPP_SINGLE_THREAD -I. -I/usr/include/gc -I/usr/include/gc -I/usr/include/tirpc -O2 -fwrapv -pipe -Wformat -Werror=format-security -gdwarf-4 -fno-debug-types-section -fvar-tracking-assignments -g2 -Wp,-D_FORTIFY_SOURCE=2 -fstack-protector-strong --param=ssp-buffer-size=4 -Werror=trampolines -fPIC -mtune=generic -march=x86-64 -gdwarf-4 -fno-debug-types-section -fvar-tracking-assignments -g2 -O2 -fwrapv -pipe -Wformat -Werror=format-security -gdwarf-4 -fno-debug-types-section -fvar-tracking-assignments -g2 -Wp,-D_FORTIFY_SOURCE=2 -fstack-protector-strong --param=ssp-buffer-size=4 -Werror=trampolines -fPIC -mtune=generic -march=x86-64 -gdwarf-4 -fno-debug-types-section -fvar-tracking-assignments -g2 -fno-var-tracking runmath.cc | \ perl ./findsym.pl runmath.symbols.h - x86_64-pld-linux-gnux32-g++ -Wall -E -DNOSYM -DHAVE_CONFIG_H -D_FILE_OFFSET_BITS=64 -DUSEGC -DFFTWPP_SINGLE_THREAD -I. -I/usr/include/gc -I/usr/include/gc -I/usr/include/tirpc -O2 -fwrapv -pipe -Wformat -Werror=format-security -gdwarf-4 -fno-debug-types-section -fvar-tracking-assignments -g2 -Wp,-D_FORTIFY_SOURCE=2 -fstack-protector-strong --param=ssp-buffer-size=4 -Werror=trampolines -fPIC -mtune=generic -march=x86-64 -gdwarf-4 -fno-debug-types-section -fvar-tracking-assignments -g2 -O2 -fwrapv -pipe -Wformat -Werror=format-security -gdwarf-4 -fno-debug-types-section -fvar-tracking-assignments -g2 -Wp,-D_FORTIFY_SOURCE=2 -fstack-protector-strong --param=ssp-buffer-size=4 -Werror=trampolines -fPIC -mtune=generic -march=x86-64 -gdwarf-4 -fno-debug-types-section -fvar-tracking-assignments -g2 -fno-var-tracking runpath3d.cc | \ perl ./findsym.pl runpath3d.symbols.h - x86_64-pld-linux-gnux32-g++ -Wall -DHAVE_CONFIG_H -D_FILE_OFFSET_BITS=64 -DUSEGC -DFFTWPP_SINGLE_THREAD -I. -I/usr/include/gc -I/usr/include/gc -I/usr/include/tirpc -O2 -fwrapv -pipe -Wformat -Werror=format-security -gdwarf-4 -fno-debug-types-section -fvar-tracking-assignments -g2 -Wp,-D_FORTIFY_SOURCE=2 -fstack-protector-strong --param=ssp-buffer-size=4 -Werror=trampolines -fPIC -mtune=generic -march=x86-64 -gdwarf-4 -fno-debug-types-section -fvar-tracking-assignments -g2 -O2 -fwrapv -pipe -Wformat -Werror=format-security -gdwarf-4 -fno-debug-types-section -fvar-tracking-assignments -g2 -Wp,-D_FORTIFY_SOURCE=2 -fstack-protector-strong --param=ssp-buffer-size=4 -Werror=trampolines -fPIC -mtune=generic -march=x86-64 -gdwarf-4 -fno-debug-types-section -fvar-tracking-assignments -g2 -fno-var-tracking -o camperror.o -c camperror.cc x86_64-pld-linux-gnux32-g++ -Wall -DHAVE_CONFIG_H -D_FILE_OFFSET_BITS=64 -DUSEGC -DFFTWPP_SINGLE_THREAD -I. -I/usr/include/gc -I/usr/include/gc -I/usr/include/tirpc -O2 -fwrapv -pipe -Wformat -Werror=format-security -gdwarf-4 -fno-debug-types-section -fvar-tracking-assignments -g2 -Wp,-D_FORTIFY_SOURCE=2 -fstack-protector-strong --param=ssp-buffer-size=4 -Werror=trampolines -fPIC -mtune=generic -march=x86-64 -gdwarf-4 -fno-debug-types-section -fvar-tracking-assignments -g2 -O2 -fwrapv -pipe -Wformat -Werror=format-security -gdwarf-4 -fno-debug-types-section -fvar-tracking-assignments -g2 -Wp,-D_FORTIFY_SOURCE=2 -fstack-protector-strong --param=ssp-buffer-size=4 -Werror=trampolines -fPIC -mtune=generic -march=x86-64 -gdwarf-4 -fno-debug-types-section -fvar-tracking-assignments -g2 -fno-var-tracking -o flatguide.o -c flatguide.cc x86_64-pld-linux-gnux32-g++ -Wall -DHAVE_CONFIG_H -D_FILE_OFFSET_BITS=64 -DUSEGC -DFFTWPP_SINGLE_THREAD -I. -I/usr/include/gc -I/usr/include/gc -I/usr/include/tirpc -O2 -fwrapv -pipe -Wformat -Werror=format-security -gdwarf-4 -fno-debug-types-section -fvar-tracking-assignments -g2 -Wp,-D_FORTIFY_SOURCE=2 -fstack-protector-strong --param=ssp-buffer-size=4 -Werror=trampolines -fPIC -mtune=generic -march=x86-64 -gdwarf-4 -fno-debug-types-section -fvar-tracking-assignments -g2 -O2 -fwrapv -pipe -Wformat -Werror=format-security -gdwarf-4 -fno-debug-types-section -fvar-tracking-assignments -g2 -Wp,-D_FORTIFY_SOURCE=2 -fstack-protector-strong --param=ssp-buffer-size=4 -Werror=trampolines -fPIC -mtune=generic -march=x86-64 -gdwarf-4 -fno-debug-types-section -fvar-tracking-assignments -g2 -fno-var-tracking -o guide.o -c guide.cc x86_64-pld-linux-gnux32-g++ -Wall -DHAVE_CONFIG_H -D_FILE_OFFSET_BITS=64 -DUSEGC -DFFTWPP_SINGLE_THREAD -I. -I/usr/include/gc -I/usr/include/gc -I/usr/include/tirpc -O2 -fwrapv -pipe -Wformat -Werror=format-security -gdwarf-4 -fno-debug-types-section -fvar-tracking-assignments -g2 -Wp,-D_FORTIFY_SOURCE=2 -fstack-protector-strong --param=ssp-buffer-size=4 -Werror=trampolines -fPIC -mtune=generic -march=x86-64 -gdwarf-4 -fno-debug-types-section -fvar-tracking-assignments -g2 -O2 -fwrapv -pipe -Wformat -Werror=format-security -gdwarf-4 -fno-debug-types-section -fvar-tracking-assignments -g2 -Wp,-D_FORTIFY_SOURCE=2 -fstack-protector-strong --param=ssp-buffer-size=4 -Werror=trampolines -fPIC -mtune=generic -march=x86-64 -gdwarf-4 -fno-debug-types-section -fvar-tracking-assignments -g2 -fno-var-tracking -o pipestream.o -c pipestream.cc x86_64-pld-linux-gnux32-g++ -Wall -DHAVE_CONFIG_H -D_FILE_OFFSET_BITS=64 -DUSEGC -DFFTWPP_SINGLE_THREAD -I. -I/usr/include/gc -I/usr/include/gc -I/usr/include/tirpc -O2 -fwrapv -pipe -Wformat -Werror=format-security -gdwarf-4 -fno-debug-types-section -fvar-tracking-assignments -g2 -Wp,-D_FORTIFY_SOURCE=2 -fstack-protector-strong --param=ssp-buffer-size=4 -Werror=trampolines -fPIC -mtune=generic -march=x86-64 -gdwarf-4 -fno-debug-types-section -fvar-tracking-assignments -g2 -O2 -fwrapv -pipe -Wformat -Werror=format-security -gdwarf-4 -fno-debug-types-section -fvar-tracking-assignments -g2 -Wp,-D_FORTIFY_SOURCE=2 -fstack-protector-strong --param=ssp-buffer-size=4 -Werror=trampolines -fPIC -mtune=generic -march=x86-64 -gdwarf-4 -fno-debug-types-section -fvar-tracking-assignments -g2 -fno-var-tracking -o callable.o -c callable.cc x86_64-pld-linux-gnux32-g++ -Wall -DHAVE_CONFIG_H -D_FILE_OFFSET_BITS=64 -DUSEGC -DFFTWPP_SINGLE_THREAD -I. -I/usr/include/gc -I/usr/include/gc -I/usr/include/tirpc -O2 -fwrapv -pipe -Wformat -Werror=format-security -gdwarf-4 -fno-debug-types-section -fvar-tracking-assignments -g2 -Wp,-D_FORTIFY_SOURCE=2 -fstack-protector-strong --param=ssp-buffer-size=4 -Werror=trampolines -fPIC -mtune=generic -march=x86-64 -gdwarf-4 -fno-debug-types-section -fvar-tracking-assignments -g2 -O2 -fwrapv -pipe -Wformat -Werror=format-security -gdwarf-4 -fno-debug-types-section -fvar-tracking-assignments -g2 -Wp,-D_FORTIFY_SOURCE=2 -fstack-protector-strong --param=ssp-buffer-size=4 -Werror=trampolines -fPIC -mtune=generic -march=x86-64 -gdwarf-4 -fno-debug-types-section -fvar-tracking-assignments -g2 -fno-var-tracking -o util.o -c util.cc x86_64-pld-linux-gnux32-g++ -Wall -DHAVE_CONFIG_H -D_FILE_OFFSET_BITS=64 -DUSEGC -DFFTWPP_SINGLE_THREAD -I. -I/usr/include/gc -I/usr/include/gc -I/usr/include/tirpc -O2 -fwrapv -pipe -Wformat -Werror=format-security -gdwarf-4 -fno-debug-types-section -fvar-tracking-assignments -g2 -Wp,-D_FORTIFY_SOURCE=2 -fstack-protector-strong --param=ssp-buffer-size=4 -Werror=trampolines -fPIC -mtune=generic -march=x86-64 -gdwarf-4 -fno-debug-types-section -fvar-tracking-assignments -g2 -O2 -fwrapv -pipe -Wformat -Werror=format-security -gdwarf-4 -fno-debug-types-section -fvar-tracking-assignments -g2 -Wp,-D_FORTIFY_SOURCE=2 -fstack-protector-strong --param=ssp-buffer-size=4 -Werror=trampolines -fPIC -mtune=generic -march=x86-64 -gdwarf-4 -fno-debug-types-section -fvar-tracking-assignments -g2 -fno-var-tracking -o settings.o -c settings.cc In file included from glrender.h:64, from settings.cc:38: /usr/include/GL/osmesa.h:125:1: error: expected initializer before 'OSMesaCreateContext' 125 | OSMesaCreateContext( GLenum format, OSMesaContext sharelist ); | ^~~~~~~~~~~~~~~~~~~ /usr/include/GL/osmesa.h:138:1: error: expected initializer before 'OSMesaCreateContextExt' 138 | OSMesaCreateContextExt( GLenum format, GLint depthBits, GLint stencilBits, | ^~~~~~~~~~~~~~~~~~~~~~ /usr/include/GL/osmesa.h:167:1: error: expected initializer before 'OSMesaCreateContextAttribs' 167 | OSMesaCreateContextAttribs( const int *attribList, OSMesaContext sharelist ); | ^~~~~~~~~~~~~~~~~~~~~~~~~~ /usr/include/GL/osmesa.h:177:1: error: expected initializer before 'OSMesaDestroyContext' 177 | OSMesaDestroyContext( OSMesaContext ctx ); | ^~~~~~~~~~~~~~~~~~~~ /usr/include/GL/osmesa.h:209:1: error: expected initializer before 'OSMesaMakeCurrent' 209 | OSMesaMakeCurrent( OSMesaContext ctx, void *buffer, GLenum type, | ^~~~~~~~~~~~~~~~~ /usr/include/GL/osmesa.h:219:1: error: expected initializer before 'OSMesaGetCurrentContext' 219 | OSMesaGetCurrentContext( void ); | ^~~~~~~~~~~~~~~~~~~~~~~ /usr/include/GL/osmesa.h:237:1: error: expected initializer before 'OSMesaPixelStore' 237 | OSMesaPixelStore( GLint pname, GLint value ); | ^~~~~~~~~~~~~~~~ /usr/include/GL/osmesa.h:253:1: error: expected initializer before 'OSMesaGetIntegerv' 253 | OSMesaGetIntegerv( GLint pname, GLint *value ); | ^~~~~~~~~~~~~~~~~ /usr/include/GL/osmesa.h:268:1: error: expected initializer before 'OSMesaGetDepthBuffer' 268 | OSMesaGetDepthBuffer( OSMesaContext c, GLint *width, GLint *height, | ^~~~~~~~~~~~~~~~~~~~ /usr/include/GL/osmesa.h:284:1: error: expected initializer before 'OSMesaGetColorBuffer' 284 | OSMesaGetColorBuffer( OSMesaContext c, GLint *width, GLint *height, | ^~~~~~~~~~~~~~~~~~~~ /usr/include/GL/osmesa.h:301:1: error: expected initializer before 'OSMesaGetProcAddress' 301 | OSMesaGetProcAddress( const char *funcName ); | ^~~~~~~~~~~~~~~~~~~~ /usr/include/GL/osmesa.h:310:1: error: expected initializer before 'OSMesaColorClamp' 310 | OSMesaColorClamp(GLboolean enable); | ^~~~~~~~~~~~~~~~ /usr/include/GL/osmesa.h:323:1: error: expected initializer before 'OSMesaPostprocess' 323 | OSMesaPostprocess(OSMesaContext osmesa, const char *filter, | ^~~~~~~~~~~~~~~~~ make: *** [Makefile:364: settings.o] Error 1 make: *** Waiting for unfinished jobs.... x86_64-pld-linux-gnux32-g++ -Wall -DHAVE_CONFIG_H -D_FILE_OFFSET_BITS=64 -DUSEGC -DFFTWPP_SINGLE_THREAD -I. -I/usr/include/gc -I/usr/include/gc -I/usr/include/tirpc -O2 -fwrapv -pipe -Wformat -Werror=format-security -gdwarf-4 -fno-debug-types-section -fvar-tracking-assignments -g2 -Wp,-D_FORTIFY_SOURCE=2 -fstack-protector-strong --param=ssp-buffer-size=4 -Werror=trampolines -fPIC -mtune=generic -march=x86-64 -gdwarf-4 -fno-debug-types-section -fvar-tracking-assignments -g2 -O2 -fwrapv -pipe -Wformat -Werror=format-security -gdwarf-4 -fno-debug-types-section -fvar-tracking-assignments -g2 -Wp,-D_FORTIFY_SOURCE=2 -fstack-protector-strong --param=ssp-buffer-size=4 -Werror=trampolines -fPIC -mtune=generic -march=x86-64 -gdwarf-4 -fno-debug-types-section -fvar-tracking-assignments -g2 -fno-var-tracking -o beziercurve.o -c beziercurve.cc In file included from glrender.h:64, from drawelement.h:21, from bezierpatch.h:11, from beziercurve.cc:8: /usr/include/GL/osmesa.h:125:1: error: expected initializer before 'OSMesaCreateContext' 125 | OSMesaCreateContext( GLenum format, OSMesaContext sharelist ); | ^~~~~~~~~~~~~~~~~~~ /usr/include/GL/osmesa.h:138:1: error: expected initializer before 'OSMesaCreateContextExt' 138 | OSMesaCreateContextExt( GLenum format, GLint depthBits, GLint stencilBits, | ^~~~~~~~~~~~~~~~~~~~~~ /usr/include/GL/osmesa.h:167:1: error: expected initializer before 'OSMesaCreateContextAttribs' 167 | OSMesaCreateContextAttribs( const int *attribList, OSMesaContext sharelist ); | ^~~~~~~~~~~~~~~~~~~~~~~~~~ /usr/include/GL/osmesa.h:177:1: error: expected initializer before 'OSMesaDestroyContext' 177 | OSMesaDestroyContext( OSMesaContext ctx ); | ^~~~~~~~~~~~~~~~~~~~ /usr/include/GL/osmesa.h:209:1: error: expected initializer before 'OSMesaMakeCurrent' 209 | OSMesaMakeCurrent( OSMesaContext ctx, void *buffer, GLenum type, | ^~~~~~~~~~~~~~~~~ /usr/include/GL/osmesa.h:219:1: error: expected initializer before 'OSMesaGetCurrentContext' 219 | OSMesaGetCurrentContext( void ); | ^~~~~~~~~~~~~~~~~~~~~~~ /usr/include/GL/osmesa.h:237:1: error: expected initializer before 'OSMesaPixelStore' 237 | OSMesaPixelStore( GLint pname, GLint value ); | ^~~~~~~~~~~~~~~~ /usr/include/GL/osmesa.h:253:1: error: expected initializer before 'OSMesaGetIntegerv' 253 | OSMesaGetIntegerv( GLint pname, GLint *value ); | ^~~~~~~~~~~~~~~~~ /usr/include/GL/osmesa.h:268:1: error: expected initializer before 'OSMesaGetDepthBuffer' 268 | OSMesaGetDepthBuffer( OSMesaContext c, GLint *width, GLint *height, | ^~~~~~~~~~~~~~~~~~~~ /usr/include/GL/osmesa.h:284:1: error: expected initializer before 'OSMesaGetColorBuffer' 284 | OSMesaGetColorBuffer( OSMesaContext c, GLint *width, GLint *height, | ^~~~~~~~~~~~~~~~~~~~ /usr/include/GL/osmesa.h:301:1: error: expected initializer before 'OSMesaGetProcAddress' 301 | OSMesaGetProcAddress( const char *funcName ); | ^~~~~~~~~~~~~~~~~~~~ /usr/include/GL/osmesa.h:310:1: error: expected initializer before 'OSMesaColorClamp' 310 | OSMesaColorClamp(GLboolean enable); | ^~~~~~~~~~~~~~~~ /usr/include/GL/osmesa.h:323:1: error: expected initializer before 'OSMesaPostprocess' 323 | OSMesaPostprocess(OSMesaContext osmesa, const char *filter, | ^~~~~~~~~~~~~~~~~ make: *** [Makefile:364: beziercurve.o] Error 1 x86_64-pld-linux-gnux32-g++ -Wall -DHAVE_CONFIG_H -D_FILE_OFFSET_BITS=64 -DUSEGC -DFFTWPP_SINGLE_THREAD -I. -I/usr/include/gc -I/usr/include/gc -I/usr/include/tirpc -O2 -fwrapv -pipe -Wformat -Werror=format-security -gdwarf-4 -fno-debug-types-section -fvar-tracking-assignments -g2 -Wp,-D_FORTIFY_SOURCE=2 -fstack-protector-strong --param=ssp-buffer-size=4 -Werror=trampolines -fPIC -mtune=generic -march=x86-64 -gdwarf-4 -fno-debug-types-section -fvar-tracking-assignments -g2 -O2 -fwrapv -pipe -Wformat -Werror=format-security -gdwarf-4 -fno-debug-types-section -fvar-tracking-assignments -g2 -Wp,-D_FORTIFY_SOURCE=2 -fstack-protector-strong --param=ssp-buffer-size=4 -Werror=trampolines -fPIC -mtune=generic -march=x86-64 -gdwarf-4 -fno-debug-types-section -fvar-tracking-assignments -g2 -fno-var-tracking -o drawpath.o -c drawpath.cc In file included from glrender.h:64, from drawelement.h:21, from drawpath.h:11, from drawpath.cc:12: /usr/include/GL/osmesa.h:125:1: error: expected initializer before 'OSMesaCreateContext' 125 | OSMesaCreateContext( GLenum format, OSMesaContext sharelist ); | ^~~~~~~~~~~~~~~~~~~ /usr/include/GL/osmesa.h:138:1: error: expected initializer before 'OSMesaCreateContextExt' 138 | OSMesaCreateContextExt( GLenum format, GLint depthBits, GLint stencilBits, | ^~~~~~~~~~~~~~~~~~~~~~ /usr/include/GL/osmesa.h:167:1: error: expected initializer before 'OSMesaCreateContextAttribs' 167 | OSMesaCreateContextAttribs( const int *attribList, OSMesaContext sharelist ); | ^~~~~~~~~~~~~~~~~~~~~~~~~~ /usr/include/GL/osmesa.h:177:1: error: expected initializer before 'OSMesaDestroyContext' 177 | OSMesaDestroyContext( OSMesaContext ctx ); | ^~~~~~~~~~~~~~~~~~~~ /usr/include/GL/osmesa.h:209:1: error: expected initializer before 'OSMesaMakeCurrent' 209 | OSMesaMakeCurrent( OSMesaContext ctx, void *buffer, GLenum type, | ^~~~~~~~~~~~~~~~~ /usr/include/GL/osmesa.h:219:1: error: expected initializer before 'OSMesaGetCurrentContext' 219 | OSMesaGetCurrentContext( void ); | ^~~~~~~~~~~~~~~~~~~~~~~ /usr/include/GL/osmesa.h:237:1: error: expected initializer before 'OSMesaPixelStore' 237 | OSMesaPixelStore( GLint pname, GLint value ); | ^~~~~~~~~~~~~~~~ /usr/include/GL/osmesa.h:253:1: error: expected initializer before 'OSMesaGetIntegerv' 253 | OSMesaGetIntegerv( GLint pname, GLint *value ); | ^~~~~~~~~~~~~~~~~ /usr/include/GL/osmesa.h:268:1: error: expected initializer before 'OSMesaGetDepthBuffer' 268 | OSMesaGetDepthBuffer( OSMesaContext c, GLint *width, GLint *height, | ^~~~~~~~~~~~~~~~~~~~ /usr/include/GL/osmesa.h:284:1: error: expected initializer before 'OSMesaGetColorBuffer' 284 | OSMesaGetColorBuffer( OSMesaContext c, GLint *width, GLint *height, | ^~~~~~~~~~~~~~~~~~~~ /usr/include/GL/osmesa.h:301:1: error: expected initializer before 'OSMesaGetProcAddress' 301 | OSMesaGetProcAddress( const char *funcName ); | ^~~~~~~~~~~~~~~~~~~~ /usr/include/GL/osmesa.h:310:1: error: expected initializer before 'OSMesaColorClamp' 310 | OSMesaColorClamp(GLboolean enable); | ^~~~~~~~~~~~~~~~ /usr/include/GL/osmesa.h:323:1: error: expected initializer before 'OSMesaPostprocess' 323 | OSMesaPostprocess(OSMesaContext osmesa, const char *filter, | ^~~~~~~~~~~~~~~~~ make: *** [Makefile:364: drawpath.o] Error 1 x86_64-pld-linux-gnux32-g++ -Wall -DHAVE_CONFIG_H -D_FILE_OFFSET_BITS=64 -DUSEGC -DFFTWPP_SINGLE_THREAD -I. -I/usr/include/gc -I/usr/include/gc -I/usr/include/tirpc -O2 -fwrapv -pipe -Wformat -Werror=format-security -gdwarf-4 -fno-debug-types-section -fvar-tracking-assignments -g2 -Wp,-D_FORTIFY_SOURCE=2 -fstack-protector-strong --param=ssp-buffer-size=4 -Werror=trampolines -fPIC -mtune=generic -march=x86-64 -gdwarf-4 -fno-debug-types-section -fvar-tracking-assignments -g2 -O2 -fwrapv -pipe -Wformat -Werror=format-security -gdwarf-4 -fno-debug-types-section -fvar-tracking-assignments -g2 -Wp,-D_FORTIFY_SOURCE=2 -fstack-protector-strong --param=ssp-buffer-size=4 -Werror=trampolines -fPIC -mtune=generic -march=x86-64 -gdwarf-4 -fno-debug-types-section -fvar-tracking-assignments -g2 -fno-var-tracking -o name.o -c name.cc x86_64-pld-linux-gnux32-g++ -Wall -DHAVE_CONFIG_H -D_FILE_OFFSET_BITS=64 -DUSEGC -DFFTWPP_SINGLE_THREAD -I. -I/usr/include/gc -I/usr/include/gc -I/usr/include/tirpc -O2 -fwrapv -pipe -Wformat -Werror=format-security -gdwarf-4 -fno-debug-types-section -fvar-tracking-assignments -g2 -Wp,-D_FORTIFY_SOURCE=2 -fstack-protector-strong --param=ssp-buffer-size=4 -Werror=trampolines -fPIC -mtune=generic -march=x86-64 -gdwarf-4 -fno-debug-types-section -fvar-tracking-assignments -g2 -O2 -fwrapv -pipe -Wformat -Werror=format-security -gdwarf-4 -fno-debug-types-section -fvar-tracking-assignments -g2 -Wp,-D_FORTIFY_SOURCE=2 -fstack-protector-strong --param=ssp-buffer-size=4 -Werror=trampolines -fPIC -mtune=generic -march=x86-64 -gdwarf-4 -fno-debug-types-section -fvar-tracking-assignments -g2 -fno-var-tracking -o drawfill.o -c drawfill.cc In file included from glrender.h:64, from drawelement.h:21, from drawfill.h:11, from drawfill.cc:8: /usr/include/GL/osmesa.h:125:1: error: expected initializer before 'OSMesaCreateContext' 125 | OSMesaCreateContext( GLenum format, OSMesaContext sharelist ); | ^~~~~~~~~~~~~~~~~~~ /usr/include/GL/osmesa.h:138:1: error: expected initializer before 'OSMesaCreateContextExt' 138 | OSMesaCreateContextExt( GLenum format, GLint depthBits, GLint stencilBits, | ^~~~~~~~~~~~~~~~~~~~~~ /usr/include/GL/osmesa.h:167:1: error: expected initializer before 'OSMesaCreateContextAttribs' 167 | OSMesaCreateContextAttribs( const int *attribList, OSMesaContext sharelist ); | ^~~~~~~~~~~~~~~~~~~~~~~~~~ /usr/include/GL/osmesa.h:177:1: error: expected initializer before 'OSMesaDestroyContext' 177 | OSMesaDestroyContext( OSMesaContext ctx ); | ^~~~~~~~~~~~~~~~~~~~ /usr/include/GL/osmesa.h:209:1: error: expected initializer before 'OSMesaMakeCurrent' 209 | OSMesaMakeCurrent( OSMesaContext ctx, void *buffer, GLenum type, | ^~~~~~~~~~~~~~~~~ /usr/include/GL/osmesa.h:219:1: error: expected initializer before 'OSMesaGetCurrentContext' 219 | OSMesaGetCurrentContext( void ); | ^~~~~~~~~~~~~~~~~~~~~~~ /usr/include/GL/osmesa.h:237:1: error: expected initializer before 'OSMesaPixelStore' 237 | OSMesaPixelStore( GLint pname, GLint value ); | ^~~~~~~~~~~~~~~~ /usr/include/GL/osmesa.h:253:1: error: expected initializer before 'OSMesaGetIntegerv' 253 | OSMesaGetIntegerv( GLint pname, GLint *value ); | ^~~~~~~~~~~~~~~~~ /usr/include/GL/osmesa.h:268:1: error: expected initializer before 'OSMesaGetDepthBuffer' 268 | OSMesaGetDepthBuffer( OSMesaContext c, GLint *width, GLint *height, | ^~~~~~~~~~~~~~~~~~~~ /usr/include/GL/osmesa.h:284:1: error: expected initializer before 'OSMesaGetColorBuffer' 284 | OSMesaGetColorBuffer( OSMesaContext c, GLint *width, GLint *height, | ^~~~~~~~~~~~~~~~~~~~ /usr/include/GL/osmesa.h:301:1: error: expected initializer before 'OSMesaGetProcAddress' 301 | OSMesaGetProcAddress( const char *funcName ); | ^~~~~~~~~~~~~~~~~~~~ /usr/include/GL/osmesa.h:310:1: error: expected initializer before 'OSMesaColorClamp' 310 | OSMesaColorClamp(GLboolean enable); | ^~~~~~~~~~~~~~~~ /usr/include/GL/osmesa.h:323:1: error: expected initializer before 'OSMesaPostprocess' 323 | OSMesaPostprocess(OSMesaContext osmesa, const char *filter, | ^~~~~~~~~~~~~~~~~ make: *** [Makefile:364: drawfill.o] Error 1 x86_64-pld-linux-gnux32-g++ -Wall -DHAVE_CONFIG_H -D_FILE_OFFSET_BITS=64 -DUSEGC -DFFTWPP_SINGLE_THREAD -I. -I/usr/include/gc -I/usr/include/gc -I/usr/include/tirpc -O2 -fwrapv -pipe -Wformat -Werror=format-security -gdwarf-4 -fno-debug-types-section -fvar-tracking-assignments -g2 -Wp,-D_FORTIFY_SOURCE=2 -fstack-protector-strong --param=ssp-buffer-size=4 -Werror=trampolines -fPIC -mtune=generic -march=x86-64 -gdwarf-4 -fno-debug-types-section -fvar-tracking-assignments -g2 -O2 -fwrapv -pipe -Wformat -Werror=format-security -gdwarf-4 -fno-debug-types-section -fvar-tracking-assignments -g2 -Wp,-D_FORTIFY_SOURCE=2 -fstack-protector-strong --param=ssp-buffer-size=4 -Werror=trampolines -fPIC -mtune=generic -march=x86-64 -gdwarf-4 -fno-debug-types-section -fvar-tracking-assignments -g2 -fno-var-tracking -o pen.o -c pen.cc In file included from glrender.h:64, from drawelement.h:21, from pen.cc:8: /usr/include/GL/osmesa.h:125:1: error: expected initializer before 'OSMesaCreateContext' 125 | OSMesaCreateContext( GLenum format, OSMesaContext sharelist ); | ^~~~~~~~~~~~~~~~~~~ /usr/include/GL/osmesa.h:138:1: error: expected initializer before 'OSMesaCreateContextExt' 138 | OSMesaCreateContextExt( GLenum format, GLint depthBits, GLint stencilBits, | ^~~~~~~~~~~~~~~~~~~~~~ /usr/include/GL/osmesa.h:167:1: error: expected initializer before 'OSMesaCreateContextAttribs' 167 | OSMesaCreateContextAttribs( const int *attribList, OSMesaContext sharelist ); | ^~~~~~~~~~~~~~~~~~~~~~~~~~ /usr/include/GL/osmesa.h:177:1: error: expected initializer before 'OSMesaDestroyContext' 177 | OSMesaDestroyContext( OSMesaContext ctx ); | ^~~~~~~~~~~~~~~~~~~~ /usr/include/GL/osmesa.h:209:1: error: expected initializer before 'OSMesaMakeCurrent' 209 | OSMesaMakeCurrent( OSMesaContext ctx, void *buffer, GLenum type, | ^~~~~~~~~~~~~~~~~ /usr/include/GL/osmesa.h:219:1: error: expected initializer before 'OSMesaGetCurrentContext' 219 | OSMesaGetCurrentContext( void ); | ^~~~~~~~~~~~~~~~~~~~~~~ /usr/include/GL/osmesa.h:237:1: error: expected initializer before 'OSMesaPixelStore' 237 | OSMesaPixelStore( GLint pname, GLint value ); | ^~~~~~~~~~~~~~~~ /usr/include/GL/osmesa.h:253:1: error: expected initializer before 'OSMesaGetIntegerv' 253 | OSMesaGetIntegerv( GLint pname, GLint *value ); | ^~~~~~~~~~~~~~~~~ /usr/include/GL/osmesa.h:268:1: error: expected initializer before 'OSMesaGetDepthBuffer' 268 | OSMesaGetDepthBuffer( OSMesaContext c, GLint *width, GLint *height, | ^~~~~~~~~~~~~~~~~~~~ /usr/include/GL/osmesa.h:284:1: error: expected initializer before 'OSMesaGetColorBuffer' 284 | OSMesaGetColorBuffer( OSMesaContext c, GLint *width, GLint *height, | ^~~~~~~~~~~~~~~~~~~~ /usr/include/GL/osmesa.h:301:1: error: expected initializer before 'OSMesaGetProcAddress' 301 | OSMesaGetProcAddress( const char *funcName ); | ^~~~~~~~~~~~~~~~~~~~ /usr/include/GL/osmesa.h:310:1: error: expected initializer before 'OSMesaColorClamp' 310 | OSMesaColorClamp(GLboolean enable); | ^~~~~~~~~~~~~~~~ /usr/include/GL/osmesa.h:323:1: error: expected initializer before 'OSMesaPostprocess' 323 | OSMesaPostprocess(OSMesaContext osmesa, const char *filter, | ^~~~~~~~~~~~~~~~~ make: *** [Makefile:364: pen.o] Error 1 x86_64-pld-linux-gnux32-g++ -Wall -DHAVE_CONFIG_H -D_FILE_OFFSET_BITS=64 -DUSEGC -DFFTWPP_SINGLE_THREAD -I. -I/usr/include/gc -I/usr/include/gc -I/usr/include/tirpc -O2 -fwrapv -pipe -Wformat -Werror=format-security -gdwarf-4 -fno-debug-types-section -fvar-tracking-assignments -g2 -Wp,-D_FORTIFY_SOURCE=2 -fstack-protector-strong --param=ssp-buffer-size=4 -Werror=trampolines -fPIC -mtune=generic -march=x86-64 -gdwarf-4 -fno-debug-types-section -fvar-tracking-assignments -g2 -O2 -fwrapv -pipe -Wformat -Werror=format-security -gdwarf-4 -fno-debug-types-section -fvar-tracking-assignments -g2 -Wp,-D_FORTIFY_SOURCE=2 -fstack-protector-strong --param=ssp-buffer-size=4 -Werror=trampolines -fPIC -mtune=generic -march=x86-64 -gdwarf-4 -fno-debug-types-section -fvar-tracking-assignments -g2 -fno-var-tracking -o drawlabel.o -c drawlabel.cc In file included from glrender.h:64, from drawelement.h:21, from drawlabel.h:11, from drawlabel.cc:10: /usr/include/GL/osmesa.h:125:1: error: expected initializer before 'OSMesaCreateContext' 125 | OSMesaCreateContext( GLenum format, OSMesaContext sharelist ); | ^~~~~~~~~~~~~~~~~~~ /usr/include/GL/osmesa.h:138:1: error: expected initializer before 'OSMesaCreateContextExt' 138 | OSMesaCreateContextExt( GLenum format, GLint depthBits, GLint stencilBits, | ^~~~~~~~~~~~~~~~~~~~~~ /usr/include/GL/osmesa.h:167:1: error: expected initializer before 'OSMesaCreateContextAttribs' 167 | OSMesaCreateContextAttribs( const int *attribList, OSMesaContext sharelist ); | ^~~~~~~~~~~~~~~~~~~~~~~~~~ /usr/include/GL/osmesa.h:177:1: error: expected initializer before 'OSMesaDestroyContext' 177 | OSMesaDestroyContext( OSMesaContext ctx ); | ^~~~~~~~~~~~~~~~~~~~ /usr/include/GL/osmesa.h:209:1: error: expected initializer before 'OSMesaMakeCurrent' 209 | OSMesaMakeCurrent( OSMesaContext ctx, void *buffer, GLenum type, | ^~~~~~~~~~~~~~~~~ /usr/include/GL/osmesa.h:219:1: error: expected initializer before 'OSMesaGetCurrentContext' 219 | OSMesaGetCurrentContext( void ); | ^~~~~~~~~~~~~~~~~~~~~~~ /usr/include/GL/osmesa.h:237:1: error: expected initializer before 'OSMesaPixelStore' 237 | OSMesaPixelStore( GLint pname, GLint value ); | ^~~~~~~~~~~~~~~~ /usr/include/GL/osmesa.h:253:1: error: expected initializer before 'OSMesaGetIntegerv' 253 | OSMesaGetIntegerv( GLint pname, GLint *value ); | ^~~~~~~~~~~~~~~~~ /usr/include/GL/osmesa.h:268:1: error: expected initializer before 'OSMesaGetDepthBuffer' 268 | OSMesaGetDepthBuffer( OSMesaContext c, GLint *width, GLint *height, | ^~~~~~~~~~~~~~~~~~~~ /usr/include/GL/osmesa.h:284:1: error: expected initializer before 'OSMesaGetColorBuffer' 284 | OSMesaGetColorBuffer( OSMesaContext c, GLint *width, GLint *height, | ^~~~~~~~~~~~~~~~~~~~ /usr/include/GL/osmesa.h:301:1: error: expected initializer before 'OSMesaGetProcAddress' 301 | OSMesaGetProcAddress( const char *funcName ); | ^~~~~~~~~~~~~~~~~~~~ /usr/include/GL/osmesa.h:310:1: error: expected initializer before 'OSMesaColorClamp' 310 | OSMesaColorClamp(GLboolean enable); | ^~~~~~~~~~~~~~~~ /usr/include/GL/osmesa.h:323:1: error: expected initializer before 'OSMesaPostprocess' 323 | OSMesaPostprocess(OSMesaContext osmesa, const char *filter, | ^~~~~~~~~~~~~~~~~ make: *** [Makefile:364: drawlabel.o] Error 1 x86_64-pld-linux-gnux32-g++ -Wall -DHAVE_CONFIG_H -D_FILE_OFFSET_BITS=64 -DUSEGC -DFFTWPP_SINGLE_THREAD -I. -I/usr/include/gc -I/usr/include/gc -I/usr/include/tirpc -O2 -fwrapv -pipe -Wformat -Werror=format-security -gdwarf-4 -fno-debug-types-section -fvar-tracking-assignments -g2 -Wp,-D_FORTIFY_SOURCE=2 -fstack-protector-strong --param=ssp-buffer-size=4 -Werror=trampolines -fPIC -mtune=generic -march=x86-64 -gdwarf-4 -fno-debug-types-section -fvar-tracking-assignments -g2 -O2 -fwrapv -pipe -Wformat -Werror=format-security -gdwarf-4 -fno-debug-types-section -fvar-tracking-assignments -g2 -Wp,-D_FORTIFY_SOURCE=2 -fstack-protector-strong --param=ssp-buffer-size=4 -Werror=trampolines -fPIC -mtune=generic -march=x86-64 -gdwarf-4 -fno-debug-types-section -fvar-tracking-assignments -g2 -fno-var-tracking -o bezierpatch.o -c bezierpatch.cc In file included from glrender.h:64, from drawelement.h:21, from bezierpatch.h:11, from bezierpatch.cc:8: /usr/include/GL/osmesa.h:125:1: error: expected initializer before 'OSMesaCreateContext' 125 | OSMesaCreateContext( GLenum format, OSMesaContext sharelist ); | ^~~~~~~~~~~~~~~~~~~ /usr/include/GL/osmesa.h:138:1: error: expected initializer before 'OSMesaCreateContextExt' 138 | OSMesaCreateContextExt( GLenum format, GLint depthBits, GLint stencilBits, | ^~~~~~~~~~~~~~~~~~~~~~ /usr/include/GL/osmesa.h:167:1: error: expected initializer before 'OSMesaCreateContextAttribs' 167 | OSMesaCreateContextAttribs( const int *attribList, OSMesaContext sharelist ); | ^~~~~~~~~~~~~~~~~~~~~~~~~~ /usr/include/GL/osmesa.h:177:1: error: expected initializer before 'OSMesaDestroyContext' 177 | OSMesaDestroyContext( OSMesaContext ctx ); | ^~~~~~~~~~~~~~~~~~~~ /usr/include/GL/osmesa.h:209:1: error: expected initializer before 'OSMesaMakeCurrent' 209 | OSMesaMakeCurrent( OSMesaContext ctx, void *buffer, GLenum type, | ^~~~~~~~~~~~~~~~~ /usr/include/GL/osmesa.h:219:1: error: expected initializer before 'OSMesaGetCurrentContext' 219 | OSMesaGetCurrentContext( void ); | ^~~~~~~~~~~~~~~~~~~~~~~ /usr/include/GL/osmesa.h:237:1: error: expected initializer before 'OSMesaPixelStore' 237 | OSMesaPixelStore( GLint pname, GLint value ); | ^~~~~~~~~~~~~~~~ /usr/include/GL/osmesa.h:253:1: error: expected initializer before 'OSMesaGetIntegerv' 253 | OSMesaGetIntegerv( GLint pname, GLint *value ); | ^~~~~~~~~~~~~~~~~ /usr/include/GL/osmesa.h:268:1: error: expected initializer before 'OSMesaGetDepthBuffer' 268 | OSMesaGetDepthBuffer( OSMesaContext c, GLint *width, GLint *height, | ^~~~~~~~~~~~~~~~~~~~ /usr/include/GL/osmesa.h:284:1: error: expected initializer before 'OSMesaGetColorBuffer' 284 | OSMesaGetColorBuffer( OSMesaContext c, GLint *width, GLint *height, | ^~~~~~~~~~~~~~~~~~~~ /usr/include/GL/osmesa.h:301:1: error: expected initializer before 'OSMesaGetProcAddress' 301 | OSMesaGetProcAddress( const char *funcName ); | ^~~~~~~~~~~~~~~~~~~~ /usr/include/GL/osmesa.h:310:1: error: expected initializer before 'OSMesaColorClamp' 310 | OSMesaColorClamp(GLboolean enable); | ^~~~~~~~~~~~~~~~ /usr/include/GL/osmesa.h:323:1: error: expected initializer before 'OSMesaPostprocess' 323 | OSMesaPostprocess(OSMesaContext osmesa, const char *filter, | ^~~~~~~~~~~~~~~~~ make: *** [Makefile:364: bezierpatch.o] Error 1 x86_64-pld-linux-gnux32-g++ -Wall -DHAVE_CONFIG_H -D_FILE_OFFSET_BITS=64 -DUSEGC -DFFTWPP_SINGLE_THREAD -I. -I/usr/include/gc -I/usr/include/gc -I/usr/include/tirpc -O2 -fwrapv -pipe -Wformat -Werror=format-security -gdwarf-4 -fno-debug-types-section -fvar-tracking-assignments -g2 -Wp,-D_FORTIFY_SOURCE=2 -fstack-protector-strong --param=ssp-buffer-size=4 -Werror=trampolines -fPIC -mtune=generic -march=x86-64 -gdwarf-4 -fno-debug-types-section -fvar-tracking-assignments -g2 -O2 -fwrapv -pipe -Wformat -Werror=format-security -gdwarf-4 -fno-debug-types-section -fvar-tracking-assignments -g2 -Wp,-D_FORTIFY_SOURCE=2 -fstack-protector-strong --param=ssp-buffer-size=4 -Werror=trampolines -fPIC -mtune=generic -march=x86-64 -gdwarf-4 -fno-debug-types-section -fvar-tracking-assignments -g2 -fno-var-tracking -o errormsg.o -c errormsg.cc x86_64-pld-linux-gnux32-g++ -Wall -DHAVE_CONFIG_H -D_FILE_OFFSET_BITS=64 -DUSEGC -DFFTWPP_SINGLE_THREAD -I. -I/usr/include/gc -I/usr/include/gc -I/usr/include/tirpc -O2 -fwrapv -pipe -Wformat -Werror=format-security -gdwarf-4 -fno-debug-types-section -fvar-tracking-assignments -g2 -Wp,-D_FORTIFY_SOURCE=2 -fstack-protector-strong --param=ssp-buffer-size=4 -Werror=trampolines -fPIC -mtune=generic -march=x86-64 -gdwarf-4 -fno-debug-types-section -fvar-tracking-assignments -g2 -O2 -fwrapv -pipe -Wformat -Werror=format-security -gdwarf-4 -fno-debug-types-section -fvar-tracking-assignments -g2 -Wp,-D_FORTIFY_SOURCE=2 -fstack-protector-strong --param=ssp-buffer-size=4 -Werror=trampolines -fPIC -mtune=generic -march=x86-64 -gdwarf-4 -fno-debug-types-section -fvar-tracking-assignments -g2 -fno-var-tracking -o drawpath3.o -c drawpath3.cc In file included from glrender.h:64, from drawelement.h:21, from drawpath3.h:10, from drawpath3.cc:7: /usr/include/GL/osmesa.h:125:1: error: expected initializer before 'OSMesaCreateContext' 125 | OSMesaCreateContext( GLenum format, OSMesaContext sharelist ); | ^~~~~~~~~~~~~~~~~~~ /usr/include/GL/osmesa.h:138:1: error: expected initializer before 'OSMesaCreateContextExt' 138 | OSMesaCreateContextExt( GLenum format, GLint depthBits, GLint stencilBits, | ^~~~~~~~~~~~~~~~~~~~~~ /usr/include/GL/osmesa.h:167:1: error: expected initializer before 'OSMesaCreateContextAttribs' 167 | OSMesaCreateContextAttribs( const int *attribList, OSMesaContext sharelist ); | ^~~~~~~~~~~~~~~~~~~~~~~~~~ /usr/include/GL/osmesa.h:177:1: error: expected initializer before 'OSMesaDestroyContext' 177 | OSMesaDestroyContext( OSMesaContext ctx ); | ^~~~~~~~~~~~~~~~~~~~ /usr/include/GL/osmesa.h:209:1: error: expected initializer before 'OSMesaMakeCurrent' 209 | OSMesaMakeCurrent( OSMesaContext ctx, void *buffer, GLenum type, | ^~~~~~~~~~~~~~~~~ /usr/include/GL/osmesa.h:219:1: error: expected initializer before 'OSMesaGetCurrentContext' 219 | OSMesaGetCurrentContext( void ); | ^~~~~~~~~~~~~~~~~~~~~~~ /usr/include/GL/osmesa.h:237:1: error: expected initializer before 'OSMesaPixelStore' 237 | OSMesaPixelStore( GLint pname, GLint value ); | ^~~~~~~~~~~~~~~~ /usr/include/GL/osmesa.h:253:1: error: expected initializer before 'OSMesaGetIntegerv' 253 | OSMesaGetIntegerv( GLint pname, GLint *value ); | ^~~~~~~~~~~~~~~~~ /usr/include/GL/osmesa.h:268:1: error: expected initializer before 'OSMesaGetDepthBuffer' 268 | OSMesaGetDepthBuffer( OSMesaContext c, GLint *width, GLint *height, | ^~~~~~~~~~~~~~~~~~~~ /usr/include/GL/osmesa.h:284:1: error: expected initializer before 'OSMesaGetColorBuffer' 284 | OSMesaGetColorBuffer( OSMesaContext c, GLint *width, GLint *height, | ^~~~~~~~~~~~~~~~~~~~ /usr/include/GL/osmesa.h:301:1: error: expected initializer before 'OSMesaGetProcAddress' 301 | OSMesaGetProcAddress( const char *funcName ); | ^~~~~~~~~~~~~~~~~~~~ /usr/include/GL/osmesa.h:310:1: error: expected initializer before 'OSMesaColorClamp' 310 | OSMesaColorClamp(GLboolean enable); | ^~~~~~~~~~~~~~~~ /usr/include/GL/osmesa.h:323:1: error: expected initializer before 'OSMesaPostprocess' 323 | OSMesaPostprocess(OSMesaContext osmesa, const char *filter, | ^~~~~~~~~~~~~~~~~ make: *** [Makefile:364: drawpath3.o] Error 1 x86_64-pld-linux-gnux32-g++ -Wall -DHAVE_CONFIG_H -D_FILE_OFFSET_BITS=64 -DUSEGC -DFFTWPP_SINGLE_THREAD -I. -I/usr/include/gc -I/usr/include/gc -I/usr/include/tirpc -O2 -fwrapv -pipe -Wformat -Werror=format-security -gdwarf-4 -fno-debug-types-section -fvar-tracking-assignments -g2 -Wp,-D_FORTIFY_SOURCE=2 -fstack-protector-strong --param=ssp-buffer-size=4 -Werror=trampolines -fPIC -mtune=generic -march=x86-64 -gdwarf-4 -fno-debug-types-section -fvar-tracking-assignments -g2 -O2 -fwrapv -pipe -Wformat -Werror=format-security -gdwarf-4 -fno-debug-types-section -fvar-tracking-assignments -g2 -Wp,-D_FORTIFY_SOURCE=2 -fstack-protector-strong --param=ssp-buffer-size=4 -Werror=trampolines -fPIC -mtune=generic -march=x86-64 -gdwarf-4 -fno-debug-types-section -fvar-tracking-assignments -g2 -fno-var-tracking -o knot.o -c knot.cc x86_64-pld-linux-gnux32-g++ -Wall -DHAVE_CONFIG_H -D_FILE_OFFSET_BITS=64 -DUSEGC -DFFTWPP_SINGLE_THREAD -I. -I/usr/include/gc -I/usr/include/gc -I/usr/include/tirpc -O2 -fwrapv -pipe -Wformat -Werror=format-security -gdwarf-4 -fno-debug-types-section -fvar-tracking-assignments -g2 -Wp,-D_FORTIFY_SOURCE=2 -fstack-protector-strong --param=ssp-buffer-size=4 -Werror=trampolines -fPIC -mtune=generic -march=x86-64 -gdwarf-4 -fno-debug-types-section -fvar-tracking-assignments -g2 -O2 -fwrapv -pipe -Wformat -Werror=format-security -gdwarf-4 -fno-debug-types-section -fvar-tracking-assignments -g2 -Wp,-D_FORTIFY_SOURCE=2 -fstack-protector-strong --param=ssp-buffer-size=4 -Werror=trampolines -fPIC -mtune=generic -march=x86-64 -gdwarf-4 -fno-debug-types-section -fvar-tracking-assignments -g2 -fno-var-tracking -o newexp.o -c newexp.cc x86_64-pld-linux-gnux32-g++ -Wall -DHAVE_CONFIG_H -D_FILE_OFFSET_BITS=64 -DUSEGC -DFFTWPP_SINGLE_THREAD -I. -I/usr/include/gc -I/usr/include/gc -I/usr/include/tirpc -O2 -fwrapv -pipe -Wformat -Werror=format-security -gdwarf-4 -fno-debug-types-section -fvar-tracking-assignments -g2 -Wp,-D_FORTIFY_SOURCE=2 -fstack-protector-strong --param=ssp-buffer-size=4 -Werror=trampolines -fPIC -mtune=generic -march=x86-64 -gdwarf-4 -fno-debug-types-section -fvar-tracking-assignments -g2 -O2 -fwrapv -pipe -Wformat -Werror=format-security -gdwarf-4 -fno-debug-types-section -fvar-tracking-assignments -g2 -Wp,-D_FORTIFY_SOURCE=2 -fstack-protector-strong --param=ssp-buffer-size=4 -Werror=trampolines -fPIC -mtune=generic -march=x86-64 -gdwarf-4 -fno-debug-types-section -fvar-tracking-assignments -g2 -fno-var-tracking -o env.o -c env.cc x86_64-pld-linux-gnux32-g++ -Wall -DHAVE_CONFIG_H -D_FILE_OFFSET_BITS=64 -DUSEGC -DFFTWPP_SINGLE_THREAD -I. -I/usr/include/gc -I/usr/include/gc -I/usr/include/tirpc -O2 -fwrapv -pipe -Wformat -Werror=format-security -gdwarf-4 -fno-debug-types-section -fvar-tracking-assignments -g2 -Wp,-D_FORTIFY_SOURCE=2 -fstack-protector-strong --param=ssp-buffer-size=4 -Werror=trampolines -fPIC -mtune=generic -march=x86-64 -gdwarf-4 -fno-debug-types-section -fvar-tracking-assignments -g2 -O2 -fwrapv -pipe -Wformat -Werror=format-security -gdwarf-4 -fno-debug-types-section -fvar-tracking-assignments -g2 -Wp,-D_FORTIFY_SOURCE=2 -fstack-protector-strong --param=ssp-buffer-size=4 -Werror=trampolines -fPIC -mtune=generic -march=x86-64 -gdwarf-4 -fno-debug-types-section -fvar-tracking-assignments -g2 -fno-var-tracking -o entry.o -c entry.cc x86_64-pld-linux-gnux32-g++ -Wall -DHAVE_CONFIG_H -D_FILE_OFFSET_BITS=64 -DUSEGC -DFFTWPP_SINGLE_THREAD -I. -I/usr/include/gc -I/usr/include/gc -I/usr/include/tirpc -O2 -fwrapv -pipe -Wformat -Werror=format-security -gdwarf-4 -fno-debug-types-section -fvar-tracking-assignments -g2 -Wp,-D_FORTIFY_SOURCE=2 -fstack-protector-strong --param=ssp-buffer-size=4 -Werror=trampolines -fPIC -mtune=generic -march=x86-64 -gdwarf-4 -fno-debug-types-section -fvar-tracking-assignments -g2 -O2 -fwrapv -pipe -Wformat -Werror=format-security -gdwarf-4 -fno-debug-types-section -fvar-tracking-assignments -g2 -Wp,-D_FORTIFY_SOURCE=2 -fstack-protector-strong --param=ssp-buffer-size=4 -Werror=trampolines -fPIC -mtune=generic -march=x86-64 -gdwarf-4 -fno-debug-types-section -fvar-tracking-assignments -g2 -fno-var-tracking -o genv.o -c genv.cc x86_64-pld-linux-gnux32-g++ -Wall -DHAVE_CONFIG_H -D_FILE_OFFSET_BITS=64 -DUSEGC -DFFTWPP_SINGLE_THREAD -I. -I/usr/include/gc -I/usr/include/gc -I/usr/include/tirpc -O2 -fwrapv -pipe -Wformat -Werror=format-security -gdwarf-4 -fno-debug-types-section -fvar-tracking-assignments -g2 -Wp,-D_FORTIFY_SOURCE=2 -fstack-protector-strong --param=ssp-buffer-size=4 -Werror=trampolines -fPIC -mtune=generic -march=x86-64 -gdwarf-4 -fno-debug-types-section -fvar-tracking-assignments -g2 -O2 -fwrapv -pipe -Wformat -Werror=format-security -gdwarf-4 -fno-debug-types-section -fvar-tracking-assignments -g2 -Wp,-D_FORTIFY_SOURCE=2 -fstack-protector-strong --param=ssp-buffer-size=4 -Werror=trampolines -fPIC -mtune=generic -march=x86-64 -gdwarf-4 -fno-debug-types-section -fvar-tracking-assignments -g2 -fno-var-tracking -o picture.o -c picture.cc In file included from glrender.h:64, from drawelement.h:21, from picture.h:15, from picture.cc:10: /usr/include/GL/osmesa.h:125:1: error: expected initializer before 'OSMesaCreateContext' 125 | OSMesaCreateContext( GLenum format, OSMesaContext sharelist ); | ^~~~~~~~~~~~~~~~~~~ /usr/include/GL/osmesa.h:138:1: error: expected initializer before 'OSMesaCreateContextExt' 138 | OSMesaCreateContextExt( GLenum format, GLint depthBits, GLint stencilBits, | ^~~~~~~~~~~~~~~~~~~~~~ /usr/include/GL/osmesa.h:167:1: error: expected initializer before 'OSMesaCreateContextAttribs' 167 | OSMesaCreateContextAttribs( const int *attribList, OSMesaContext sharelist ); | ^~~~~~~~~~~~~~~~~~~~~~~~~~ /usr/include/GL/osmesa.h:177:1: error: expected initializer before 'OSMesaDestroyContext' 177 | OSMesaDestroyContext( OSMesaContext ctx ); | ^~~~~~~~~~~~~~~~~~~~ /usr/include/GL/osmesa.h:209:1: error: expected initializer before 'OSMesaMakeCurrent' 209 | OSMesaMakeCurrent( OSMesaContext ctx, void *buffer, GLenum type, | ^~~~~~~~~~~~~~~~~ /usr/include/GL/osmesa.h:219:1: error: expected initializer before 'OSMesaGetCurrentContext' 219 | OSMesaGetCurrentContext( void ); | ^~~~~~~~~~~~~~~~~~~~~~~ /usr/include/GL/osmesa.h:237:1: error: expected initializer before 'OSMesaPixelStore' 237 | OSMesaPixelStore( GLint pname, GLint value ); | ^~~~~~~~~~~~~~~~ /usr/include/GL/osmesa.h:253:1: error: expected initializer before 'OSMesaGetIntegerv' 253 | OSMesaGetIntegerv( GLint pname, GLint *value ); | ^~~~~~~~~~~~~~~~~ /usr/include/GL/osmesa.h:268:1: error: expected initializer before 'OSMesaGetDepthBuffer' 268 | OSMesaGetDepthBuffer( OSMesaContext c, GLint *width, GLint *height, | ^~~~~~~~~~~~~~~~~~~~ /usr/include/GL/osmesa.h:284:1: error: expected initializer before 'OSMesaGetColorBuffer' 284 | OSMesaGetColorBuffer( OSMesaContext c, GLint *width, GLint *height, | ^~~~~~~~~~~~~~~~~~~~ /usr/include/GL/osmesa.h:301:1: error: expected initializer before 'OSMesaGetProcAddress' 301 | OSMesaGetProcAddress( const char *funcName ); | ^~~~~~~~~~~~~~~~~~~~ /usr/include/GL/osmesa.h:310:1: error: expected initializer before 'OSMesaColorClamp' 310 | OSMesaColorClamp(GLboolean enable); | ^~~~~~~~~~~~~~~~ /usr/include/GL/osmesa.h:323:1: error: expected initializer before 'OSMesaPostprocess' 323 | OSMesaPostprocess(OSMesaContext osmesa, const char *filter, | ^~~~~~~~~~~~~~~~~ make: *** [Makefile:364: picture.o] Error 1 x86_64-pld-linux-gnux32-g++ -Wall -DHAVE_CONFIG_H -D_FILE_OFFSET_BITS=64 -DUSEGC -DFFTWPP_SINGLE_THREAD -I. -I/usr/include/gc -I/usr/include/gc -I/usr/include/tirpc -O2 -fwrapv -pipe -Wformat -Werror=format-security -gdwarf-4 -fno-debug-types-section -fvar-tracking-assignments -g2 -Wp,-D_FORTIFY_SOURCE=2 -fstack-protector-strong --param=ssp-buffer-size=4 -Werror=trampolines -fPIC -mtune=generic -march=x86-64 -gdwarf-4 -fno-debug-types-section -fvar-tracking-assignments -g2 -O2 -fwrapv -pipe -Wformat -Werror=format-security -gdwarf-4 -fno-debug-types-section -fvar-tracking-assignments -g2 -Wp,-D_FORTIFY_SOURCE=2 -fstack-protector-strong --param=ssp-buffer-size=4 -Werror=trampolines -fPIC -mtune=generic -march=x86-64 -gdwarf-4 -fno-debug-types-section -fvar-tracking-assignments -g2 -fno-var-tracking -o drawsurface.o -c drawsurface.cc In file included from glrender.h:64, from drawelement.h:21, from drawsurface.h:10, from drawsurface.cc:7: /usr/include/GL/osmesa.h:125:1: error: expected initializer before 'OSMesaCreateContext' 125 | OSMesaCreateContext( GLenum format, OSMesaContext sharelist ); | ^~~~~~~~~~~~~~~~~~~ /usr/include/GL/osmesa.h:138:1: error: expected initializer before 'OSMesaCreateContextExt' 138 | OSMesaCreateContextExt( GLenum format, GLint depthBits, GLint stencilBits, | ^~~~~~~~~~~~~~~~~~~~~~ /usr/include/GL/osmesa.h:167:1: error: expected initializer before 'OSMesaCreateContextAttribs' 167 | OSMesaCreateContextAttribs( const int *attribList, OSMesaContext sharelist ); | ^~~~~~~~~~~~~~~~~~~~~~~~~~ /usr/include/GL/osmesa.h:177:1: error: expected initializer before 'OSMesaDestroyContext' 177 | OSMesaDestroyContext( OSMesaContext ctx ); | ^~~~~~~~~~~~~~~~~~~~ /usr/include/GL/osmesa.h:209:1: error: expected initializer before 'OSMesaMakeCurrent' 209 | OSMesaMakeCurrent( OSMesaContext ctx, void *buffer, GLenum type, | ^~~~~~~~~~~~~~~~~ /usr/include/GL/osmesa.h:219:1: error: expected initializer before 'OSMesaGetCurrentContext' 219 | OSMesaGetCurrentContext( void ); | ^~~~~~~~~~~~~~~~~~~~~~~ /usr/include/GL/osmesa.h:237:1: error: expected initializer before 'OSMesaPixelStore' 237 | OSMesaPixelStore( GLint pname, GLint value ); | ^~~~~~~~~~~~~~~~ /usr/include/GL/osmesa.h:253:1: error: expected initializer before 'OSMesaGetIntegerv' 253 | OSMesaGetIntegerv( GLint pname, GLint *value ); | ^~~~~~~~~~~~~~~~~ /usr/include/GL/osmesa.h:268:1: error: expected initializer before 'OSMesaGetDepthBuffer' 268 | OSMesaGetDepthBuffer( OSMesaContext c, GLint *width, GLint *height, | ^~~~~~~~~~~~~~~~~~~~ /usr/include/GL/osmesa.h:284:1: error: expected initializer before 'OSMesaGetColorBuffer' 284 | OSMesaGetColorBuffer( OSMesaContext c, GLint *width, GLint *height, | ^~~~~~~~~~~~~~~~~~~~ /usr/include/GL/osmesa.h:301:1: error: expected initializer before 'OSMesaGetProcAddress' 301 | OSMesaGetProcAddress( const char *funcName ); | ^~~~~~~~~~~~~~~~~~~~ /usr/include/GL/osmesa.h:310:1: error: expected initializer before 'OSMesaColorClamp' 310 | OSMesaColorClamp(GLboolean enable); | ^~~~~~~~~~~~~~~~ /usr/include/GL/osmesa.h:323:1: error: expected initializer before 'OSMesaPostprocess' 323 | OSMesaPostprocess(OSMesaContext osmesa, const char *filter, | ^~~~~~~~~~~~~~~~~ make: *** [Makefile:364: drawsurface.o] Error 1 x86_64-pld-linux-gnux32-g++ -Wall -DHAVE_CONFIG_H -D_FILE_OFFSET_BITS=64 -DUSEGC -DFFTWPP_SINGLE_THREAD -I. -I/usr/include/gc -I/usr/include/gc -I/usr/include/tirpc -O2 -fwrapv -pipe -Wformat -Werror=format-security -gdwarf-4 -fno-debug-types-section -fvar-tracking-assignments -g2 -Wp,-D_FORTIFY_SOURCE=2 -fstack-protector-strong --param=ssp-buffer-size=4 -Werror=trampolines -fPIC -mtune=generic -march=x86-64 -gdwarf-4 -fno-debug-types-section -fvar-tracking-assignments -g2 -O2 -fwrapv -pipe -Wformat -Werror=format-security -gdwarf-4 -fno-debug-types-section -fvar-tracking-assignments -g2 -Wp,-D_FORTIFY_SOURCE=2 -fstack-protector-strong --param=ssp-buffer-size=4 -Werror=trampolines -fPIC -mtune=generic -march=x86-64 -gdwarf-4 -fno-debug-types-section -fvar-tracking-assignments -g2 -fno-var-tracking -o dec.o -c dec.cc x86_64-pld-linux-gnux32-g++ -Wall -DHAVE_CONFIG_H -D_FILE_OFFSET_BITS=64 -DUSEGC -DFFTWPP_SINGLE_THREAD -I. -I/usr/include/gc -I/usr/include/gc -I/usr/include/tirpc -O2 -fwrapv -pipe -Wformat -Werror=format-security -gdwarf-4 -fno-debug-types-section -fvar-tracking-assignments -g2 -Wp,-D_FORTIFY_SOURCE=2 -fstack-protector-strong --param=ssp-buffer-size=4 -Werror=trampolines -fPIC -mtune=generic -march=x86-64 -gdwarf-4 -fno-debug-types-section -fvar-tracking-assignments -g2 -O2 -fwrapv -pipe -Wformat -Werror=format-security -gdwarf-4 -fno-debug-types-section -fvar-tracking-assignments -g2 -Wp,-D_FORTIFY_SOURCE=2 -fstack-protector-strong --param=ssp-buffer-size=4 -Werror=trampolines -fPIC -mtune=generic -march=x86-64 -gdwarf-4 -fno-debug-types-section -fvar-tracking-assignments -g2 -fno-var-tracking -o path.o -c path.cc x86_64-pld-linux-gnux32-g++ -Wall -DHAVE_CONFIG_H -D_FILE_OFFSET_BITS=64 -DUSEGC -DFFTWPP_SINGLE_THREAD -I. -I/usr/include/gc -I/usr/include/gc -I/usr/include/tirpc -O2 -fwrapv -pipe -Wformat -Werror=format-security -gdwarf-4 -fno-debug-types-section -fvar-tracking-assignments -g2 -Wp,-D_FORTIFY_SOURCE=2 -fstack-protector-strong --param=ssp-buffer-size=4 -Werror=trampolines -fPIC -mtune=generic -march=x86-64 -gdwarf-4 -fno-debug-types-section -fvar-tracking-assignments -g2 -O2 -fwrapv -pipe -Wformat -Werror=format-security -gdwarf-4 -fno-debug-types-section -fvar-tracking-assignments -g2 -Wp,-D_FORTIFY_SOURCE=2 -fstack-protector-strong --param=ssp-buffer-size=4 -Werror=trampolines -fPIC -mtune=generic -march=x86-64 -gdwarf-4 -fno-debug-types-section -fvar-tracking-assignments -g2 -fno-var-tracking -o stm.o -c stm.cc x86_64-pld-linux-gnux32-g++ -Wall -DHAVE_CONFIG_H -D_FILE_OFFSET_BITS=64 -DUSEGC -DFFTWPP_SINGLE_THREAD -I. -I/usr/include/gc -I/usr/include/gc -I/usr/include/tirpc -O2 -fwrapv -pipe -Wformat -Werror=format-security -gdwarf-4 -fno-debug-types-section -fvar-tracking-assignments -g2 -Wp,-D_FORTIFY_SOURCE=2 -fstack-protector-strong --param=ssp-buffer-size=4 -Werror=trampolines -fPIC -mtune=generic -march=x86-64 -gdwarf-4 -fno-debug-types-section -fvar-tracking-assignments -g2 -O2 -fwrapv -pipe -Wformat -Werror=format-security -gdwarf-4 -fno-debug-types-section -fvar-tracking-assignments -g2 -Wp,-D_FORTIFY_SOURCE=2 -fstack-protector-strong --param=ssp-buffer-size=4 -Werror=trampolines -fPIC -mtune=generic -march=x86-64 -gdwarf-4 -fno-debug-types-section -fvar-tracking-assignments -g2 -fno-var-tracking -o psfile.o -c psfile.cc x86_64-pld-linux-gnux32-g++ -Wall -DHAVE_CONFIG_H -D_FILE_OFFSET_BITS=64 -DUSEGC -DFFTWPP_SINGLE_THREAD -I. -I/usr/include/gc -I/usr/include/gc -I/usr/include/tirpc -O2 -fwrapv -pipe -Wformat -Werror=format-security -gdwarf-4 -fno-debug-types-section -fvar-tracking-assignments -g2 -Wp,-D_FORTIFY_SOURCE=2 -fstack-protector-strong --param=ssp-buffer-size=4 -Werror=trampolines -fPIC -mtune=generic -march=x86-64 -gdwarf-4 -fno-debug-types-section -fvar-tracking-assignments -g2 -O2 -fwrapv -pipe -Wformat -Werror=format-security -gdwarf-4 -fno-debug-types-section -fvar-tracking-assignments -g2 -Wp,-D_FORTIFY_SOURCE=2 -fstack-protector-strong --param=ssp-buffer-size=4 -Werror=trampolines -fPIC -mtune=generic -march=x86-64 -gdwarf-4 -fno-debug-types-section -fvar-tracking-assignments -g2 -fno-var-tracking -o texfile.o -c texfile.cc x86_64-pld-linux-gnux32-g++ -Wall -DHAVE_CONFIG_H -D_FILE_OFFSET_BITS=64 -DUSEGC -DFFTWPP_SINGLE_THREAD -I. -I/usr/include/gc -I/usr/include/gc -I/usr/include/tirpc -O2 -fwrapv -pipe -Wformat -Werror=format-security -gdwarf-4 -fno-debug-types-section -fvar-tracking-assignments -g2 -Wp,-D_FORTIFY_SOURCE=2 -fstack-protector-strong --param=ssp-buffer-size=4 -Werror=trampolines -fPIC -mtune=generic -march=x86-64 -gdwarf-4 -fno-debug-types-section -fvar-tracking-assignments -g2 -O2 -fwrapv -pipe -Wformat -Werror=format-security -gdwarf-4 -fno-debug-types-section -fvar-tracking-assignments -g2 -Wp,-D_FORTIFY_SOURCE=2 -fstack-protector-strong --param=ssp-buffer-size=4 -Werror=trampolines -fPIC -mtune=generic -march=x86-64 -gdwarf-4 -fno-debug-types-section -fvar-tracking-assignments -g2 -fno-var-tracking -o lex.yy.o -c lex.yy.cc x86_64-pld-linux-gnux32-g++ -Wall -DHAVE_CONFIG_H -D_FILE_OFFSET_BITS=64 -DUSEGC -DFFTWPP_SINGLE_THREAD -I. -I/usr/include/gc -I/usr/include/gc -I/usr/include/tirpc -O2 -fwrapv -pipe -Wformat -Werror=format-security -gdwarf-4 -fno-debug-types-section -fvar-tracking-assignments -g2 -Wp,-D_FORTIFY_SOURCE=2 -fstack-protector-strong --param=ssp-buffer-size=4 -Werror=trampolines -fPIC -mtune=generic -march=x86-64 -gdwarf-4 -fno-debug-types-section -fvar-tracking-assignments -g2 -O2 -fwrapv -pipe -Wformat -Werror=format-security -gdwarf-4 -fno-debug-types-section -fvar-tracking-assignments -g2 -Wp,-D_FORTIFY_SOURCE=2 -fstack-protector-strong --param=ssp-buffer-size=4 -Werror=trampolines -fPIC -mtune=generic -march=x86-64 -gdwarf-4 -fno-debug-types-section -fvar-tracking-assignments -g2 -fno-var-tracking -o stack.o -c stack.cc x86_64-pld-linux-gnux32-g++ -Wall -DHAVE_CONFIG_H -D_FILE_OFFSET_BITS=64 -DUSEGC -DFFTWPP_SINGLE_THREAD -I. -I/usr/include/gc -I/usr/include/gc -I/usr/include/tirpc -O2 -fwrapv -pipe -Wformat -Werror=format-security -gdwarf-4 -fno-debug-types-section -fvar-tracking-assignments -g2 -Wp,-D_FORTIFY_SOURCE=2 -fstack-protector-strong --param=ssp-buffer-size=4 -Werror=trampolines -fPIC -mtune=generic -march=x86-64 -gdwarf-4 -fno-debug-types-section -fvar-tracking-assignments -g2 -O2 -fwrapv -pipe -Wformat -Werror=format-security -gdwarf-4 -fno-debug-types-section -fvar-tracking-assignments -g2 -Wp,-D_FORTIFY_SOURCE=2 -fstack-protector-strong --param=ssp-buffer-size=4 -Werror=trampolines -fPIC -mtune=generic -march=x86-64 -gdwarf-4 -fno-debug-types-section -fvar-tracking-assignments -g2 -fno-var-tracking -o path3.o -c path3.cc x86_64-pld-linux-gnux32-g++ -Wall -DHAVE_CONFIG_H -D_FILE_OFFSET_BITS=64 -DUSEGC -DFFTWPP_SINGLE_THREAD -I. -I/usr/include/gc -I/usr/include/gc -I/usr/include/tirpc -O2 -fwrapv -pipe -Wformat -Werror=format-security -gdwarf-4 -fno-debug-types-section -fvar-tracking-assignments -g2 -Wp,-D_FORTIFY_SOURCE=2 -fstack-protector-strong --param=ssp-buffer-size=4 -Werror=trampolines -fPIC -mtune=generic -march=x86-64 -gdwarf-4 -fno-debug-types-section -fvar-tracking-assignments -g2 -O2 -fwrapv -pipe -Wformat -Werror=format-security -gdwarf-4 -fno-debug-types-section -fvar-tracking-assignments -g2 -Wp,-D_FORTIFY_SOURCE=2 -fstack-protector-strong --param=ssp-buffer-size=4 -Werror=trampolines -fPIC -mtune=generic -march=x86-64 -gdwarf-4 -fno-debug-types-section -fvar-tracking-assignments -g2 -fno-var-tracking -o exp.o -c exp.cc x86_64-pld-linux-gnux32-g++ -Wall -E -DNOSYM -DHAVE_CONFIG_H -D_FILE_OFFSET_BITS=64 -DUSEGC -DFFTWPP_SINGLE_THREAD -I. -I/usr/include/gc -I/usr/include/gc -I/usr/include/tirpc -O2 -fwrapv -pipe -Wformat -Werror=format-security -gdwarf-4 -fno-debug-types-section -fvar-tracking-assignments -g2 -Wp,-D_FORTIFY_SOURCE=2 -fstack-protector-strong --param=ssp-buffer-size=4 -Werror=trampolines -fPIC -mtune=generic -march=x86-64 -gdwarf-4 -fno-debug-types-section -fvar-tracking-assignments -g2 -O2 -fwrapv -pipe -Wformat -Werror=format-security -gdwarf-4 -fno-debug-types-section -fvar-tracking-assignments -g2 -Wp,-D_FORTIFY_SOURCE=2 -fstack-protector-strong --param=ssp-buffer-size=4 -Werror=trampolines -fPIC -mtune=generic -march=x86-64 -gdwarf-4 -fno-debug-types-section -fvar-tracking-assignments -g2 -fno-var-tracking types.cc builtin.cc gsl.cc runtime.cc runbacktrace.cc runpicture.cc runlabel.cc runhistory.cc runarray.cc runfile.cc runsystem.cc runpair.cc runtriple.cc runpath.cc runpath3d.cc runstring.cc runmath.cc | \ perl ./findsym.pl allsymbols.h - x86_64-pld-linux-gnux32-g++ -Wall -DHAVE_CONFIG_H -D_FILE_OFFSET_BITS=64 -DUSEGC -DFFTWPP_SINGLE_THREAD -I. -I/usr/include/gc -I/usr/include/gc -I/usr/include/tirpc -O2 -fwrapv -pipe -Wformat -Werror=format-security -gdwarf-4 -fno-debug-types-section -fvar-tracking-assignments -g2 -Wp,-D_FORTIFY_SOURCE=2 -fstack-protector-strong --param=ssp-buffer-size=4 -Werror=trampolines -fPIC -mtune=generic -march=x86-64 -gdwarf-4 -fno-debug-types-section -fvar-tracking-assignments -g2 -O2 -fwrapv -pipe -Wformat -Werror=format-security -gdwarf-4 -fno-debug-types-section -fvar-tracking-assignments -g2 -Wp,-D_FORTIFY_SOURCE=2 -fstack-protector-strong --param=ssp-buffer-size=4 -Werror=trampolines -fPIC -mtune=generic -march=x86-64 -gdwarf-4 -fno-debug-types-section -fvar-tracking-assignments -g2 -fno-var-tracking -o camp.tab.o -c camp.tab.cc error: Bad exit status from /tmp/B.ycuf6fjf/BUILD/tmp/rpm-tmp.6ptPvk (%build) RPM build errors: Bad exit status from /tmp/B.ycuf6fjf/BUILD/tmp/rpm-tmp.6ptPvk (%build) ended at: Tue Jun 11 09:55:03 2024, done in 0:00:25.331273 error: No files produced. + chmod -R u+rwX /tmp/B.ycuf6fjf/BUILD + rm -rf /tmp/B.ycuf6fjf/tmp /tmp/B.ycuf6fjf/BUILD + rm -rf /tmp/B.ycuf6fjf Begin-PLD-Builder-Info Build-Time: user:188.26s sys:26.40s real:27.89s (faults io:16 non-io:2398899) End-PLD-Builder-Info
[Back to list of logs] [View rpm -qa of builder]