FailedOk

th/SRPMS[OK]
th/x32[OK]
th/i686[OK]
th/x86_64[OK]

ac/SRPMS[OK]
ac/i386[OK]
ac/i586[OK]
ac/i686[OK]
ac/alpha[OK]
ac/amd64[OK]
ac/athlon[OK]
ac/ppc[OK]
ac/sparc[OK]
ac/sparc64[OK]

Advanced Search
main()
Powered by PLD Linux
(c) 2002-2024 PLD Team
$Revision: 1.37 $
Powered by synergy.
Your IP: 44.211.31.134

asymptote f11d2e06-a001-47f0-ac4d-a23e0d5a540d

Status:Failed
Source URL:https://buildlogs.pld-linux.org/pld/th/x32/FAIL/asymptote,f11d2e06-a001-47f0-ac4d-a23e0d5a540d.bz2
text/plain URL:View!
rpm -qa of builder:View!
Date:2024/06/10 21:35:13
Runtime:0:00:26.042104

Toc:

  • error 1
  • rpm: error: Failed build dependencies:
  • error 2
  • rpm: error: Failed build dependencies:
  • error 3
  • rpm: error: Failed build dependencies:
  • prep
  • Executing(%prep): /bin/sh -e /tmp/B.bxfqee6a/BUILD/tmp/rpm-tmp.NQAgLn
  • build
  • Executing(%build): /bin/sh -e /tmp/B.bxfqee6a/BUILD/tmp/rpm-tmp.WD5k5T
  • error 4
  • /usr/include/GL/osmesa.h:125:1: error: expected initializer before 'OSMesaCreateContext'
  • error 5
  • /usr/include/GL/osmesa.h:138:1: error: expected initializer before 'OSMesaCreateContextExt'
  • error 6
  • /usr/include/GL/osmesa.h:167:1: error: expected initializer before 'OSMesaCreateContextAttribs'
  • error 7
  • /usr/include/GL/osmesa.h:177:1: error: expected initializer before 'OSMesaDestroyContext'
  • error 8
  • /usr/include/GL/osmesa.h:209:1: error: expected initializer before 'OSMesaMakeCurrent'
  • error 9
  • /usr/include/GL/osmesa.h:219:1: error: expected initializer before 'OSMesaGetCurrentContext'
  • error 10
  • /usr/include/GL/osmesa.h:237:1: error: expected initializer before 'OSMesaPixelStore'
  • error 11
  • /usr/include/GL/osmesa.h:253:1: error: expected initializer before 'OSMesaGetIntegerv'
  • error 12
  • /usr/include/GL/osmesa.h:268:1: error: expected initializer before 'OSMesaGetDepthBuffer'
  • error 13
  • /usr/include/GL/osmesa.h:284:1: error: expected initializer before 'OSMesaGetColorBuffer'
  • error 14
  • /usr/include/GL/osmesa.h:301:1: error: expected initializer before 'OSMesaGetProcAddress'
  • error 15
  • /usr/include/GL/osmesa.h:310:1: error: expected initializer before 'OSMesaColorClamp'
  • error 16
  • /usr/include/GL/osmesa.h:323:1: error: expected initializer before 'OSMesaPostprocess'
  • error 17
  • /usr/include/GL/osmesa.h:125:1: error: expected initializer before 'OSMesaCreateContext'
  • error 18
  • /usr/include/GL/osmesa.h:138:1: error: expected initializer before 'OSMesaCreateContextExt'
  • error 19
  • /usr/include/GL/osmesa.h:167:1: error: expected initializer before 'OSMesaCreateContextAttribs'
  • error 20
  • /usr/include/GL/osmesa.h:177:1: error: expected initializer before 'OSMesaDestroyContext'
  • error 21
  • /usr/include/GL/osmesa.h:209:1: error: expected initializer before 'OSMesaMakeCurrent'
  • error 22
  • /usr/include/GL/osmesa.h:219:1: error: expected initializer before 'OSMesaGetCurrentContext'
  • error 23
  • /usr/include/GL/osmesa.h:237:1: error: expected initializer before 'OSMesaPixelStore'
  • error 24
  • /usr/include/GL/osmesa.h:253:1: error: expected initializer before 'OSMesaGetIntegerv'
  • error 25
  • /usr/include/GL/osmesa.h:268:1: error: expected initializer before 'OSMesaGetDepthBuffer'
  • error 26
  • /usr/include/GL/osmesa.h:284:1: error: expected initializer before 'OSMesaGetColorBuffer'
  • error 27
  • /usr/include/GL/osmesa.h:301:1: error: expected initializer before 'OSMesaGetProcAddress'
  • error 28
  • /usr/include/GL/osmesa.h:310:1: error: expected initializer before 'OSMesaColorClamp'
  • error 29
  • /usr/include/GL/osmesa.h:323:1: error: expected initializer before 'OSMesaPostprocess'
  • error 30
  • /usr/include/GL/osmesa.h:125:1: error: expected initializer before 'OSMesaCreateContext'
  • error 31
  • /usr/include/GL/osmesa.h:138:1: error: expected initializer before 'OSMesaCreateContextExt'
  • error 32
  • /usr/include/GL/osmesa.h:167:1: error: expected initializer before 'OSMesaCreateContextAttribs'
  • error 33
  • /usr/include/GL/osmesa.h:177:1: error: expected initializer before 'OSMesaDestroyContext'
  • error 34
  • /usr/include/GL/osmesa.h:209:1: error: expected initializer before 'OSMesaMakeCurrent'
  • error 35
  • /usr/include/GL/osmesa.h:219:1: error: expected initializer before 'OSMesaGetCurrentContext'
  • error 36
  • /usr/include/GL/osmesa.h:237:1: error: expected initializer before 'OSMesaPixelStore'
  • error 37
  • /usr/include/GL/osmesa.h:253:1: error: expected initializer before 'OSMesaGetIntegerv'
  • error 38
  • /usr/include/GL/osmesa.h:268:1: error: expected initializer before 'OSMesaGetDepthBuffer'
  • error 39
  • /usr/include/GL/osmesa.h:284:1: error: expected initializer before 'OSMesaGetColorBuffer'
  • error 40
  • /usr/include/GL/osmesa.h:301:1: error: expected initializer before 'OSMesaGetProcAddress'
  • error 41
  • /usr/include/GL/osmesa.h:310:1: error: expected initializer before 'OSMesaColorClamp'
  • error 42
  • /usr/include/GL/osmesa.h:323:1: error: expected initializer before 'OSMesaPostprocess'
  • error 43
  • /usr/include/GL/osmesa.h:125:1: error: expected initializer before 'OSMesaCreateContext'
  • error 44
  • /usr/include/GL/osmesa.h:138:1: error: expected initializer before 'OSMesaCreateContextExt'
  • error 45
  • /usr/include/GL/osmesa.h:167:1: error: expected initializer before 'OSMesaCreateContextAttribs'
  • error 46
  • /usr/include/GL/osmesa.h:177:1: error: expected initializer before 'OSMesaDestroyContext'
  • error 47
  • /usr/include/GL/osmesa.h:209:1: error: expected initializer before 'OSMesaMakeCurrent'
  • error 48
  • /usr/include/GL/osmesa.h:219:1: error: expected initializer before 'OSMesaGetCurrentContext'
  • error 49
  • /usr/include/GL/osmesa.h:237:1: error: expected initializer before 'OSMesaPixelStore'
  • error 50
  • /usr/include/GL/osmesa.h:253:1: error: expected initializer before 'OSMesaGetIntegerv'
  • error 51
  • /usr/include/GL/osmesa.h:268:1: error: expected initializer before 'OSMesaGetDepthBuffer'
  • error 52
  • /usr/include/GL/osmesa.h:284:1: error: expected initializer before 'OSMesaGetColorBuffer'
  • error 53
  • /usr/include/GL/osmesa.h:301:1: error: expected initializer before 'OSMesaGetProcAddress'
  • error 54
  • /usr/include/GL/osmesa.h:310:1: error: expected initializer before 'OSMesaColorClamp'
  • error 55
  • /usr/include/GL/osmesa.h:323:1: error: expected initializer before 'OSMesaPostprocess'
  • error 56
  • /usr/include/GL/osmesa.h:125:1: error: expected initializer before 'OSMesaCreateContext'
  • error 57
  • /usr/include/GL/osmesa.h:138:1: error: expected initializer before 'OSMesaCreateContextExt'
  • error 58
  • /usr/include/GL/osmesa.h:167:1: error: expected initializer before 'OSMesaCreateContextAttribs'
  • error 59
  • /usr/include/GL/osmesa.h:177:1: error: expected initializer before 'OSMesaDestroyContext'
  • error 60
  • /usr/include/GL/osmesa.h:209:1: error: expected initializer before 'OSMesaMakeCurrent'
  • error 61
  • /usr/include/GL/osmesa.h:219:1: error: expected initializer before 'OSMesaGetCurrentContext'
  • error 62
  • /usr/include/GL/osmesa.h:237:1: error: expected initializer before 'OSMesaPixelStore'
  • error 63
  • /usr/include/GL/osmesa.h:253:1: error: expected initializer before 'OSMesaGetIntegerv'
  • error 64
  • /usr/include/GL/osmesa.h:268:1: error: expected initializer before 'OSMesaGetDepthBuffer'
  • error 65
  • /usr/include/GL/osmesa.h:284:1: error: expected initializer before 'OSMesaGetColorBuffer'
  • error 66
  • /usr/include/GL/osmesa.h:301:1: error: expected initializer before 'OSMesaGetProcAddress'
  • error 67
  • /usr/include/GL/osmesa.h:310:1: error: expected initializer before 'OSMesaColorClamp'
  • error 68
  • /usr/include/GL/osmesa.h:323:1: error: expected initializer before 'OSMesaPostprocess'
  • error 69
  • /usr/include/GL/osmesa.h:125:1: error: expected initializer before 'OSMesaCreateContext'
  • error 70
  • /usr/include/GL/osmesa.h:138:1: error: expected initializer before 'OSMesaCreateContextExt'
  • error 71
  • /usr/include/GL/osmesa.h:167:1: error: expected initializer before 'OSMesaCreateContextAttribs'
  • error 72
  • /usr/include/GL/osmesa.h:177:1: error: expected initializer before 'OSMesaDestroyContext'
  • error 73
  • /usr/include/GL/osmesa.h:209:1: error: expected initializer before 'OSMesaMakeCurrent'
  • error 74
  • /usr/include/GL/osmesa.h:219:1: error: expected initializer before 'OSMesaGetCurrentContext'
  • error 75
  • /usr/include/GL/osmesa.h:237:1: error: expected initializer before 'OSMesaPixelStore'
  • error 76
  • /usr/include/GL/osmesa.h:253:1: error: expected initializer before 'OSMesaGetIntegerv'
  • error 77
  • /usr/include/GL/osmesa.h:268:1: error: expected initializer before 'OSMesaGetDepthBuffer'
  • error 78
  • /usr/include/GL/osmesa.h:284:1: error: expected initializer before 'OSMesaGetColorBuffer'
  • error 79
  • /usr/include/GL/osmesa.h:301:1: error: expected initializer before 'OSMesaGetProcAddress'
  • error 80
  • /usr/include/GL/osmesa.h:310:1: error: expected initializer before 'OSMesaColorClamp'
  • error 81
  • /usr/include/GL/osmesa.h:323:1: error: expected initializer before 'OSMesaPostprocess'
  • error 82
  • /usr/include/GL/osmesa.h:125:1: error: expected initializer before 'OSMesaCreateContext'
  • error 83
  • /usr/include/GL/osmesa.h:138:1: error: expected initializer before 'OSMesaCreateContextExt'
  • error 84
  • /usr/include/GL/osmesa.h:167:1: error: expected initializer before 'OSMesaCreateContextAttribs'
  • error 85
  • /usr/include/GL/osmesa.h:177:1: error: expected initializer before 'OSMesaDestroyContext'
  • error 86
  • /usr/include/GL/osmesa.h:209:1: error: expected initializer before 'OSMesaMakeCurrent'
  • error 87
  • /usr/include/GL/osmesa.h:219:1: error: expected initializer before 'OSMesaGetCurrentContext'
  • error 88
  • /usr/include/GL/osmesa.h:237:1: error: expected initializer before 'OSMesaPixelStore'
  • error 89
  • /usr/include/GL/osmesa.h:253:1: error: expected initializer before 'OSMesaGetIntegerv'
  • error 90
  • /usr/include/GL/osmesa.h:268:1: error: expected initializer before 'OSMesaGetDepthBuffer'
  • error 91
  • /usr/include/GL/osmesa.h:284:1: error: expected initializer before 'OSMesaGetColorBuffer'
  • error 92
  • /usr/include/GL/osmesa.h:301:1: error: expected initializer before 'OSMesaGetProcAddress'
  • error 93
  • /usr/include/GL/osmesa.h:310:1: error: expected initializer before 'OSMesaColorClamp'
  • error 94
  • /usr/include/GL/osmesa.h:323:1: error: expected initializer before 'OSMesaPostprocess'
  • error 95
  • /usr/include/GL/osmesa.h:125:1: error: expected initializer before 'OSMesaCreateContext'
  • error 96
  • /usr/include/GL/osmesa.h:138:1: error: expected initializer before 'OSMesaCreateContextExt'
  • error 97
  • /usr/include/GL/osmesa.h:167:1: error: expected initializer before 'OSMesaCreateContextAttribs'
  • error 98
  • /usr/include/GL/osmesa.h:177:1: error: expected initializer before 'OSMesaDestroyContext'
  • error 99
  • /usr/include/GL/osmesa.h:209:1: error: expected initializer before 'OSMesaMakeCurrent'
  • error 100
  • /usr/include/GL/osmesa.h:219:1: error: expected initializer before 'OSMesaGetCurrentContext'
  • error 101
  • /usr/include/GL/osmesa.h:237:1: error: expected initializer before 'OSMesaPixelStore'
  • error 102
  • /usr/include/GL/osmesa.h:253:1: error: expected initializer before 'OSMesaGetIntegerv'
  • error 103
  • /usr/include/GL/osmesa.h:268:1: error: expected initializer before 'OSMesaGetDepthBuffer'
  • error 104
  • /usr/include/GL/osmesa.h:284:1: error: expected initializer before 'OSMesaGetColorBuffer'
  • error 105
  • /usr/include/GL/osmesa.h:301:1: error: expected initializer before 'OSMesaGetProcAddress'
  • error 106
  • /usr/include/GL/osmesa.h:310:1: error: expected initializer before 'OSMesaColorClamp'
  • error 107
  • /usr/include/GL/osmesa.h:323:1: error: expected initializer before 'OSMesaPostprocess'
  • error 108
  • /usr/include/GL/osmesa.h:125:1: error: expected initializer before 'OSMesaCreateContext'
  • error 109
  • /usr/include/GL/osmesa.h:138:1: error: expected initializer before 'OSMesaCreateContextExt'
  • error 110
  • /usr/include/GL/osmesa.h:167:1: error: expected initializer before 'OSMesaCreateContextAttribs'
  • error 111
  • /usr/include/GL/osmesa.h:177:1: error: expected initializer before 'OSMesaDestroyContext'
  • error 112
  • /usr/include/GL/osmesa.h:209:1: error: expected initializer before 'OSMesaMakeCurrent'
  • error 113
  • /usr/include/GL/osmesa.h:219:1: error: expected initializer before 'OSMesaGetCurrentContext'
  • error 114
  • /usr/include/GL/osmesa.h:237:1: error: expected initializer before 'OSMesaPixelStore'
  • error 115
  • /usr/include/GL/osmesa.h:253:1: error: expected initializer before 'OSMesaGetIntegerv'
  • error 116
  • /usr/include/GL/osmesa.h:268:1: error: expected initializer before 'OSMesaGetDepthBuffer'
  • error 117
  • /usr/include/GL/osmesa.h:284:1: error: expected initializer before 'OSMesaGetColorBuffer'
  • error 118
  • /usr/include/GL/osmesa.h:301:1: error: expected initializer before 'OSMesaGetProcAddress'
  • error 119
  • /usr/include/GL/osmesa.h:310:1: error: expected initializer before 'OSMesaColorClamp'
  • error 120
  • /usr/include/GL/osmesa.h:323:1: error: expected initializer before 'OSMesaPostprocess'
  • error 121
  • /usr/include/GL/osmesa.h:125:1: error: expected initializer before 'OSMesaCreateContext'
  • error 122
  • /usr/include/GL/osmesa.h:138:1: error: expected initializer before 'OSMesaCreateContextExt'
  • error 123
  • /usr/include/GL/osmesa.h:167:1: error: expected initializer before 'OSMesaCreateContextAttribs'
  • error 124
  • /usr/include/GL/osmesa.h:177:1: error: expected initializer before 'OSMesaDestroyContext'
  • error 125
  • /usr/include/GL/osmesa.h:209:1: error: expected initializer before 'OSMesaMakeCurrent'
  • error 126
  • /usr/include/GL/osmesa.h:219:1: error: expected initializer before 'OSMesaGetCurrentContext'
  • error 127
  • /usr/include/GL/osmesa.h:237:1: error: expected initializer before 'OSMesaPixelStore'
  • error 128
  • /usr/include/GL/osmesa.h:253:1: error: expected initializer before 'OSMesaGetIntegerv'
  • error 129
  • /usr/include/GL/osmesa.h:268:1: error: expected initializer before 'OSMesaGetDepthBuffer'
  • error 130
  • /usr/include/GL/osmesa.h:284:1: error: expected initializer before 'OSMesaGetColorBuffer'
  • error 131
  • /usr/include/GL/osmesa.h:301:1: error: expected initializer before 'OSMesaGetProcAddress'
  • error 132
  • /usr/include/GL/osmesa.h:310:1: error: expected initializer before 'OSMesaColorClamp'
  • error 133
  • /usr/include/GL/osmesa.h:323:1: error: expected initializer before 'OSMesaPostprocess'
  • error 134
  • error: Bad exit status from /tmp/B.bxfqee6a/BUILD/tmp/rpm-tmp.WD5k5T (%build)
  • error 135
  • RPM build errors:
  • error 136
  • error: No files produced.

Content:

request from: qboosh
checking if we should skip the build
started at: Mon Jun 10 21:34:25 2024
killing old processes on a builder
sending signal 9 to pid -1
cleaning up /tmp
fetching https://srcbuilder.pld-linux.org/th//srpms/f11d2e06-a001-47f0-ac4d-a23e0d5a540d/asymptote-2.70-1.src.rpm
fetched 4676563 bytes, 8883.0 K/s
installing srpm: asymptote-2.70-1.src.rpm
+ install -d /tmp/B.bxfqee6a/BUILD /tmp/B.bxfqee6a/RPMS
+ LC_ALL=en_US.UTF-8
+ rpm -qp --changelog asymptote-2.70-1.src.rpm
* Mon Jun 10 2024 PLD Linux Team <feedback@pld-linux.org>
- For complete changelog see: http://git.pld-linux.org/?p=packages/asymptote.git;a=log;h=master
* Thu May 30 2024 Jakub Bogusz <qboosh@pld-linux.org> b68d878
- updated GLM dependency * Fri Dec 03 2021 Jan Rękorajski <baggins@pld-linux.org> 0c37749
- up to 2.70 * Thu Dec 26 2019 Jakub Bogusz <qboosh@pld-linux.org> 4d13f96
- removed outdated todo * Mon Dec 23 2019 Jakub Bogusz <qboosh@pld-linux.org> 13b8bb6
- despite requirements.txt entry, rsvg-convert is utility from librsvg, not python module * Mon Dec 23 2019 Jakub Bogusz <qboosh@pld-linux.org> d31a944
- updated to 2.61 - added no-env patch (don't place unnecessary shebang in xasyVersion.py) - updated python dependencies in -gui - with fixed libOSMesa docs should build on all archs (supported by Mesa) - enabled OpenImageIO by default * Mon Nov 04 2019 Jan Rękorajski <baggins@pld-linux.org> 6020b85
- release 4 (by relup.sh) * Mon Nov 04 2019 Jan Rękorajski <baggins@pld-linux.org> 73d1211
- add doc bcond * Sun Nov 03 2019 Jan Rękorajski <baggins@pld-linux.org> 7296557
- release 3 (by relup.sh) * Tue Oct 29 2019 Jakub Bogusz <qboosh@pld-linux.org> c83c549
- added info patch (unify direntry) - release 2 (rebuild with gsl 2.6) * Sun Oct 20 2019 Jan Rękorajski <baggins@pld-linux.org> 7586670
- up to 2.59 * Thu Oct 17 2019 Arkadiusz Miśkiewicz <arekm@maven.pl> f0d71ab
- release 2 (by relup.sh) * Sun Jun 25 2017 Jakub Bogusz <qboosh@pld-linux.org> bc62224
- updated to 2.41 - removed obsolete gsl2 patch * Tue Oct 18 2016 Jan Rękorajski <baggins@pld-linux.org> 40f3f24
- rebuild with readline 7.0 - release 5 (by relup.sh) * Sun Dec 27 2015 Jan Rękorajski <baggins@pld-linux.org> 6a8a337
- fix building with gsl 2.x - rel 4 * Fri Dec 25 2015 Jan Rękorajski <baggins@pld-linux.org> a9cdcb7
- release 3 (by relup.sh) * Thu Dec 24 2015 Jan Rękorajski <baggins@pld-linux.org> c054827
- release 2 (by relup.sh) * Thu Aug 06 2015 Jan Rękorajski <baggins@pld-linux.org> 097ab2b
- up to 2.35 * Sun Mar 22 2015 Elan Ruusamäe <glen@delfi.ee> c854ad4
- missing fix-info-dir * Sun Jul 07 2013 Artur Frysiak <artur@frysiak.net> 9425d43
- Up to 2.23 * Thu May 31 2012 Zsolt Udvari <uzsolt@pld-linux.org> acab572
- 2.16 + rpm -Uhv --nodeps --define '_topdir /tmp/B.bxfqee6a' --define '_specdir %{_topdir}' --define '_sourcedir %{_specdir}' --define '_rpmdir %{_topdir}/RPMS' --define '_builddir %{_topdir}/BUILD' asymptote-2.70-1.src.rpm Updating / installing... asymptote-2.70-1 ######################################## + rm -f asymptote-2.70-1.src.rpm + install -m 700 -d /tmp/B.bxfqee6a/BUILD/tmp + TMPDIR=/tmp/B.bxfqee6a/BUILD/tmp + exec nice -n 0 rpmbuild -bp --short-circuit --nodeps --define '_topdir /tmp/B.bxfqee6a' --define '_specdir %{_topdir}' --define '_sourcedir %{_specdir}' --define '_rpmdir %{_topdir}/RPMS' --define '_builddir %{_topdir}/BUILD' --target x32-pld-linux --define 'prep exit 0' /tmp/B.bxfqee6a/asymptote.spec Building target platforms: x32-pld-linux Building for target x32-pld-linux checking BuildConflict-ing packages rpm: error: Failed build dependencies: rpm: Mesa-libOSMesa-devel is needed by asymptote-2.70-1.x32 rpm: OpenImageIO-devel is needed by asymptote-2.70-1.x32 rpm: gc-c++-devel >= 8.0.4 is needed by asymptote-2.70-1.x32 rpm: texinfo-texi2dvi >= 6.7 is needed by asymptote-2.70-1.x32 rpm: Building target platforms: x32-pld-linux rpm: Building for target x32-pld-linux no BuildConflicts found checking BR rpm: error: Failed build dependencies: rpm: Mesa-libOSMesa-devel is needed by asymptote-2.70-1.x32 rpm: OpenImageIO-devel is needed by asymptote-2.70-1.x32 rpm: gc-c++-devel >= 8.0.4 is needed by asymptote-2.70-1.x32 rpm: texinfo-texi2dvi >= 6.7 is needed by asymptote-2.70-1.x32 rpm: Building target platforms: x32-pld-linux rpm: Building for target x32-pld-linux updating poldek cache... ready is up to date th is up to date th is up to date th-ready is up to date th-ready is up to date Retrieving diff::packages.ndir.2024.06.10-18.10.05.gz......................................done Loading [pndir]th-test... Applying packages.ndir.2024.06.10-18.10.05.gz... Writing /root/.cache/poldek/[...]/packages.ndir.gz... Retrieving th-test::packages.ndir.diff.toc.gz..............................................done Retrieving diff::packages.ndir.2024.06.10-17.27.05.gz......................................done Loading [pndir]th-test... Applying packages.ndir.2024.06.10-17.27.05.gz... Writing /root/.cache/poldek/[...]/packages.ndir.gz... checking conflicting packages in BRed packages poldek: Loading [pndir]ready... poldek: Loading [pndir]th-test... poldek: Loading [pndir]th-test... poldek: Loading [pndir]th-ready... poldek: Loading [pndir]th-ready... poldek: Loading [pndir]th... poldek: Loading [pndir]th... poldek: 31299 packages read poldek: Removed 2305 duplicate packages from available set poldek: Processing dependencies... poldek: Mesa-libOSMesa-devel-24.1.1-2.x32 marks Mesa-libOSMesa-24.1.1-2.x32 (cap Mesa-libOSMesa(x86-x32) = 24.1.1-2) poldek: OpenImageIO-devel-2.4.17.0-1.x32 marks OpenImageIO-2.4.17.0-1.x32 (cap OpenImageIO = 2.4.17.0-1) poldek: texinfo-texi2dvi-7.1-3.x32 marks texlive-plain-20080816-44.noarch (cap texlive-plain) poldek: There are 7 packages to install (3 marked by dependencies): poldek: A Mesa-libOSMesa-24.1.1-2.x32 Mesa-libOSMesa-devel-24.1.1-2.x32 poldek: A OpenImageIO-2.4.17.0-1.x32 OpenImageIO-devel-2.4.17.0-1.x32 poldek: A gc-c++-devel-8.2.4-1.x32 texinfo-texi2dvi-7.1-3.x32 poldek: A texlive-plain-20080816-44.noarch poldek: This operation will use 29.5MB of disk space. poldek: Need to get 7.5MB of archives (4.6MB to download). poldek: poldek: Mesa-libOSMesa-24.1.1-2.x32.rpm: digests OK poldek: Mesa-libOSMesa-devel-24.1.1-2.x32.rpm: digests OK poldek: Retrieving [1/5] th::OpenImageIO-2.4.17.0-1.x32.rpm........................................done poldek: Retrieving [2/5] th::OpenImageIO-devel-2.4.17.0-1.x32.rpm..................................done poldek: Retrieving [3/5] th::gc-c++-devel-8.2.4-1.x32.rpm..........................................done poldek: Retrieving [4/5] th::texinfo-texi2dvi-7.1-3.x32.rpm........................................done poldek: OpenImageIO-2.4.17.0-1.x32.rpm: digests OK poldek: OpenImageIO-devel-2.4.17.0-1.x32.rpm: digests OK poldek: gc-c++-devel-8.2.4-1.x32.rpm: digests OK poldek: texinfo-texi2dvi-7.1-3.x32.rpm: digests OK poldek: Retrieving [5/5] th::texlive-plain-20080816-44.noarch.rpm..................................done poldek: texlive-plain-20080816-44.noarch.rpm: digests OK poldek: Executing pm-command.sh --upgrade -vh --test --root / --define _check_dirname_deps 0... poldek: warning: /root/.cache/poldek/ftp_ftp1.pld-linux.org.dists.th.PLD.x32.RPMS/OpenImageIO-2.4.17.0-1.x32.rpm: Header V4 DSA/SHA1 Signature, key ID e4f1bc2d: NOKEY poldek: Verifying... ######################################## poldek: Preparing... ######################################## no conflicts found checking BR rpm: error: Failed build dependencies: rpm: Mesa-libOSMesa-devel is needed by asymptote-2.70-1.x32 rpm: OpenImageIO-devel is needed by asymptote-2.70-1.x32 rpm: gc-c++-devel >= 8.0.4 is needed by asymptote-2.70-1.x32 rpm: texinfo-texi2dvi >= 6.7 is needed by asymptote-2.70-1.x32 rpm: Building target platforms: x32-pld-linux rpm: Building for target x32-pld-linux installing BR: Mesa\-libOSMesa\-devel OpenImageIO\-devel gc\-c\+\+\-devel texinfo\-texi2dvi + poldek --noask --caplookup -Q -v '--ignore=hhvm-*' '--ignore=php4-*' '--ignore=php52-*' '--ignore=php54-*' '--ignore=php55-*' '--ignore=php56-*' '--ignore=php70-*' '--ignore=php71-*' '--ignore=php72-*' '--ignore=php73-*' '--ignore=php74-*' '--ignore=php80-*' '--ignore=php81-*' '--ignore=php82-*' --upgrade Mesa-libOSMesa-devel OpenImageIO-devel gc-c++-devel texinfo-texi2dvi Loading [pndir]ready... Loading [pndir]th-test... Loading [pndir]th-test... Loading [pndir]th-ready... Loading [pndir]th-ready... Loading [pndir]th... Loading [pndir]th... 31299 packages read Removed 2305 duplicate packages from available set Processing dependencies... Mesa-libOSMesa-devel-24.1.1-2.x32 marks Mesa-libOSMesa-24.1.1-2.x32 (cap Mesa-libOSMesa(x86-x32) = 24.1.1-2) There are 2 packages to install (1 marked by dependencies): A Mesa-libOSMesa-24.1.1-2.x32 Mesa-libOSMesa-devel-24.1.1-2.x32 This operation will use 12.1MB of disk space. Need to get 2.9MB of archives. Mesa-libOSMesa-24.1.1-2.x32.rpm: digests OK Mesa-libOSMesa-devel-24.1.1-2.x32.rpm: digests OK Executing pm-command.sh --upgrade -vh --root / --define _check_dirname_deps 0... Verifying... ######################################## Preparing... ######################################## Updating / installing... Mesa-libOSMesa-24.1.1-2 ######################################## Mesa-libOSMesa-devel-24.1.1-2 ######################################## Installing set #2 Processing dependencies... OpenImageIO-devel-2.4.17.0-1.x32 marks OpenImageIO-2.4.17.0-1.x32 (cap OpenImageIO = 2.4.17.0-1) There are 2 packages to install (1 marked by dependencies): A OpenImageIO-2.4.17.0-1.x32 OpenImageIO-devel-2.4.17.0-1.x32 This operation will use 14.0MB of disk space. OpenImageIO-devel-2.4.17.0-1.x32.rpm: digests OK OpenImageIO-2.4.17.0-1.x32.rpm: digests OK Need to get 3.0MB of archives. OpenImageIO-2.4.17.0-1.x32.rpm: digests OK OpenImageIO-devel-2.4.17.0-1.x32.rpm: digests OK Executing pm-command.sh --upgrade -vh --root / --define _check_dirname_deps 0... warning: /root/.cache/poldek/ftp_ftp1.pld-linux.org.dists.th.PLD.x32.RPMS/OpenImageIO-2.4.17.0-1.x32.rpm: Header V4 DSA/SHA1 Signature, key ID e4f1bc2d: NOKEY Verifying... ######################################## Preparing... ######################################## Updating / installing... OpenImageIO-2.4.17.0-1 ######################################## OpenImageIO-devel-2.4.17.0-1 ######################################## Installing set #3 Processing dependencies... There are 1 package to install: A gc-c++-devel-8.2.4-1.x32 This operation will use 20.6KB of disk space. gc-c++-devel-8.2.4-1.x32.rpm: digests OK Need to get 15.3KB of archives. gc-c++-devel-8.2.4-1.x32.rpm: digests OK Executing pm-command.sh --upgrade -vh --root / --define _check_dirname_deps 0... warning: /root/.cache/poldek/ftp_ftp1.pld-linux.org.dists.th.PLD.x32.RPMS/gc-c++-devel-8.2.4-1.x32.rpm: Header V4 DSA/SHA1 Signature, key ID e4f1bc2d: NOKEY Verifying... ######################################## Preparing... ######################################## Updating / installing... gc-c++-devel-8.2.4-1 ######################################## Installing set #4 Processing dependencies... texinfo-texi2dvi-7.1-3.x32 marks texlive-plain-20080816-44.noarch (cap texlive-plain) There are 2 packages to install (1 marked by dependencies): A texinfo-texi2dvi-7.1-3.x32 texlive-plain-20080816-44.noarch This operation will use 3.4MB of disk space. texinfo-texi2dvi-7.1-3.x32.rpm: digests OK texlive-plain-20080816-44.noarch.rpm: digests OK Need to get 1.6MB of archives. texlive-plain-20080816-44.noarch.rpm: digests OK texinfo-texi2dvi-7.1-3.x32.rpm: digests OK Executing pm-command.sh --upgrade -vh --root / --define _check_dirname_deps 0... warning: /root/.cache/poldek/ftp_ftp1.pld-linux.org.dists.th.PLD.noarch.RPMS/texlive-plain-20080816-44.noarch.rpm: Header V4 DSA/SHA1 Signature, key ID e4f1bc2d: NOKEY Verifying... ######################################## Preparing... ######################################## Updating / installing... texlive-plain-1:20080816-44 ######################################## texinfo-texi2dvi-7.1-3 ######################################## building RPM using: set -ex; : build-id: f11d2e06-a001-47f0-ac4d-a23e0d5a540d; TMPDIR=/tmp/B.bxfqee6a/BUILD/tmp exec nice -n 0 rpmbuild -bb --define '__jobs 28' --define '_smp_mflags -j28' --define '_make_opts -Otarget' --define '_pld_builder 1' --define '_topdir /tmp/B.bxfqee6a' --define '_specdir %{_topdir}' --define '_sourcedir %{_specdir}' --define '_rpmdir %{_topdir}/RPMS' --define '_builddir %{_topdir}/BUILD' --target x32-pld-linux /tmp/B.bxfqee6a/asymptote.spec + : build-id: f11d2e06-a001-47f0-ac4d-a23e0d5a540d + TMPDIR=/tmp/B.bxfqee6a/BUILD/tmp + exec nice -n 0 rpmbuild -bb --define '__jobs 28' --define '_smp_mflags -j28' --define '_make_opts -Otarget' --define '_pld_builder 1' --define '_topdir /tmp/B.bxfqee6a' --define '_specdir %{_topdir}' --define '_sourcedir %{_specdir}' --define '_rpmdir %{_topdir}/RPMS' --define '_builddir %{_topdir}/BUILD' --target x32-pld-linux /tmp/B.bxfqee6a/asymptote.spec Building target platforms: x32-pld-linux Building for target x32-pld-linux Executing(%prep): /bin/sh -e /tmp/B.bxfqee6a/BUILD/tmp/rpm-tmp.NQAgLn + umask 022 + cd /tmp/B.bxfqee6a/BUILD + cd /tmp/B.bxfqee6a/BUILD + rm -rf asymptote-2.70 + /bin/gzip -dc /tmp/B.bxfqee6a/asymptote-2.70.src.tgz + /bin/tar -xof - + STATUS=0 + '[' 0 -ne 0 ']' + cd asymptote-2.70 + /bin/chmod -Rf a+rX,u+w,g-w,o-w . + echo 'Patch #0 (asymptote-memrchr.patch):' Patch #0 (asymptote-memrchr.patch): + </tmp/B.bxfqee6a/asymptote-memrchr.patch + /usr/bin/patch -s -f -p1 '--fuzz=0' + echo 'Patch #1 (asymptote-info.patch):' Patch #1 (asymptote-info.patch): + </tmp/B.bxfqee6a/asymptote-info.patch + /usr/bin/patch -s -f -p1 '--fuzz=0' + echo 'Patch #2 (asymptote-no-env.patch):' Patch #2 (asymptote-no-env.patch): + </tmp/B.bxfqee6a/asymptote-no-env.patch + /usr/bin/patch -s -f -p1 '--fuzz=0' + echo 'Patch #3 (texinfo.patch):' Patch #3 (texinfo.patch): + </tmp/B.bxfqee6a/texinfo.patch + /usr/bin/patch -s -f -p1 '--fuzz=0' + /bin/sed -i -e '1s,/usr/bin/env python3,/usr/bin/python3,' GUI/xasy.py + /bin/sed -i -e 1d GUI/configs/__init__.py GUI/CustMatTransform.py GUI/DebugFlags.py GUI/GuidesManager.py GUI/InplaceAddObj.py GUI/PrimitiveShape.py GUI/SetCustomAnchor.py GUI/Widg_addLabel.py GUI/Widg_addPolyOpt.py GUI/Widg_editBezier.py GUI/Window1.py GUI/__init__.py GUI/labelEditor.py GUI/xasy2asy.py GUI/xasyArgs.py GUI/xasyBezierInterface.py GUI/xasyFile.py GUI/xasyOptions.py GUI/xasyStrings.py GUI/xasySvg.py GUI/xasyTransform.py GUI/xasyUtils.py GUI/xasyValidator.py + /bin/sed -i -e 1d GUI/UndoRedoStack.py base/asymptote.py + RPM_EC=0 + jobs -p + exit 0 Executing(%build): /bin/sh -e /tmp/B.bxfqee6a/BUILD/tmp/rpm-tmp.WD5k5T HOME=/home/users/builder PATH=/home/users/builder/GNUstep/Tools:/bin:/usr/bin:/usr/local/bin TMPDIR=/tmp/B.bxfqee6a/BUILD/tmp + umask 022 + cd /tmp/B.bxfqee6a/BUILD + cd asymptote-2.70 + autoconf configure.ac:102: warning: AC_PROG_LEX without either yywrap or noyywrap is obsolete ./lib/autoconf/programs.m4:743: _AC_PROG_LEX is expanded from... ./lib/autoconf/programs.m4:736: AC_PROG_LEX is expanded from... configure.ac:102: the top level configure.ac:450: warning: The macro 'AC_TYPE_SIGNAL' is obsolete. configure.ac:450: You should run autoupdate. ./lib/autoconf/types.m4:805: AC_TYPE_SIGNAL is expanded from... configure.ac:450: the top level + autoheader + ./configure 'LDFLAGS=-Wl,--as-needed -Wl,--no-copy-dt-needed-entries -Wl,-z,relro -Wl,-z,combreloc ' 'CFLAGS=-O2 -fwrapv -pipe -Wformat -Werror=format-security -gdwarf-4 -fno-debug-types-section -fvar-tracking-assignments -g2 -Wp,-D_FORTIFY_SOURCE=2 -fstack-protector-strong --param=ssp-buffer-size=4 -Werror=trampolines -fPIC -mtune=generic -march=x86-64 -gdwarf-4 -fno-debug-types-section -fvar-tracking-assignments -g2 ' 'CXXFLAGS=-O2 -fwrapv -pipe -Wformat -Werror=format-security -gdwarf-4 -fno-debug-types-section -fvar-tracking-assignments -g2 -Wp,-D_FORTIFY_SOURCE=2 -fstack-protector-strong --param=ssp-buffer-size=4 -Werror=trampolines -fPIC -mtune=generic -march=x86-64 -gdwarf-4 -fno-debug-types-section -fvar-tracking-assignments -g2 ' 'FFLAGS=-O2 -fwrapv -pipe -Wformat -Werror=format-security -gdwarf-4 -fno-debug-types-section -fvar-tracking-assignments -g2 -Wp,-D_FORTIFY_SOURCE=2 -fstack-protector-strong --param=ssp-buffer-size=4 -Werror=trampolines -fPIC -mtune=generic -march=x86-64 -gdwarf-4 -fno-debug-types-section -fvar-tracking-assignments -g2 ' 'FCFLAGS=-O2 -fwrapv -pipe -Wformat -Werror=format-security -gdwarf-4 -fno-debug-types-section -fvar-tracking-assignments -g2 -Wp,-D_FORTIFY_SOURCE=2 -fstack-protector-strong --param=ssp-buffer-size=4 -Werror=trampolines -fPIC -mtune=generic -march=x86-64 -gdwarf-4 -fno-debug-types-section -fvar-tracking-assignments -g2 ' 'CPPFLAGS=' 'CC=x86_64-pld-linux-gnux32-gcc' 'CXX=x86_64-pld-linux-gnux32-g++' '--host=x86_64-pld-linux-gnux32' '--build=x86_64-pld-linux-gnux32' '--prefix=/usr' '--exec-prefix=/usr' '--bindir=/usr/bin' '--sbindir=/usr/sbin' '--sysconfdir=/etc' '--datadir=/usr/share' '--includedir=/usr/include' '--libdir=/usr/libx32' '--libexecdir=/usr/libexec' '--localstatedir=/var' '--sharedstatedir=/var/lib' '--mandir=/usr/share/man' '--infodir=/usr/share/info' '--x-libraries=/usr/libx32' --enable-openimageio '--enable-gc=system' --enable-offscreen '--with-docdir=/usr/share/doc/asymptote-doc' configure: WARNING: unrecognized options: --enable-openimageio checking for x86_64-pld-linux-gnux32-gcc... x86_64-pld-linux-gnux32-gcc checking whether the C compiler works... yes checking for C compiler default output file name... a.out checking for suffix of executables... checking whether we are cross compiling... no checking for suffix of object files... o checking whether the compiler supports GNU C... yes checking whether x86_64-pld-linux-gnux32-gcc accepts -g... yes checking for x86_64-pld-linux-gnux32-gcc option to enable C11 features... none needed checking for stdio.h... yes checking for stdlib.h... yes checking for string.h... yes checking for inttypes.h... yes checking for stdint.h... yes checking for strings.h... yes checking for sys/stat.h... yes checking for sys/types.h... yes checking for unistd.h... yes checking whether byte ordering is bigendian... no checking build system type... x86_64-pld-linux-gnux32 checking host system type... x86_64-pld-linux-gnux32 checking for kpsewhich... true checking for kpsewhich... (cached) true checking for texi2dvi... texi2dvi configure: Using /usr/share/texmf/tex/latex/asymptote for LaTeX style file configure: Using /usr/share/texmf/tex/context/third/asymptote for ConTeXT style file checking whether the compiler supports GNU C++... yes checking whether x86_64-pld-linux-gnux32-g++ accepts -g... yes checking for x86_64-pld-linux-gnux32-g++ option to enable C++11 features... none needed checking for flex... flex checking for lex output file root... lex.yy checking for lex library... none needed checking for library containing yywrap... -lfl checking whether yytext is a pointer... yes checking whether the compiler supports GNU C++... (cached) yes checking whether x86_64-pld-linux-gnux32-g++ accepts -g... (cached) yes checking for x86_64-pld-linux-gnux32-g++ option to enable C++11 features... (cached) none needed checking for a BSD-compatible install... /usr/bin/install -c checking for x86_64-pld-linux-gnux32-gcc... (cached) x86_64-pld-linux-gnux32-gcc checking whether the compiler supports GNU C... (cached) yes checking whether x86_64-pld-linux-gnux32-gcc accepts -g... (cached) yes checking for x86_64-pld-linux-gnux32-gcc option to enable C11 features... (cached) none needed checking whether make sets $(MAKE)... yes checking for bison... bison -y checking for tr1/unordered_map... yes checking for gc-8.0.4.tar.gz... yes checking for gc.h... yes checking for GC_malloc in -lgc... yes configure: enabling system Boehm Garbage Collector checking for getopt_long_only... yes checking for library containing lgamma... none required checking for deflate in -lz... yes checking for the pthreads library -lpthreads... no checking whether pthreads work without any flags... yes checking for joinable pthread attribute... PTHREAD_CREATE_JOINABLE checking if more special flags are required for pthreads... no checking for PTHREAD_PRIO_INHERIT... yes checking for stackoverflow_install_handler in -lsigsegv... yes checking for sched_yield in -lrt... yes checking for curl_easy_init in -lcurl... yes checking for history_list in -lreadline... yes checking for tgetent in -ltinfo... yes checking for ncurses/curses.h... yes checking for setupterm in -lncurses... yes checking for fftw3.h... yes checking for fftw_execute in -lfftw3... yes checking for sys/wait.h that is POSIX.1 compatible... yes checking for fenv.h... yes checking for stddef.h... yes checking for libintl.h... yes checking for fpu_control.h... yes checking for feenableexcept... yes checking for library containing xdrstdio_create... -ltirpc checking for gsl/gsl_sf.h... yes checking for gsl_sf_debye_6 in -lgsl... yes checking for glm/glm.hpp... yes checking for ncurses/curses.h... (cached) yes checking for OpenEXR/ImathVec.h... no checking for GC_throw_bad_alloc in -lgccpp... no checking for glutMainLoop in -lglut... yes checking for glDepthMask in -lGL... yes checking for glXGetProcAddressARB in -lGLX... yes checking for OSMesaCreateContext in -lOSMesa... yes checking for pid_t... yes checking for size_t... yes checking for ptrdiff_t... yes checking for long long... yes checking for long... yes checking for an ANSI C-conforming const... yes checking for inline... inline checking return type of signal handlers... void checking for vfork.h... no checking for fork... yes checking for vfork... yes checking for working fork... yes checking for working vfork... (cached) yes checking for dup2... yes checking for floor... yes checking for memset... yes checking for strchr... yes checking for tgamma... yes checking for lgamma... yes checking for memrchr... yes checking for popcount... no checking for strftime... yes checking for strptime... yes checking for error_at_line... yes checking for declarations of fseeko and ftello... yes configure: creating ./config.status config.status: creating Makefile config.status: creating doc/Makefile config.status: creating doc/png/Makefile config.status: creating config.h configure: WARNING: unrecognized options: --enable-openimageio + /usr/bin/make -Otarget -j28 all perl ./opsymbols.pl Creating camperror.d Creating knot.d Creating guide.d Creating path.d Creating util.d Creating types.d Creating psfile.d Creating flatguide.d Creating pipestream.d Creating texfile.d Creating stm.d Creating dec.d Creating builtin.d Creating path3.d Creating errormsg.d Creating genv.d Creating gsl.d Creating env.d Creating simpson.d Creating settings.d Creating drawlabel.d Creating drawfill.d Creating picture.d Creating callable.d Creating drawpath.d Creating bezierpatch.d Creating symbol.d Creating name.d Creating entry.d Creating drawpath3.d Creating pen.d Creating drawsurface.d Creating beziercurve.d Creating access.d Creating newexp.d Creating fftw++asy.d Creating camp.tab.d Creating lex.yy.d Creating absyn.d Creating exp.d Creating stack.d Creating virtualfieldaccess.d Creating interact.d Creating record.d Creating fileio.d Creating PRCdouble.d Creating predicates.d Creating coder.d Creating PRCbitStream.d Creating coenv.d Creating varinit.d Creating locate.d Creating impdatum.d Creating writePRC.d Creating envcompleter.d Creating Delaunay.d Creating application.d Creating program.d Creating array.d Creating oPRCFile.d Creating parser.d Creating refaccess.d Creating fundec.d Creating constructor.d Creating shaders.d Creating process.d Creating tr.d Creating main.d perl ./runtime.pl runbacktrace perl ./runtime.pl runtime perl ./runtime.pl runpicture perl ./runtime.pl runlabel perl ./runtime.pl runhistory perl ./runtime.pl runarray perl ./runtime.pl runfile perl ./runtime.pl runsystem perl ./runtime.pl runpair perl ./runtime.pl runtriple perl ./runtime.pl runpath perl ./runtime.pl runpath3d perl ./runtime.pl runstring perl ./runtime.pl runmath Creating glrender.d Creating jsfile.d Creating runbacktrace.d Creating runhistory.d Creating runfile.d Creating runpath.d Creating runsystem.d Creating runstring.d Creating runmath.d Creating runpair.d Creating runlabel.d Creating runtriple.d Creating runpath3d.d Creating runtime.d Creating runarray.d Creating runpicture.d Creating types.d Creating symbol.d Creating runbacktrace.d Creating runpair.d Creating runsystem.d Creating builtin.d Creating runhistory.d Creating runfile.d Creating runpath.d Creating runstring.d Creating runmath.d Creating gsl.d Creating runtriple.d Creating runpicture.d Creating runlabel.d Creating runtime.d Creating runarray.d Creating runpath3d.d x86_64-pld-linux-gnux32-g++ -Wall -E -DNOSYM -DHAVE_CONFIG_H -D_FILE_OFFSET_BITS=64 -DUSEGC -DFFTWPP_SINGLE_THREAD -I. -I/usr/include/gc -I/usr/include/gc -I/usr/include/tirpc -O2 -fwrapv -pipe -Wformat -Werror=format-security -gdwarf-4 -fno-debug-types-section -fvar-tracking-assignments -g2 -Wp,-D_FORTIFY_SOURCE=2 -fstack-protector-strong --param=ssp-buffer-size=4 -Werror=trampolines -fPIC -mtune=generic -march=x86-64 -gdwarf-4 -fno-debug-types-section -fvar-tracking-assignments -g2 -O2 -fwrapv -pipe -Wformat -Werror=format-security -gdwarf-4 -fno-debug-types-section -fvar-tracking-assignments -g2 -Wp,-D_FORTIFY_SOURCE=2 -fstack-protector-strong --param=ssp-buffer-size=4 -Werror=trampolines -fPIC -mtune=generic -march=x86-64 -gdwarf-4 -fno-debug-types-section -fvar-tracking-assignments -g2 -fno-var-tracking runhistory.cc | \ perl ./findsym.pl runhistory.symbols.h - x86_64-pld-linux-gnux32-g++ -Wall -E -DNOSYM -DHAVE_CONFIG_H -D_FILE_OFFSET_BITS=64 -DUSEGC -DFFTWPP_SINGLE_THREAD -I. -I/usr/include/gc -I/usr/include/gc -I/usr/include/tirpc -O2 -fwrapv -pipe -Wformat -Werror=format-security -gdwarf-4 -fno-debug-types-section -fvar-tracking-assignments -g2 -Wp,-D_FORTIFY_SOURCE=2 -fstack-protector-strong --param=ssp-buffer-size=4 -Werror=trampolines -fPIC -mtune=generic -march=x86-64 -gdwarf-4 -fno-debug-types-section -fvar-tracking-assignments -g2 -O2 -fwrapv -pipe -Wformat -Werror=format-security -gdwarf-4 -fno-debug-types-section -fvar-tracking-assignments -g2 -Wp,-D_FORTIFY_SOURCE=2 -fstack-protector-strong --param=ssp-buffer-size=4 -Werror=trampolines -fPIC -mtune=generic -march=x86-64 -gdwarf-4 -fno-debug-types-section -fvar-tracking-assignments -g2 -fno-var-tracking builtin.cc | \ perl ./findsym.pl builtin.symbols.h - x86_64-pld-linux-gnux32-g++ -Wall -E -DNOSYM -DHAVE_CONFIG_H -D_FILE_OFFSET_BITS=64 -DUSEGC -DFFTWPP_SINGLE_THREAD -I. -I/usr/include/gc -I/usr/include/gc -I/usr/include/tirpc -O2 -fwrapv -pipe -Wformat -Werror=format-security -gdwarf-4 -fno-debug-types-section -fvar-tracking-assignments -g2 -Wp,-D_FORTIFY_SOURCE=2 -fstack-protector-strong --param=ssp-buffer-size=4 -Werror=trampolines -fPIC -mtune=generic -march=x86-64 -gdwarf-4 -fno-debug-types-section -fvar-tracking-assignments -g2 -O2 -fwrapv -pipe -Wformat -Werror=format-security -gdwarf-4 -fno-debug-types-section -fvar-tracking-assignments -g2 -Wp,-D_FORTIFY_SOURCE=2 -fstack-protector-strong --param=ssp-buffer-size=4 -Werror=trampolines -fPIC -mtune=generic -march=x86-64 -gdwarf-4 -fno-debug-types-section -fvar-tracking-assignments -g2 -fno-var-tracking types.cc | \ perl ./findsym.pl types.symbols.h - x86_64-pld-linux-gnux32-g++ -Wall -E -DNOSYM -DHAVE_CONFIG_H -D_FILE_OFFSET_BITS=64 -DUSEGC -DFFTWPP_SINGLE_THREAD -I. -I/usr/include/gc -I/usr/include/gc -I/usr/include/tirpc -O2 -fwrapv -pipe -Wformat -Werror=format-security -gdwarf-4 -fno-debug-types-section -fvar-tracking-assignments -g2 -Wp,-D_FORTIFY_SOURCE=2 -fstack-protector-strong --param=ssp-buffer-size=4 -Werror=trampolines -fPIC -mtune=generic -march=x86-64 -gdwarf-4 -fno-debug-types-section -fvar-tracking-assignments -g2 -O2 -fwrapv -pipe -Wformat -Werror=format-security -gdwarf-4 -fno-debug-types-section -fvar-tracking-assignments -g2 -Wp,-D_FORTIFY_SOURCE=2 -fstack-protector-strong --param=ssp-buffer-size=4 -Werror=trampolines -fPIC -mtune=generic -march=x86-64 -gdwarf-4 -fno-debug-types-section -fvar-tracking-assignments -g2 -fno-var-tracking gsl.cc | \ perl ./findsym.pl gsl.symbols.h - x86_64-pld-linux-gnux32-g++ -Wall -E -DNOSYM -DHAVE_CONFIG_H -D_FILE_OFFSET_BITS=64 -DUSEGC -DFFTWPP_SINGLE_THREAD -I. -I/usr/include/gc -I/usr/include/gc -I/usr/include/tirpc -O2 -fwrapv -pipe -Wformat -Werror=format-security -gdwarf-4 -fno-debug-types-section -fvar-tracking-assignments -g2 -Wp,-D_FORTIFY_SOURCE=2 -fstack-protector-strong --param=ssp-buffer-size=4 -Werror=trampolines -fPIC -mtune=generic -march=x86-64 -gdwarf-4 -fno-debug-types-section -fvar-tracking-assignments -g2 -O2 -fwrapv -pipe -Wformat -Werror=format-security -gdwarf-4 -fno-debug-types-section -fvar-tracking-assignments -g2 -Wp,-D_FORTIFY_SOURCE=2 -fstack-protector-strong --param=ssp-buffer-size=4 -Werror=trampolines -fPIC -mtune=generic -march=x86-64 -gdwarf-4 -fno-debug-types-section -fvar-tracking-assignments -g2 -fno-var-tracking runbacktrace.cc | \ perl ./findsym.pl runbacktrace.symbols.h - x86_64-pld-linux-gnux32-g++ -Wall -E -DNOSYM -DHAVE_CONFIG_H -D_FILE_OFFSET_BITS=64 -DUSEGC -DFFTWPP_SINGLE_THREAD -I. -I/usr/include/gc -I/usr/include/gc -I/usr/include/tirpc -O2 -fwrapv -pipe -Wformat -Werror=format-security -gdwarf-4 -fno-debug-types-section -fvar-tracking-assignments -g2 -Wp,-D_FORTIFY_SOURCE=2 -fstack-protector-strong --param=ssp-buffer-size=4 -Werror=trampolines -fPIC -mtune=generic -march=x86-64 -gdwarf-4 -fno-debug-types-section -fvar-tracking-assignments -g2 -O2 -fwrapv -pipe -Wformat -Werror=format-security -gdwarf-4 -fno-debug-types-section -fvar-tracking-assignments -g2 -Wp,-D_FORTIFY_SOURCE=2 -fstack-protector-strong --param=ssp-buffer-size=4 -Werror=trampolines -fPIC -mtune=generic -march=x86-64 -gdwarf-4 -fno-debug-types-section -fvar-tracking-assignments -g2 -fno-var-tracking runtime.cc | \ perl ./findsym.pl runtime.symbols.h - x86_64-pld-linux-gnux32-g++ -Wall -E -DNOSYM -DHAVE_CONFIG_H -D_FILE_OFFSET_BITS=64 -DUSEGC -DFFTWPP_SINGLE_THREAD -I. -I/usr/include/gc -I/usr/include/gc -I/usr/include/tirpc -O2 -fwrapv -pipe -Wformat -Werror=format-security -gdwarf-4 -fno-debug-types-section -fvar-tracking-assignments -g2 -Wp,-D_FORTIFY_SOURCE=2 -fstack-protector-strong --param=ssp-buffer-size=4 -Werror=trampolines -fPIC -mtune=generic -march=x86-64 -gdwarf-4 -fno-debug-types-section -fvar-tracking-assignments -g2 -O2 -fwrapv -pipe -Wformat -Werror=format-security -gdwarf-4 -fno-debug-types-section -fvar-tracking-assignments -g2 -Wp,-D_FORTIFY_SOURCE=2 -fstack-protector-strong --param=ssp-buffer-size=4 -Werror=trampolines -fPIC -mtune=generic -march=x86-64 -gdwarf-4 -fno-debug-types-section -fvar-tracking-assignments -g2 -fno-var-tracking runlabel.cc | \ perl ./findsym.pl runlabel.symbols.h - x86_64-pld-linux-gnux32-g++ -Wall -E -DNOSYM -DHAVE_CONFIG_H -D_FILE_OFFSET_BITS=64 -DUSEGC -DFFTWPP_SINGLE_THREAD -I. -I/usr/include/gc -I/usr/include/gc -I/usr/include/tirpc -O2 -fwrapv -pipe -Wformat -Werror=format-security -gdwarf-4 -fno-debug-types-section -fvar-tracking-assignments -g2 -Wp,-D_FORTIFY_SOURCE=2 -fstack-protector-strong --param=ssp-buffer-size=4 -Werror=trampolines -fPIC -mtune=generic -march=x86-64 -gdwarf-4 -fno-debug-types-section -fvar-tracking-assignments -g2 -O2 -fwrapv -pipe -Wformat -Werror=format-security -gdwarf-4 -fno-debug-types-section -fvar-tracking-assignments -g2 -Wp,-D_FORTIFY_SOURCE=2 -fstack-protector-strong --param=ssp-buffer-size=4 -Werror=trampolines -fPIC -mtune=generic -march=x86-64 -gdwarf-4 -fno-debug-types-section -fvar-tracking-assignments -g2 -fno-var-tracking runpicture.cc | \ perl ./findsym.pl runpicture.symbols.h - x86_64-pld-linux-gnux32-g++ -Wall -E -DNOSYM -DHAVE_CONFIG_H -D_FILE_OFFSET_BITS=64 -DUSEGC -DFFTWPP_SINGLE_THREAD -I. -I/usr/include/gc -I/usr/include/gc -I/usr/include/tirpc -O2 -fwrapv -pipe -Wformat -Werror=format-security -gdwarf-4 -fno-debug-types-section -fvar-tracking-assignments -g2 -Wp,-D_FORTIFY_SOURCE=2 -fstack-protector-strong --param=ssp-buffer-size=4 -Werror=trampolines -fPIC -mtune=generic -march=x86-64 -gdwarf-4 -fno-debug-types-section -fvar-tracking-assignments -g2 -O2 -fwrapv -pipe -Wformat -Werror=format-security -gdwarf-4 -fno-debug-types-section -fvar-tracking-assignments -g2 -Wp,-D_FORTIFY_SOURCE=2 -fstack-protector-strong --param=ssp-buffer-size=4 -Werror=trampolines -fPIC -mtune=generic -march=x86-64 -gdwarf-4 -fno-debug-types-section -fvar-tracking-assignments -g2 -fno-var-tracking runfile.cc | \ perl ./findsym.pl runfile.symbols.h - x86_64-pld-linux-gnux32-g++ -Wall -E -DNOSYM -DHAVE_CONFIG_H -D_FILE_OFFSET_BITS=64 -DUSEGC -DFFTWPP_SINGLE_THREAD -I. -I/usr/include/gc -I/usr/include/gc -I/usr/include/tirpc -O2 -fwrapv -pipe -Wformat -Werror=format-security -gdwarf-4 -fno-debug-types-section -fvar-tracking-assignments -g2 -Wp,-D_FORTIFY_SOURCE=2 -fstack-protector-strong --param=ssp-buffer-size=4 -Werror=trampolines -fPIC -mtune=generic -march=x86-64 -gdwarf-4 -fno-debug-types-section -fvar-tracking-assignments -g2 -O2 -fwrapv -pipe -Wformat -Werror=format-security -gdwarf-4 -fno-debug-types-section -fvar-tracking-assignments -g2 -Wp,-D_FORTIFY_SOURCE=2 -fstack-protector-strong --param=ssp-buffer-size=4 -Werror=trampolines -fPIC -mtune=generic -march=x86-64 -gdwarf-4 -fno-debug-types-section -fvar-tracking-assignments -g2 -fno-var-tracking runpair.cc | \ perl ./findsym.pl runpair.symbols.h - x86_64-pld-linux-gnux32-g++ -Wall -E -DNOSYM -DHAVE_CONFIG_H -D_FILE_OFFSET_BITS=64 -DUSEGC -DFFTWPP_SINGLE_THREAD -I. -I/usr/include/gc -I/usr/include/gc -I/usr/include/tirpc -O2 -fwrapv -pipe -Wformat -Werror=format-security -gdwarf-4 -fno-debug-types-section -fvar-tracking-assignments -g2 -Wp,-D_FORTIFY_SOURCE=2 -fstack-protector-strong --param=ssp-buffer-size=4 -Werror=trampolines -fPIC -mtune=generic -march=x86-64 -gdwarf-4 -fno-debug-types-section -fvar-tracking-assignments -g2 -O2 -fwrapv -pipe -Wformat -Werror=format-security -gdwarf-4 -fno-debug-types-section -fvar-tracking-assignments -g2 -Wp,-D_FORTIFY_SOURCE=2 -fstack-protector-strong --param=ssp-buffer-size=4 -Werror=trampolines -fPIC -mtune=generic -march=x86-64 -gdwarf-4 -fno-debug-types-section -fvar-tracking-assignments -g2 -fno-var-tracking runarray.cc | \ perl ./findsym.pl runarray.symbols.h - x86_64-pld-linux-gnux32-g++ -Wall -E -DNOSYM -DHAVE_CONFIG_H -D_FILE_OFFSET_BITS=64 -DUSEGC -DFFTWPP_SINGLE_THREAD -I. -I/usr/include/gc -I/usr/include/gc -I/usr/include/tirpc -O2 -fwrapv -pipe -Wformat -Werror=format-security -gdwarf-4 -fno-debug-types-section -fvar-tracking-assignments -g2 -Wp,-D_FORTIFY_SOURCE=2 -fstack-protector-strong --param=ssp-buffer-size=4 -Werror=trampolines -fPIC -mtune=generic -march=x86-64 -gdwarf-4 -fno-debug-types-section -fvar-tracking-assignments -g2 -O2 -fwrapv -pipe -Wformat -Werror=format-security -gdwarf-4 -fno-debug-types-section -fvar-tracking-assignments -g2 -Wp,-D_FORTIFY_SOURCE=2 -fstack-protector-strong --param=ssp-buffer-size=4 -Werror=trampolines -fPIC -mtune=generic -march=x86-64 -gdwarf-4 -fno-debug-types-section -fvar-tracking-assignments -g2 -fno-var-tracking runsystem.cc | \ perl ./findsym.pl runsystem.symbols.h - x86_64-pld-linux-gnux32-g++ -Wall -E -DNOSYM -DHAVE_CONFIG_H -D_FILE_OFFSET_BITS=64 -DUSEGC -DFFTWPP_SINGLE_THREAD -I. -I/usr/include/gc -I/usr/include/gc -I/usr/include/tirpc -O2 -fwrapv -pipe -Wformat -Werror=format-security -gdwarf-4 -fno-debug-types-section -fvar-tracking-assignments -g2 -Wp,-D_FORTIFY_SOURCE=2 -fstack-protector-strong --param=ssp-buffer-size=4 -Werror=trampolines -fPIC -mtune=generic -march=x86-64 -gdwarf-4 -fno-debug-types-section -fvar-tracking-assignments -g2 -O2 -fwrapv -pipe -Wformat -Werror=format-security -gdwarf-4 -fno-debug-types-section -fvar-tracking-assignments -g2 -Wp,-D_FORTIFY_SOURCE=2 -fstack-protector-strong --param=ssp-buffer-size=4 -Werror=trampolines -fPIC -mtune=generic -march=x86-64 -gdwarf-4 -fno-debug-types-section -fvar-tracking-assignments -g2 -fno-var-tracking runstring.cc | \ perl ./findsym.pl runstring.symbols.h - x86_64-pld-linux-gnux32-g++ -Wall -E -DNOSYM -DHAVE_CONFIG_H -D_FILE_OFFSET_BITS=64 -DUSEGC -DFFTWPP_SINGLE_THREAD -I. -I/usr/include/gc -I/usr/include/gc -I/usr/include/tirpc -O2 -fwrapv -pipe -Wformat -Werror=format-security -gdwarf-4 -fno-debug-types-section -fvar-tracking-assignments -g2 -Wp,-D_FORTIFY_SOURCE=2 -fstack-protector-strong --param=ssp-buffer-size=4 -Werror=trampolines -fPIC -mtune=generic -march=x86-64 -gdwarf-4 -fno-debug-types-section -fvar-tracking-assignments -g2 -O2 -fwrapv -pipe -Wformat -Werror=format-security -gdwarf-4 -fno-debug-types-section -fvar-tracking-assignments -g2 -Wp,-D_FORTIFY_SOURCE=2 -fstack-protector-strong --param=ssp-buffer-size=4 -Werror=trampolines -fPIC -mtune=generic -march=x86-64 -gdwarf-4 -fno-debug-types-section -fvar-tracking-assignments -g2 -fno-var-tracking runpath.cc | \ perl ./findsym.pl runpath.symbols.h - x86_64-pld-linux-gnux32-g++ -Wall -E -DNOSYM -DHAVE_CONFIG_H -D_FILE_OFFSET_BITS=64 -DUSEGC -DFFTWPP_SINGLE_THREAD -I. -I/usr/include/gc -I/usr/include/gc -I/usr/include/tirpc -O2 -fwrapv -pipe -Wformat -Werror=format-security -gdwarf-4 -fno-debug-types-section -fvar-tracking-assignments -g2 -Wp,-D_FORTIFY_SOURCE=2 -fstack-protector-strong --param=ssp-buffer-size=4 -Werror=trampolines -fPIC -mtune=generic -march=x86-64 -gdwarf-4 -fno-debug-types-section -fvar-tracking-assignments -g2 -O2 -fwrapv -pipe -Wformat -Werror=format-security -gdwarf-4 -fno-debug-types-section -fvar-tracking-assignments -g2 -Wp,-D_FORTIFY_SOURCE=2 -fstack-protector-strong --param=ssp-buffer-size=4 -Werror=trampolines -fPIC -mtune=generic -march=x86-64 -gdwarf-4 -fno-debug-types-section -fvar-tracking-assignments -g2 -fno-var-tracking runtriple.cc | \ perl ./findsym.pl runtriple.symbols.h - x86_64-pld-linux-gnux32-g++ -Wall -E -DNOSYM -DHAVE_CONFIG_H -D_FILE_OFFSET_BITS=64 -DUSEGC -DFFTWPP_SINGLE_THREAD -I. -I/usr/include/gc -I/usr/include/gc -I/usr/include/tirpc -O2 -fwrapv -pipe -Wformat -Werror=format-security -gdwarf-4 -fno-debug-types-section -fvar-tracking-assignments -g2 -Wp,-D_FORTIFY_SOURCE=2 -fstack-protector-strong --param=ssp-buffer-size=4 -Werror=trampolines -fPIC -mtune=generic -march=x86-64 -gdwarf-4 -fno-debug-types-section -fvar-tracking-assignments -g2 -O2 -fwrapv -pipe -Wformat -Werror=format-security -gdwarf-4 -fno-debug-types-section -fvar-tracking-assignments -g2 -Wp,-D_FORTIFY_SOURCE=2 -fstack-protector-strong --param=ssp-buffer-size=4 -Werror=trampolines -fPIC -mtune=generic -march=x86-64 -gdwarf-4 -fno-debug-types-section -fvar-tracking-assignments -g2 -fno-var-tracking runmath.cc | \ perl ./findsym.pl runmath.symbols.h - x86_64-pld-linux-gnux32-g++ -Wall -E -DNOSYM -DHAVE_CONFIG_H -D_FILE_OFFSET_BITS=64 -DUSEGC -DFFTWPP_SINGLE_THREAD -I. -I/usr/include/gc -I/usr/include/gc -I/usr/include/tirpc -O2 -fwrapv -pipe -Wformat -Werror=format-security -gdwarf-4 -fno-debug-types-section -fvar-tracking-assignments -g2 -Wp,-D_FORTIFY_SOURCE=2 -fstack-protector-strong --param=ssp-buffer-size=4 -Werror=trampolines -fPIC -mtune=generic -march=x86-64 -gdwarf-4 -fno-debug-types-section -fvar-tracking-assignments -g2 -O2 -fwrapv -pipe -Wformat -Werror=format-security -gdwarf-4 -fno-debug-types-section -fvar-tracking-assignments -g2 -Wp,-D_FORTIFY_SOURCE=2 -fstack-protector-strong --param=ssp-buffer-size=4 -Werror=trampolines -fPIC -mtune=generic -march=x86-64 -gdwarf-4 -fno-debug-types-section -fvar-tracking-assignments -g2 -fno-var-tracking runpath3d.cc | \ perl ./findsym.pl runpath3d.symbols.h - x86_64-pld-linux-gnux32-g++ -Wall -DHAVE_CONFIG_H -D_FILE_OFFSET_BITS=64 -DUSEGC -DFFTWPP_SINGLE_THREAD -I. -I/usr/include/gc -I/usr/include/gc -I/usr/include/tirpc -O2 -fwrapv -pipe -Wformat -Werror=format-security -gdwarf-4 -fno-debug-types-section -fvar-tracking-assignments -g2 -Wp,-D_FORTIFY_SOURCE=2 -fstack-protector-strong --param=ssp-buffer-size=4 -Werror=trampolines -fPIC -mtune=generic -march=x86-64 -gdwarf-4 -fno-debug-types-section -fvar-tracking-assignments -g2 -O2 -fwrapv -pipe -Wformat -Werror=format-security -gdwarf-4 -fno-debug-types-section -fvar-tracking-assignments -g2 -Wp,-D_FORTIFY_SOURCE=2 -fstack-protector-strong --param=ssp-buffer-size=4 -Werror=trampolines -fPIC -mtune=generic -march=x86-64 -gdwarf-4 -fno-debug-types-section -fvar-tracking-assignments -g2 -fno-var-tracking -o flatguide.o -c flatguide.cc x86_64-pld-linux-gnux32-g++ -Wall -DHAVE_CONFIG_H -D_FILE_OFFSET_BITS=64 -DUSEGC -DFFTWPP_SINGLE_THREAD -I. -I/usr/include/gc -I/usr/include/gc -I/usr/include/tirpc -O2 -fwrapv -pipe -Wformat -Werror=format-security -gdwarf-4 -fno-debug-types-section -fvar-tracking-assignments -g2 -Wp,-D_FORTIFY_SOURCE=2 -fstack-protector-strong --param=ssp-buffer-size=4 -Werror=trampolines -fPIC -mtune=generic -march=x86-64 -gdwarf-4 -fno-debug-types-section -fvar-tracking-assignments -g2 -O2 -fwrapv -pipe -Wformat -Werror=format-security -gdwarf-4 -fno-debug-types-section -fvar-tracking-assignments -g2 -Wp,-D_FORTIFY_SOURCE=2 -fstack-protector-strong --param=ssp-buffer-size=4 -Werror=trampolines -fPIC -mtune=generic -march=x86-64 -gdwarf-4 -fno-debug-types-section -fvar-tracking-assignments -g2 -fno-var-tracking -o camperror.o -c camperror.cc x86_64-pld-linux-gnux32-g++ -Wall -DHAVE_CONFIG_H -D_FILE_OFFSET_BITS=64 -DUSEGC -DFFTWPP_SINGLE_THREAD -I. -I/usr/include/gc -I/usr/include/gc -I/usr/include/tirpc -O2 -fwrapv -pipe -Wformat -Werror=format-security -gdwarf-4 -fno-debug-types-section -fvar-tracking-assignments -g2 -Wp,-D_FORTIFY_SOURCE=2 -fstack-protector-strong --param=ssp-buffer-size=4 -Werror=trampolines -fPIC -mtune=generic -march=x86-64 -gdwarf-4 -fno-debug-types-section -fvar-tracking-assignments -g2 -O2 -fwrapv -pipe -Wformat -Werror=format-security -gdwarf-4 -fno-debug-types-section -fvar-tracking-assignments -g2 -Wp,-D_FORTIFY_SOURCE=2 -fstack-protector-strong --param=ssp-buffer-size=4 -Werror=trampolines -fPIC -mtune=generic -march=x86-64 -gdwarf-4 -fno-debug-types-section -fvar-tracking-assignments -g2 -fno-var-tracking -o pipestream.o -c pipestream.cc x86_64-pld-linux-gnux32-g++ -Wall -DHAVE_CONFIG_H -D_FILE_OFFSET_BITS=64 -DUSEGC -DFFTWPP_SINGLE_THREAD -I. -I/usr/include/gc -I/usr/include/gc -I/usr/include/tirpc -O2 -fwrapv -pipe -Wformat -Werror=format-security -gdwarf-4 -fno-debug-types-section -fvar-tracking-assignments -g2 -Wp,-D_FORTIFY_SOURCE=2 -fstack-protector-strong --param=ssp-buffer-size=4 -Werror=trampolines -fPIC -mtune=generic -march=x86-64 -gdwarf-4 -fno-debug-types-section -fvar-tracking-assignments -g2 -O2 -fwrapv -pipe -Wformat -Werror=format-security -gdwarf-4 -fno-debug-types-section -fvar-tracking-assignments -g2 -Wp,-D_FORTIFY_SOURCE=2 -fstack-protector-strong --param=ssp-buffer-size=4 -Werror=trampolines -fPIC -mtune=generic -march=x86-64 -gdwarf-4 -fno-debug-types-section -fvar-tracking-assignments -g2 -fno-var-tracking -o guide.o -c guide.cc x86_64-pld-linux-gnux32-g++ -Wall -DHAVE_CONFIG_H -D_FILE_OFFSET_BITS=64 -DUSEGC -DFFTWPP_SINGLE_THREAD -I. -I/usr/include/gc -I/usr/include/gc -I/usr/include/tirpc -O2 -fwrapv -pipe -Wformat -Werror=format-security -gdwarf-4 -fno-debug-types-section -fvar-tracking-assignments -g2 -Wp,-D_FORTIFY_SOURCE=2 -fstack-protector-strong --param=ssp-buffer-size=4 -Werror=trampolines -fPIC -mtune=generic -march=x86-64 -gdwarf-4 -fno-debug-types-section -fvar-tracking-assignments -g2 -O2 -fwrapv -pipe -Wformat -Werror=format-security -gdwarf-4 -fno-debug-types-section -fvar-tracking-assignments -g2 -Wp,-D_FORTIFY_SOURCE=2 -fstack-protector-strong --param=ssp-buffer-size=4 -Werror=trampolines -fPIC -mtune=generic -march=x86-64 -gdwarf-4 -fno-debug-types-section -fvar-tracking-assignments -g2 -fno-var-tracking -o callable.o -c callable.cc x86_64-pld-linux-gnux32-g++ -Wall -DHAVE_CONFIG_H -D_FILE_OFFSET_BITS=64 -DUSEGC -DFFTWPP_SINGLE_THREAD -I. -I/usr/include/gc -I/usr/include/gc -I/usr/include/tirpc -O2 -fwrapv -pipe -Wformat -Werror=format-security -gdwarf-4 -fno-debug-types-section -fvar-tracking-assignments -g2 -Wp,-D_FORTIFY_SOURCE=2 -fstack-protector-strong --param=ssp-buffer-size=4 -Werror=trampolines -fPIC -mtune=generic -march=x86-64 -gdwarf-4 -fno-debug-types-section -fvar-tracking-assignments -g2 -O2 -fwrapv -pipe -Wformat -Werror=format-security -gdwarf-4 -fno-debug-types-section -fvar-tracking-assignments -g2 -Wp,-D_FORTIFY_SOURCE=2 -fstack-protector-strong --param=ssp-buffer-size=4 -Werror=trampolines -fPIC -mtune=generic -march=x86-64 -gdwarf-4 -fno-debug-types-section -fvar-tracking-assignments -g2 -fno-var-tracking -o util.o -c util.cc x86_64-pld-linux-gnux32-g++ -Wall -DHAVE_CONFIG_H -D_FILE_OFFSET_BITS=64 -DUSEGC -DFFTWPP_SINGLE_THREAD -I. -I/usr/include/gc -I/usr/include/gc -I/usr/include/tirpc -O2 -fwrapv -pipe -Wformat -Werror=format-security -gdwarf-4 -fno-debug-types-section -fvar-tracking-assignments -g2 -Wp,-D_FORTIFY_SOURCE=2 -fstack-protector-strong --param=ssp-buffer-size=4 -Werror=trampolines -fPIC -mtune=generic -march=x86-64 -gdwarf-4 -fno-debug-types-section -fvar-tracking-assignments -g2 -O2 -fwrapv -pipe -Wformat -Werror=format-security -gdwarf-4 -fno-debug-types-section -fvar-tracking-assignments -g2 -Wp,-D_FORTIFY_SOURCE=2 -fstack-protector-strong --param=ssp-buffer-size=4 -Werror=trampolines -fPIC -mtune=generic -march=x86-64 -gdwarf-4 -fno-debug-types-section -fvar-tracking-assignments -g2 -fno-var-tracking -o drawlabel.o -c drawlabel.cc In file included from glrender.h:64, from drawelement.h:21, from drawlabel.h:11, from drawlabel.cc:10: /usr/include/GL/osmesa.h:125:1: error: expected initializer before 'OSMesaCreateContext' 125 | OSMesaCreateContext( GLenum format, OSMesaContext sharelist ); | ^~~~~~~~~~~~~~~~~~~ /usr/include/GL/osmesa.h:138:1: error: expected initializer before 'OSMesaCreateContextExt' 138 | OSMesaCreateContextExt( GLenum format, GLint depthBits, GLint stencilBits, | ^~~~~~~~~~~~~~~~~~~~~~ /usr/include/GL/osmesa.h:167:1: error: expected initializer before 'OSMesaCreateContextAttribs' 167 | OSMesaCreateContextAttribs( const int *attribList, OSMesaContext sharelist ); | ^~~~~~~~~~~~~~~~~~~~~~~~~~ /usr/include/GL/osmesa.h:177:1: error: expected initializer before 'OSMesaDestroyContext' 177 | OSMesaDestroyContext( OSMesaContext ctx ); | ^~~~~~~~~~~~~~~~~~~~ /usr/include/GL/osmesa.h:209:1: error: expected initializer before 'OSMesaMakeCurrent' 209 | OSMesaMakeCurrent( OSMesaContext ctx, void *buffer, GLenum type, | ^~~~~~~~~~~~~~~~~ /usr/include/GL/osmesa.h:219:1: error: expected initializer before 'OSMesaGetCurrentContext' 219 | OSMesaGetCurrentContext( void ); | ^~~~~~~~~~~~~~~~~~~~~~~ /usr/include/GL/osmesa.h:237:1: error: expected initializer before 'OSMesaPixelStore' 237 | OSMesaPixelStore( GLint pname, GLint value ); | ^~~~~~~~~~~~~~~~ /usr/include/GL/osmesa.h:253:1: error: expected initializer before 'OSMesaGetIntegerv' 253 | OSMesaGetIntegerv( GLint pname, GLint *value ); | ^~~~~~~~~~~~~~~~~ /usr/include/GL/osmesa.h:268:1: error: expected initializer before 'OSMesaGetDepthBuffer' 268 | OSMesaGetDepthBuffer( OSMesaContext c, GLint *width, GLint *height, | ^~~~~~~~~~~~~~~~~~~~ /usr/include/GL/osmesa.h:284:1: error: expected initializer before 'OSMesaGetColorBuffer' 284 | OSMesaGetColorBuffer( OSMesaContext c, GLint *width, GLint *height, | ^~~~~~~~~~~~~~~~~~~~ /usr/include/GL/osmesa.h:301:1: error: expected initializer before 'OSMesaGetProcAddress' 301 | OSMesaGetProcAddress( const char *funcName ); | ^~~~~~~~~~~~~~~~~~~~ /usr/include/GL/osmesa.h:310:1: error: expected initializer before 'OSMesaColorClamp' 310 | OSMesaColorClamp(GLboolean enable); | ^~~~~~~~~~~~~~~~ /usr/include/GL/osmesa.h:323:1: error: expected initializer before 'OSMesaPostprocess' 323 | OSMesaPostprocess(OSMesaContext osmesa, const char *filter, | ^~~~~~~~~~~~~~~~~ make: *** [Makefile:364: drawlabel.o] Error 1 make: *** Waiting for unfinished jobs.... x86_64-pld-linux-gnux32-g++ -Wall -DHAVE_CONFIG_H -D_FILE_OFFSET_BITS=64 -DUSEGC -DFFTWPP_SINGLE_THREAD -I. -I/usr/include/gc -I/usr/include/gc -I/usr/include/tirpc -O2 -fwrapv -pipe -Wformat -Werror=format-security -gdwarf-4 -fno-debug-types-section -fvar-tracking-assignments -g2 -Wp,-D_FORTIFY_SOURCE=2 -fstack-protector-strong --param=ssp-buffer-size=4 -Werror=trampolines -fPIC -mtune=generic -march=x86-64 -gdwarf-4 -fno-debug-types-section -fvar-tracking-assignments -g2 -O2 -fwrapv -pipe -Wformat -Werror=format-security -gdwarf-4 -fno-debug-types-section -fvar-tracking-assignments -g2 -Wp,-D_FORTIFY_SOURCE=2 -fstack-protector-strong --param=ssp-buffer-size=4 -Werror=trampolines -fPIC -mtune=generic -march=x86-64 -gdwarf-4 -fno-debug-types-section -fvar-tracking-assignments -g2 -fno-var-tracking -o genv.o -c genv.cc x86_64-pld-linux-gnux32-g++ -Wall -DHAVE_CONFIG_H -D_FILE_OFFSET_BITS=64 -DUSEGC -DFFTWPP_SINGLE_THREAD -I. -I/usr/include/gc -I/usr/include/gc -I/usr/include/tirpc -O2 -fwrapv -pipe -Wformat -Werror=format-security -gdwarf-4 -fno-debug-types-section -fvar-tracking-assignments -g2 -Wp,-D_FORTIFY_SOURCE=2 -fstack-protector-strong --param=ssp-buffer-size=4 -Werror=trampolines -fPIC -mtune=generic -march=x86-64 -gdwarf-4 -fno-debug-types-section -fvar-tracking-assignments -g2 -O2 -fwrapv -pipe -Wformat -Werror=format-security -gdwarf-4 -fno-debug-types-section -fvar-tracking-assignments -g2 -Wp,-D_FORTIFY_SOURCE=2 -fstack-protector-strong --param=ssp-buffer-size=4 -Werror=trampolines -fPIC -mtune=generic -march=x86-64 -gdwarf-4 -fno-debug-types-section -fvar-tracking-assignments -g2 -fno-var-tracking -o name.o -c name.cc x86_64-pld-linux-gnux32-g++ -Wall -DHAVE_CONFIG_H -D_FILE_OFFSET_BITS=64 -DUSEGC -DFFTWPP_SINGLE_THREAD -I. -I/usr/include/gc -I/usr/include/gc -I/usr/include/tirpc -O2 -fwrapv -pipe -Wformat -Werror=format-security -gdwarf-4 -fno-debug-types-section -fvar-tracking-assignments -g2 -Wp,-D_FORTIFY_SOURCE=2 -fstack-protector-strong --param=ssp-buffer-size=4 -Werror=trampolines -fPIC -mtune=generic -march=x86-64 -gdwarf-4 -fno-debug-types-section -fvar-tracking-assignments -g2 -O2 -fwrapv -pipe -Wformat -Werror=format-security -gdwarf-4 -fno-debug-types-section -fvar-tracking-assignments -g2 -Wp,-D_FORTIFY_SOURCE=2 -fstack-protector-strong --param=ssp-buffer-size=4 -Werror=trampolines -fPIC -mtune=generic -march=x86-64 -gdwarf-4 -fno-debug-types-section -fvar-tracking-assignments -g2 -fno-var-tracking -o settings.o -c settings.cc In file included from glrender.h:64, from settings.cc:38: /usr/include/GL/osmesa.h:125:1: error: expected initializer before 'OSMesaCreateContext' 125 | OSMesaCreateContext( GLenum format, OSMesaContext sharelist ); | ^~~~~~~~~~~~~~~~~~~ /usr/include/GL/osmesa.h:138:1: error: expected initializer before 'OSMesaCreateContextExt' 138 | OSMesaCreateContextExt( GLenum format, GLint depthBits, GLint stencilBits, | ^~~~~~~~~~~~~~~~~~~~~~ /usr/include/GL/osmesa.h:167:1: error: expected initializer before 'OSMesaCreateContextAttribs' 167 | OSMesaCreateContextAttribs( const int *attribList, OSMesaContext sharelist ); | ^~~~~~~~~~~~~~~~~~~~~~~~~~ /usr/include/GL/osmesa.h:177:1: error: expected initializer before 'OSMesaDestroyContext' 177 | OSMesaDestroyContext( OSMesaContext ctx ); | ^~~~~~~~~~~~~~~~~~~~ /usr/include/GL/osmesa.h:209:1: error: expected initializer before 'OSMesaMakeCurrent' 209 | OSMesaMakeCurrent( OSMesaContext ctx, void *buffer, GLenum type, | ^~~~~~~~~~~~~~~~~ /usr/include/GL/osmesa.h:219:1: error: expected initializer before 'OSMesaGetCurrentContext' 219 | OSMesaGetCurrentContext( void ); | ^~~~~~~~~~~~~~~~~~~~~~~ /usr/include/GL/osmesa.h:237:1: error: expected initializer before 'OSMesaPixelStore' 237 | OSMesaPixelStore( GLint pname, GLint value ); | ^~~~~~~~~~~~~~~~ /usr/include/GL/osmesa.h:253:1: error: expected initializer before 'OSMesaGetIntegerv' 253 | OSMesaGetIntegerv( GLint pname, GLint *value ); | ^~~~~~~~~~~~~~~~~ /usr/include/GL/osmesa.h:268:1: error: expected initializer before 'OSMesaGetDepthBuffer' 268 | OSMesaGetDepthBuffer( OSMesaContext c, GLint *width, GLint *height, | ^~~~~~~~~~~~~~~~~~~~ /usr/include/GL/osmesa.h:284:1: error: expected initializer before 'OSMesaGetColorBuffer' 284 | OSMesaGetColorBuffer( OSMesaContext c, GLint *width, GLint *height, | ^~~~~~~~~~~~~~~~~~~~ /usr/include/GL/osmesa.h:301:1: error: expected initializer before 'OSMesaGetProcAddress' 301 | OSMesaGetProcAddress( const char *funcName ); | ^~~~~~~~~~~~~~~~~~~~ /usr/include/GL/osmesa.h:310:1: error: expected initializer before 'OSMesaColorClamp' 310 | OSMesaColorClamp(GLboolean enable); | ^~~~~~~~~~~~~~~~ /usr/include/GL/osmesa.h:323:1: error: expected initializer before 'OSMesaPostprocess' 323 | OSMesaPostprocess(OSMesaContext osmesa, const char *filter, | ^~~~~~~~~~~~~~~~~ make: *** [Makefile:364: settings.o] Error 1 x86_64-pld-linux-gnux32-g++ -Wall -DHAVE_CONFIG_H -D_FILE_OFFSET_BITS=64 -DUSEGC -DFFTWPP_SINGLE_THREAD -I. -I/usr/include/gc -I/usr/include/gc -I/usr/include/tirpc -O2 -fwrapv -pipe -Wformat -Werror=format-security -gdwarf-4 -fno-debug-types-section -fvar-tracking-assignments -g2 -Wp,-D_FORTIFY_SOURCE=2 -fstack-protector-strong --param=ssp-buffer-size=4 -Werror=trampolines -fPIC -mtune=generic -march=x86-64 -gdwarf-4 -fno-debug-types-section -fvar-tracking-assignments -g2 -O2 -fwrapv -pipe -Wformat -Werror=format-security -gdwarf-4 -fno-debug-types-section -fvar-tracking-assignments -g2 -Wp,-D_FORTIFY_SOURCE=2 -fstack-protector-strong --param=ssp-buffer-size=4 -Werror=trampolines -fPIC -mtune=generic -march=x86-64 -gdwarf-4 -fno-debug-types-section -fvar-tracking-assignments -g2 -fno-var-tracking -o drawsurface.o -c drawsurface.cc In file included from glrender.h:64, from drawelement.h:21, from drawsurface.h:10, from drawsurface.cc:7: /usr/include/GL/osmesa.h:125:1: error: expected initializer before 'OSMesaCreateContext' 125 | OSMesaCreateContext( GLenum format, OSMesaContext sharelist ); | ^~~~~~~~~~~~~~~~~~~ /usr/include/GL/osmesa.h:138:1: error: expected initializer before 'OSMesaCreateContextExt' 138 | OSMesaCreateContextExt( GLenum format, GLint depthBits, GLint stencilBits, | ^~~~~~~~~~~~~~~~~~~~~~ /usr/include/GL/osmesa.h:167:1: error: expected initializer before 'OSMesaCreateContextAttribs' 167 | OSMesaCreateContextAttribs( const int *attribList, OSMesaContext sharelist ); | ^~~~~~~~~~~~~~~~~~~~~~~~~~ /usr/include/GL/osmesa.h:177:1: error: expected initializer before 'OSMesaDestroyContext' 177 | OSMesaDestroyContext( OSMesaContext ctx ); | ^~~~~~~~~~~~~~~~~~~~ /usr/include/GL/osmesa.h:209:1: error: expected initializer before 'OSMesaMakeCurrent' 209 | OSMesaMakeCurrent( OSMesaContext ctx, void *buffer, GLenum type, | ^~~~~~~~~~~~~~~~~ /usr/include/GL/osmesa.h:219:1: error: expected initializer before 'OSMesaGetCurrentContext' 219 | OSMesaGetCurrentContext( void ); | ^~~~~~~~~~~~~~~~~~~~~~~ /usr/include/GL/osmesa.h:237:1: error: expected initializer before 'OSMesaPixelStore' 237 | OSMesaPixelStore( GLint pname, GLint value ); | ^~~~~~~~~~~~~~~~ /usr/include/GL/osmesa.h:253:1: error: expected initializer before 'OSMesaGetIntegerv' 253 | OSMesaGetIntegerv( GLint pname, GLint *value ); | ^~~~~~~~~~~~~~~~~ /usr/include/GL/osmesa.h:268:1: error: expected initializer before 'OSMesaGetDepthBuffer' 268 | OSMesaGetDepthBuffer( OSMesaContext c, GLint *width, GLint *height, | ^~~~~~~~~~~~~~~~~~~~ /usr/include/GL/osmesa.h:284:1: error: expected initializer before 'OSMesaGetColorBuffer' 284 | OSMesaGetColorBuffer( OSMesaContext c, GLint *width, GLint *height, | ^~~~~~~~~~~~~~~~~~~~ /usr/include/GL/osmesa.h:301:1: error: expected initializer before 'OSMesaGetProcAddress' 301 | OSMesaGetProcAddress( const char *funcName ); | ^~~~~~~~~~~~~~~~~~~~ /usr/include/GL/osmesa.h:310:1: error: expected initializer before 'OSMesaColorClamp' 310 | OSMesaColorClamp(GLboolean enable); | ^~~~~~~~~~~~~~~~ /usr/include/GL/osmesa.h:323:1: error: expected initializer before 'OSMesaPostprocess' 323 | OSMesaPostprocess(OSMesaContext osmesa, const char *filter, | ^~~~~~~~~~~~~~~~~ make: *** [Makefile:364: drawsurface.o] Error 1 x86_64-pld-linux-gnux32-g++ -Wall -DHAVE_CONFIG_H -D_FILE_OFFSET_BITS=64 -DUSEGC -DFFTWPP_SINGLE_THREAD -I. -I/usr/include/gc -I/usr/include/gc -I/usr/include/tirpc -O2 -fwrapv -pipe -Wformat -Werror=format-security -gdwarf-4 -fno-debug-types-section -fvar-tracking-assignments -g2 -Wp,-D_FORTIFY_SOURCE=2 -fstack-protector-strong --param=ssp-buffer-size=4 -Werror=trampolines -fPIC -mtune=generic -march=x86-64 -gdwarf-4 -fno-debug-types-section -fvar-tracking-assignments -g2 -O2 -fwrapv -pipe -Wformat -Werror=format-security -gdwarf-4 -fno-debug-types-section -fvar-tracking-assignments -g2 -Wp,-D_FORTIFY_SOURCE=2 -fstack-protector-strong --param=ssp-buffer-size=4 -Werror=trampolines -fPIC -mtune=generic -march=x86-64 -gdwarf-4 -fno-debug-types-section -fvar-tracking-assignments -g2 -fno-var-tracking -o drawpath3.o -c drawpath3.cc In file included from glrender.h:64, from drawelement.h:21, from drawpath3.h:10, from drawpath3.cc:7: /usr/include/GL/osmesa.h:125:1: error: expected initializer before 'OSMesaCreateContext' 125 | OSMesaCreateContext( GLenum format, OSMesaContext sharelist ); | ^~~~~~~~~~~~~~~~~~~ /usr/include/GL/osmesa.h:138:1: error: expected initializer before 'OSMesaCreateContextExt' 138 | OSMesaCreateContextExt( GLenum format, GLint depthBits, GLint stencilBits, | ^~~~~~~~~~~~~~~~~~~~~~ /usr/include/GL/osmesa.h:167:1: error: expected initializer before 'OSMesaCreateContextAttribs' 167 | OSMesaCreateContextAttribs( const int *attribList, OSMesaContext sharelist ); | ^~~~~~~~~~~~~~~~~~~~~~~~~~ /usr/include/GL/osmesa.h:177:1: error: expected initializer before 'OSMesaDestroyContext' 177 | OSMesaDestroyContext( OSMesaContext ctx ); | ^~~~~~~~~~~~~~~~~~~~ /usr/include/GL/osmesa.h:209:1: error: expected initializer before 'OSMesaMakeCurrent' 209 | OSMesaMakeCurrent( OSMesaContext ctx, void *buffer, GLenum type, | ^~~~~~~~~~~~~~~~~ /usr/include/GL/osmesa.h:219:1: error: expected initializer before 'OSMesaGetCurrentContext' 219 | OSMesaGetCurrentContext( void ); | ^~~~~~~~~~~~~~~~~~~~~~~ /usr/include/GL/osmesa.h:237:1: error: expected initializer before 'OSMesaPixelStore' 237 | OSMesaPixelStore( GLint pname, GLint value ); | ^~~~~~~~~~~~~~~~ /usr/include/GL/osmesa.h:253:1: error: expected initializer before 'OSMesaGetIntegerv' 253 | OSMesaGetIntegerv( GLint pname, GLint *value ); | ^~~~~~~~~~~~~~~~~ /usr/include/GL/osmesa.h:268:1: error: expected initializer before 'OSMesaGetDepthBuffer' 268 | OSMesaGetDepthBuffer( OSMesaContext c, GLint *width, GLint *height, | ^~~~~~~~~~~~~~~~~~~~ /usr/include/GL/osmesa.h:284:1: error: expected initializer before 'OSMesaGetColorBuffer' 284 | OSMesaGetColorBuffer( OSMesaContext c, GLint *width, GLint *height, | ^~~~~~~~~~~~~~~~~~~~ /usr/include/GL/osmesa.h:301:1: error: expected initializer before 'OSMesaGetProcAddress' 301 | OSMesaGetProcAddress( const char *funcName ); | ^~~~~~~~~~~~~~~~~~~~ /usr/include/GL/osmesa.h:310:1: error: expected initializer before 'OSMesaColorClamp' 310 | OSMesaColorClamp(GLboolean enable); | ^~~~~~~~~~~~~~~~ /usr/include/GL/osmesa.h:323:1: error: expected initializer before 'OSMesaPostprocess' 323 | OSMesaPostprocess(OSMesaContext osmesa, const char *filter, | ^~~~~~~~~~~~~~~~~ make: *** [Makefile:364: drawpath3.o] Error 1 x86_64-pld-linux-gnux32-g++ -Wall -DHAVE_CONFIG_H -D_FILE_OFFSET_BITS=64 -DUSEGC -DFFTWPP_SINGLE_THREAD -I. -I/usr/include/gc -I/usr/include/gc -I/usr/include/tirpc -O2 -fwrapv -pipe -Wformat -Werror=format-security -gdwarf-4 -fno-debug-types-section -fvar-tracking-assignments -g2 -Wp,-D_FORTIFY_SOURCE=2 -fstack-protector-strong --param=ssp-buffer-size=4 -Werror=trampolines -fPIC -mtune=generic -march=x86-64 -gdwarf-4 -fno-debug-types-section -fvar-tracking-assignments -g2 -O2 -fwrapv -pipe -Wformat -Werror=format-security -gdwarf-4 -fno-debug-types-section -fvar-tracking-assignments -g2 -Wp,-D_FORTIFY_SOURCE=2 -fstack-protector-strong --param=ssp-buffer-size=4 -Werror=trampolines -fPIC -mtune=generic -march=x86-64 -gdwarf-4 -fno-debug-types-section -fvar-tracking-assignments -g2 -fno-var-tracking -o pen.o -c pen.cc In file included from glrender.h:64, from drawelement.h:21, from pen.cc:8: /usr/include/GL/osmesa.h:125:1: error: expected initializer before 'OSMesaCreateContext' 125 | OSMesaCreateContext( GLenum format, OSMesaContext sharelist ); | ^~~~~~~~~~~~~~~~~~~ /usr/include/GL/osmesa.h:138:1: error: expected initializer before 'OSMesaCreateContextExt' 138 | OSMesaCreateContextExt( GLenum format, GLint depthBits, GLint stencilBits, | ^~~~~~~~~~~~~~~~~~~~~~ /usr/include/GL/osmesa.h:167:1: error: expected initializer before 'OSMesaCreateContextAttribs' 167 | OSMesaCreateContextAttribs( const int *attribList, OSMesaContext sharelist ); | ^~~~~~~~~~~~~~~~~~~~~~~~~~ /usr/include/GL/osmesa.h:177:1: error: expected initializer before 'OSMesaDestroyContext' 177 | OSMesaDestroyContext( OSMesaContext ctx ); | ^~~~~~~~~~~~~~~~~~~~ /usr/include/GL/osmesa.h:209:1: error: expected initializer before 'OSMesaMakeCurrent' 209 | OSMesaMakeCurrent( OSMesaContext ctx, void *buffer, GLenum type, | ^~~~~~~~~~~~~~~~~ /usr/include/GL/osmesa.h:219:1: error: expected initializer before 'OSMesaGetCurrentContext' 219 | OSMesaGetCurrentContext( void ); | ^~~~~~~~~~~~~~~~~~~~~~~ /usr/include/GL/osmesa.h:237:1: error: expected initializer before 'OSMesaPixelStore' 237 | OSMesaPixelStore( GLint pname, GLint value ); | ^~~~~~~~~~~~~~~~ /usr/include/GL/osmesa.h:253:1: error: expected initializer before 'OSMesaGetIntegerv' 253 | OSMesaGetIntegerv( GLint pname, GLint *value ); | ^~~~~~~~~~~~~~~~~ /usr/include/GL/osmesa.h:268:1: error: expected initializer before 'OSMesaGetDepthBuffer' 268 | OSMesaGetDepthBuffer( OSMesaContext c, GLint *width, GLint *height, | ^~~~~~~~~~~~~~~~~~~~ /usr/include/GL/osmesa.h:284:1: error: expected initializer before 'OSMesaGetColorBuffer' 284 | OSMesaGetColorBuffer( OSMesaContext c, GLint *width, GLint *height, | ^~~~~~~~~~~~~~~~~~~~ /usr/include/GL/osmesa.h:301:1: error: expected initializer before 'OSMesaGetProcAddress' 301 | OSMesaGetProcAddress( const char *funcName ); | ^~~~~~~~~~~~~~~~~~~~ /usr/include/GL/osmesa.h:310:1: error: expected initializer before 'OSMesaColorClamp' 310 | OSMesaColorClamp(GLboolean enable); | ^~~~~~~~~~~~~~~~ /usr/include/GL/osmesa.h:323:1: error: expected initializer before 'OSMesaPostprocess' 323 | OSMesaPostprocess(OSMesaContext osmesa, const char *filter, | ^~~~~~~~~~~~~~~~~ make: *** [Makefile:364: pen.o] Error 1 x86_64-pld-linux-gnux32-g++ -Wall -DHAVE_CONFIG_H -D_FILE_OFFSET_BITS=64 -DUSEGC -DFFTWPP_SINGLE_THREAD -I. -I/usr/include/gc -I/usr/include/gc -I/usr/include/tirpc -O2 -fwrapv -pipe -Wformat -Werror=format-security -gdwarf-4 -fno-debug-types-section -fvar-tracking-assignments -g2 -Wp,-D_FORTIFY_SOURCE=2 -fstack-protector-strong --param=ssp-buffer-size=4 -Werror=trampolines -fPIC -mtune=generic -march=x86-64 -gdwarf-4 -fno-debug-types-section -fvar-tracking-assignments -g2 -O2 -fwrapv -pipe -Wformat -Werror=format-security -gdwarf-4 -fno-debug-types-section -fvar-tracking-assignments -g2 -Wp,-D_FORTIFY_SOURCE=2 -fstack-protector-strong --param=ssp-buffer-size=4 -Werror=trampolines -fPIC -mtune=generic -march=x86-64 -gdwarf-4 -fno-debug-types-section -fvar-tracking-assignments -g2 -fno-var-tracking -o bezierpatch.o -c bezierpatch.cc In file included from glrender.h:64, from drawelement.h:21, from bezierpatch.h:11, from bezierpatch.cc:8: /usr/include/GL/osmesa.h:125:1: error: expected initializer before 'OSMesaCreateContext' 125 | OSMesaCreateContext( GLenum format, OSMesaContext sharelist ); | ^~~~~~~~~~~~~~~~~~~ /usr/include/GL/osmesa.h:138:1: error: expected initializer before 'OSMesaCreateContextExt' 138 | OSMesaCreateContextExt( GLenum format, GLint depthBits, GLint stencilBits, | ^~~~~~~~~~~~~~~~~~~~~~ /usr/include/GL/osmesa.h:167:1: error: expected initializer before 'OSMesaCreateContextAttribs' 167 | OSMesaCreateContextAttribs( const int *attribList, OSMesaContext sharelist ); | ^~~~~~~~~~~~~~~~~~~~~~~~~~ /usr/include/GL/osmesa.h:177:1: error: expected initializer before 'OSMesaDestroyContext' 177 | OSMesaDestroyContext( OSMesaContext ctx ); | ^~~~~~~~~~~~~~~~~~~~ /usr/include/GL/osmesa.h:209:1: error: expected initializer before 'OSMesaMakeCurrent' 209 | OSMesaMakeCurrent( OSMesaContext ctx, void *buffer, GLenum type, | ^~~~~~~~~~~~~~~~~ /usr/include/GL/osmesa.h:219:1: error: expected initializer before 'OSMesaGetCurrentContext' 219 | OSMesaGetCurrentContext( void ); | ^~~~~~~~~~~~~~~~~~~~~~~ /usr/include/GL/osmesa.h:237:1: error: expected initializer before 'OSMesaPixelStore' 237 | OSMesaPixelStore( GLint pname, GLint value ); | ^~~~~~~~~~~~~~~~ /usr/include/GL/osmesa.h:253:1: error: expected initializer before 'OSMesaGetIntegerv' 253 | OSMesaGetIntegerv( GLint pname, GLint *value ); | ^~~~~~~~~~~~~~~~~ /usr/include/GL/osmesa.h:268:1: error: expected initializer before 'OSMesaGetDepthBuffer' 268 | OSMesaGetDepthBuffer( OSMesaContext c, GLint *width, GLint *height, | ^~~~~~~~~~~~~~~~~~~~ /usr/include/GL/osmesa.h:284:1: error: expected initializer before 'OSMesaGetColorBuffer' 284 | OSMesaGetColorBuffer( OSMesaContext c, GLint *width, GLint *height, | ^~~~~~~~~~~~~~~~~~~~ /usr/include/GL/osmesa.h:301:1: error: expected initializer before 'OSMesaGetProcAddress' 301 | OSMesaGetProcAddress( const char *funcName ); | ^~~~~~~~~~~~~~~~~~~~ /usr/include/GL/osmesa.h:310:1: error: expected initializer before 'OSMesaColorClamp' 310 | OSMesaColorClamp(GLboolean enable); | ^~~~~~~~~~~~~~~~ /usr/include/GL/osmesa.h:323:1: error: expected initializer before 'OSMesaPostprocess' 323 | OSMesaPostprocess(OSMesaContext osmesa, const char *filter, | ^~~~~~~~~~~~~~~~~ make: *** [Makefile:364: bezierpatch.o] Error 1 x86_64-pld-linux-gnux32-g++ -Wall -DHAVE_CONFIG_H -D_FILE_OFFSET_BITS=64 -DUSEGC -DFFTWPP_SINGLE_THREAD -I. -I/usr/include/gc -I/usr/include/gc -I/usr/include/tirpc -O2 -fwrapv -pipe -Wformat -Werror=format-security -gdwarf-4 -fno-debug-types-section -fvar-tracking-assignments -g2 -Wp,-D_FORTIFY_SOURCE=2 -fstack-protector-strong --param=ssp-buffer-size=4 -Werror=trampolines -fPIC -mtune=generic -march=x86-64 -gdwarf-4 -fno-debug-types-section -fvar-tracking-assignments -g2 -O2 -fwrapv -pipe -Wformat -Werror=format-security -gdwarf-4 -fno-debug-types-section -fvar-tracking-assignments -g2 -Wp,-D_FORTIFY_SOURCE=2 -fstack-protector-strong --param=ssp-buffer-size=4 -Werror=trampolines -fPIC -mtune=generic -march=x86-64 -gdwarf-4 -fno-debug-types-section -fvar-tracking-assignments -g2 -fno-var-tracking -o knot.o -c knot.cc x86_64-pld-linux-gnux32-g++ -Wall -DHAVE_CONFIG_H -D_FILE_OFFSET_BITS=64 -DUSEGC -DFFTWPP_SINGLE_THREAD -I. -I/usr/include/gc -I/usr/include/gc -I/usr/include/tirpc -O2 -fwrapv -pipe -Wformat -Werror=format-security -gdwarf-4 -fno-debug-types-section -fvar-tracking-assignments -g2 -Wp,-D_FORTIFY_SOURCE=2 -fstack-protector-strong --param=ssp-buffer-size=4 -Werror=trampolines -fPIC -mtune=generic -march=x86-64 -gdwarf-4 -fno-debug-types-section -fvar-tracking-assignments -g2 -O2 -fwrapv -pipe -Wformat -Werror=format-security -gdwarf-4 -fno-debug-types-section -fvar-tracking-assignments -g2 -Wp,-D_FORTIFY_SOURCE=2 -fstack-protector-strong --param=ssp-buffer-size=4 -Werror=trampolines -fPIC -mtune=generic -march=x86-64 -gdwarf-4 -fno-debug-types-section -fvar-tracking-assignments -g2 -fno-var-tracking -o drawfill.o -c drawfill.cc In file included from glrender.h:64, from drawelement.h:21, from drawfill.h:11, from drawfill.cc:8: /usr/include/GL/osmesa.h:125:1: error: expected initializer before 'OSMesaCreateContext' 125 | OSMesaCreateContext( GLenum format, OSMesaContext sharelist ); | ^~~~~~~~~~~~~~~~~~~ /usr/include/GL/osmesa.h:138:1: error: expected initializer before 'OSMesaCreateContextExt' 138 | OSMesaCreateContextExt( GLenum format, GLint depthBits, GLint stencilBits, | ^~~~~~~~~~~~~~~~~~~~~~ /usr/include/GL/osmesa.h:167:1: error: expected initializer before 'OSMesaCreateContextAttribs' 167 | OSMesaCreateContextAttribs( const int *attribList, OSMesaContext sharelist ); | ^~~~~~~~~~~~~~~~~~~~~~~~~~ /usr/include/GL/osmesa.h:177:1: error: expected initializer before 'OSMesaDestroyContext' 177 | OSMesaDestroyContext( OSMesaContext ctx ); | ^~~~~~~~~~~~~~~~~~~~ /usr/include/GL/osmesa.h:209:1: error: expected initializer before 'OSMesaMakeCurrent' 209 | OSMesaMakeCurrent( OSMesaContext ctx, void *buffer, GLenum type, | ^~~~~~~~~~~~~~~~~ /usr/include/GL/osmesa.h:219:1: error: expected initializer before 'OSMesaGetCurrentContext' 219 | OSMesaGetCurrentContext( void ); | ^~~~~~~~~~~~~~~~~~~~~~~ /usr/include/GL/osmesa.h:237:1: error: expected initializer before 'OSMesaPixelStore' 237 | OSMesaPixelStore( GLint pname, GLint value ); | ^~~~~~~~~~~~~~~~ /usr/include/GL/osmesa.h:253:1: error: expected initializer before 'OSMesaGetIntegerv' 253 | OSMesaGetIntegerv( GLint pname, GLint *value ); | ^~~~~~~~~~~~~~~~~ /usr/include/GL/osmesa.h:268:1: error: expected initializer before 'OSMesaGetDepthBuffer' 268 | OSMesaGetDepthBuffer( OSMesaContext c, GLint *width, GLint *height, | ^~~~~~~~~~~~~~~~~~~~ /usr/include/GL/osmesa.h:284:1: error: expected initializer before 'OSMesaGetColorBuffer' 284 | OSMesaGetColorBuffer( OSMesaContext c, GLint *width, GLint *height, | ^~~~~~~~~~~~~~~~~~~~ /usr/include/GL/osmesa.h:301:1: error: expected initializer before 'OSMesaGetProcAddress' 301 | OSMesaGetProcAddress( const char *funcName ); | ^~~~~~~~~~~~~~~~~~~~ /usr/include/GL/osmesa.h:310:1: error: expected initializer before 'OSMesaColorClamp' 310 | OSMesaColorClamp(GLboolean enable); | ^~~~~~~~~~~~~~~~ /usr/include/GL/osmesa.h:323:1: error: expected initializer before 'OSMesaPostprocess' 323 | OSMesaPostprocess(OSMesaContext osmesa, const char *filter, | ^~~~~~~~~~~~~~~~~ make: *** [Makefile:364: drawfill.o] Error 1 x86_64-pld-linux-gnux32-g++ -Wall -DHAVE_CONFIG_H -D_FILE_OFFSET_BITS=64 -DUSEGC -DFFTWPP_SINGLE_THREAD -I. -I/usr/include/gc -I/usr/include/gc -I/usr/include/tirpc -O2 -fwrapv -pipe -Wformat -Werror=format-security -gdwarf-4 -fno-debug-types-section -fvar-tracking-assignments -g2 -Wp,-D_FORTIFY_SOURCE=2 -fstack-protector-strong --param=ssp-buffer-size=4 -Werror=trampolines -fPIC -mtune=generic -march=x86-64 -gdwarf-4 -fno-debug-types-section -fvar-tracking-assignments -g2 -O2 -fwrapv -pipe -Wformat -Werror=format-security -gdwarf-4 -fno-debug-types-section -fvar-tracking-assignments -g2 -Wp,-D_FORTIFY_SOURCE=2 -fstack-protector-strong --param=ssp-buffer-size=4 -Werror=trampolines -fPIC -mtune=generic -march=x86-64 -gdwarf-4 -fno-debug-types-section -fvar-tracking-assignments -g2 -fno-var-tracking -o beziercurve.o -c beziercurve.cc In file included from glrender.h:64, from drawelement.h:21, from bezierpatch.h:11, from beziercurve.cc:8: /usr/include/GL/osmesa.h:125:1: error: expected initializer before 'OSMesaCreateContext' 125 | OSMesaCreateContext( GLenum format, OSMesaContext sharelist ); | ^~~~~~~~~~~~~~~~~~~ /usr/include/GL/osmesa.h:138:1: error: expected initializer before 'OSMesaCreateContextExt' 138 | OSMesaCreateContextExt( GLenum format, GLint depthBits, GLint stencilBits, | ^~~~~~~~~~~~~~~~~~~~~~ /usr/include/GL/osmesa.h:167:1: error: expected initializer before 'OSMesaCreateContextAttribs' 167 | OSMesaCreateContextAttribs( const int *attribList, OSMesaContext sharelist ); | ^~~~~~~~~~~~~~~~~~~~~~~~~~ /usr/include/GL/osmesa.h:177:1: error: expected initializer before 'OSMesaDestroyContext' 177 | OSMesaDestroyContext( OSMesaContext ctx ); | ^~~~~~~~~~~~~~~~~~~~ /usr/include/GL/osmesa.h:209:1: error: expected initializer before 'OSMesaMakeCurrent' 209 | OSMesaMakeCurrent( OSMesaContext ctx, void *buffer, GLenum type, | ^~~~~~~~~~~~~~~~~ /usr/include/GL/osmesa.h:219:1: error: expected initializer before 'OSMesaGetCurrentContext' 219 | OSMesaGetCurrentContext( void ); | ^~~~~~~~~~~~~~~~~~~~~~~ /usr/include/GL/osmesa.h:237:1: error: expected initializer before 'OSMesaPixelStore' 237 | OSMesaPixelStore( GLint pname, GLint value ); | ^~~~~~~~~~~~~~~~ /usr/include/GL/osmesa.h:253:1: error: expected initializer before 'OSMesaGetIntegerv' 253 | OSMesaGetIntegerv( GLint pname, GLint *value ); | ^~~~~~~~~~~~~~~~~ /usr/include/GL/osmesa.h:268:1: error: expected initializer before 'OSMesaGetDepthBuffer' 268 | OSMesaGetDepthBuffer( OSMesaContext c, GLint *width, GLint *height, | ^~~~~~~~~~~~~~~~~~~~ /usr/include/GL/osmesa.h:284:1: error: expected initializer before 'OSMesaGetColorBuffer' 284 | OSMesaGetColorBuffer( OSMesaContext c, GLint *width, GLint *height, | ^~~~~~~~~~~~~~~~~~~~ /usr/include/GL/osmesa.h:301:1: error: expected initializer before 'OSMesaGetProcAddress' 301 | OSMesaGetProcAddress( const char *funcName ); | ^~~~~~~~~~~~~~~~~~~~ /usr/include/GL/osmesa.h:310:1: error: expected initializer before 'OSMesaColorClamp' 310 | OSMesaColorClamp(GLboolean enable); | ^~~~~~~~~~~~~~~~ /usr/include/GL/osmesa.h:323:1: error: expected initializer before 'OSMesaPostprocess' 323 | OSMesaPostprocess(OSMesaContext osmesa, const char *filter, | ^~~~~~~~~~~~~~~~~ make: *** [Makefile:364: beziercurve.o] Error 1 x86_64-pld-linux-gnux32-g++ -Wall -DHAVE_CONFIG_H -D_FILE_OFFSET_BITS=64 -DUSEGC -DFFTWPP_SINGLE_THREAD -I. -I/usr/include/gc -I/usr/include/gc -I/usr/include/tirpc -O2 -fwrapv -pipe -Wformat -Werror=format-security -gdwarf-4 -fno-debug-types-section -fvar-tracking-assignments -g2 -Wp,-D_FORTIFY_SOURCE=2 -fstack-protector-strong --param=ssp-buffer-size=4 -Werror=trampolines -fPIC -mtune=generic -march=x86-64 -gdwarf-4 -fno-debug-types-section -fvar-tracking-assignments -g2 -O2 -fwrapv -pipe -Wformat -Werror=format-security -gdwarf-4 -fno-debug-types-section -fvar-tracking-assignments -g2 -Wp,-D_FORTIFY_SOURCE=2 -fstack-protector-strong --param=ssp-buffer-size=4 -Werror=trampolines -fPIC -mtune=generic -march=x86-64 -gdwarf-4 -fno-debug-types-section -fvar-tracking-assignments -g2 -fno-var-tracking -o drawpath.o -c drawpath.cc In file included from glrender.h:64, from drawelement.h:21, from drawpath.h:11, from drawpath.cc:12: /usr/include/GL/osmesa.h:125:1: error: expected initializer before 'OSMesaCreateContext' 125 | OSMesaCreateContext( GLenum format, OSMesaContext sharelist ); | ^~~~~~~~~~~~~~~~~~~ /usr/include/GL/osmesa.h:138:1: error: expected initializer before 'OSMesaCreateContextExt' 138 | OSMesaCreateContextExt( GLenum format, GLint depthBits, GLint stencilBits, | ^~~~~~~~~~~~~~~~~~~~~~ /usr/include/GL/osmesa.h:167:1: error: expected initializer before 'OSMesaCreateContextAttribs' 167 | OSMesaCreateContextAttribs( const int *attribList, OSMesaContext sharelist ); | ^~~~~~~~~~~~~~~~~~~~~~~~~~ /usr/include/GL/osmesa.h:177:1: error: expected initializer before 'OSMesaDestroyContext' 177 | OSMesaDestroyContext( OSMesaContext ctx ); | ^~~~~~~~~~~~~~~~~~~~ /usr/include/GL/osmesa.h:209:1: error: expected initializer before 'OSMesaMakeCurrent' 209 | OSMesaMakeCurrent( OSMesaContext ctx, void *buffer, GLenum type, | ^~~~~~~~~~~~~~~~~ /usr/include/GL/osmesa.h:219:1: error: expected initializer before 'OSMesaGetCurrentContext' 219 | OSMesaGetCurrentContext( void ); | ^~~~~~~~~~~~~~~~~~~~~~~ /usr/include/GL/osmesa.h:237:1: error: expected initializer before 'OSMesaPixelStore' 237 | OSMesaPixelStore( GLint pname, GLint value ); | ^~~~~~~~~~~~~~~~ /usr/include/GL/osmesa.h:253:1: error: expected initializer before 'OSMesaGetIntegerv' 253 | OSMesaGetIntegerv( GLint pname, GLint *value ); | ^~~~~~~~~~~~~~~~~ /usr/include/GL/osmesa.h:268:1: error: expected initializer before 'OSMesaGetDepthBuffer' 268 | OSMesaGetDepthBuffer( OSMesaContext c, GLint *width, GLint *height, | ^~~~~~~~~~~~~~~~~~~~ /usr/include/GL/osmesa.h:284:1: error: expected initializer before 'OSMesaGetColorBuffer' 284 | OSMesaGetColorBuffer( OSMesaContext c, GLint *width, GLint *height, | ^~~~~~~~~~~~~~~~~~~~ /usr/include/GL/osmesa.h:301:1: error: expected initializer before 'OSMesaGetProcAddress' 301 | OSMesaGetProcAddress( const char *funcName ); | ^~~~~~~~~~~~~~~~~~~~ /usr/include/GL/osmesa.h:310:1: error: expected initializer before 'OSMesaColorClamp' 310 | OSMesaColorClamp(GLboolean enable); | ^~~~~~~~~~~~~~~~ /usr/include/GL/osmesa.h:323:1: error: expected initializer before 'OSMesaPostprocess' 323 | OSMesaPostprocess(OSMesaContext osmesa, const char *filter, | ^~~~~~~~~~~~~~~~~ make: *** [Makefile:364: drawpath.o] Error 1 x86_64-pld-linux-gnux32-g++ -Wall -DHAVE_CONFIG_H -D_FILE_OFFSET_BITS=64 -DUSEGC -DFFTWPP_SINGLE_THREAD -I. -I/usr/include/gc -I/usr/include/gc -I/usr/include/tirpc -O2 -fwrapv -pipe -Wformat -Werror=format-security -gdwarf-4 -fno-debug-types-section -fvar-tracking-assignments -g2 -Wp,-D_FORTIFY_SOURCE=2 -fstack-protector-strong --param=ssp-buffer-size=4 -Werror=trampolines -fPIC -mtune=generic -march=x86-64 -gdwarf-4 -fno-debug-types-section -fvar-tracking-assignments -g2 -O2 -fwrapv -pipe -Wformat -Werror=format-security -gdwarf-4 -fno-debug-types-section -fvar-tracking-assignments -g2 -Wp,-D_FORTIFY_SOURCE=2 -fstack-protector-strong --param=ssp-buffer-size=4 -Werror=trampolines -fPIC -mtune=generic -march=x86-64 -gdwarf-4 -fno-debug-types-section -fvar-tracking-assignments -g2 -fno-var-tracking -o errormsg.o -c errormsg.cc x86_64-pld-linux-gnux32-g++ -Wall -DHAVE_CONFIG_H -D_FILE_OFFSET_BITS=64 -DUSEGC -DFFTWPP_SINGLE_THREAD -I. -I/usr/include/gc -I/usr/include/gc -I/usr/include/tirpc -O2 -fwrapv -pipe -Wformat -Werror=format-security -gdwarf-4 -fno-debug-types-section -fvar-tracking-assignments -g2 -Wp,-D_FORTIFY_SOURCE=2 -fstack-protector-strong --param=ssp-buffer-size=4 -Werror=trampolines -fPIC -mtune=generic -march=x86-64 -gdwarf-4 -fno-debug-types-section -fvar-tracking-assignments -g2 -O2 -fwrapv -pipe -Wformat -Werror=format-security -gdwarf-4 -fno-debug-types-section -fvar-tracking-assignments -g2 -Wp,-D_FORTIFY_SOURCE=2 -fstack-protector-strong --param=ssp-buffer-size=4 -Werror=trampolines -fPIC -mtune=generic -march=x86-64 -gdwarf-4 -fno-debug-types-section -fvar-tracking-assignments -g2 -fno-var-tracking -o newexp.o -c newexp.cc x86_64-pld-linux-gnux32-g++ -Wall -DHAVE_CONFIG_H -D_FILE_OFFSET_BITS=64 -DUSEGC -DFFTWPP_SINGLE_THREAD -I. -I/usr/include/gc -I/usr/include/gc -I/usr/include/tirpc -O2 -fwrapv -pipe -Wformat -Werror=format-security -gdwarf-4 -fno-debug-types-section -fvar-tracking-assignments -g2 -Wp,-D_FORTIFY_SOURCE=2 -fstack-protector-strong --param=ssp-buffer-size=4 -Werror=trampolines -fPIC -mtune=generic -march=x86-64 -gdwarf-4 -fno-debug-types-section -fvar-tracking-assignments -g2 -O2 -fwrapv -pipe -Wformat -Werror=format-security -gdwarf-4 -fno-debug-types-section -fvar-tracking-assignments -g2 -Wp,-D_FORTIFY_SOURCE=2 -fstack-protector-strong --param=ssp-buffer-size=4 -Werror=trampolines -fPIC -mtune=generic -march=x86-64 -gdwarf-4 -fno-debug-types-section -fvar-tracking-assignments -g2 -fno-var-tracking -o env.o -c env.cc x86_64-pld-linux-gnux32-g++ -Wall -DHAVE_CONFIG_H -D_FILE_OFFSET_BITS=64 -DUSEGC -DFFTWPP_SINGLE_THREAD -I. -I/usr/include/gc -I/usr/include/gc -I/usr/include/tirpc -O2 -fwrapv -pipe -Wformat -Werror=format-security -gdwarf-4 -fno-debug-types-section -fvar-tracking-assignments -g2 -Wp,-D_FORTIFY_SOURCE=2 -fstack-protector-strong --param=ssp-buffer-size=4 -Werror=trampolines -fPIC -mtune=generic -march=x86-64 -gdwarf-4 -fno-debug-types-section -fvar-tracking-assignments -g2 -O2 -fwrapv -pipe -Wformat -Werror=format-security -gdwarf-4 -fno-debug-types-section -fvar-tracking-assignments -g2 -Wp,-D_FORTIFY_SOURCE=2 -fstack-protector-strong --param=ssp-buffer-size=4 -Werror=trampolines -fPIC -mtune=generic -march=x86-64 -gdwarf-4 -fno-debug-types-section -fvar-tracking-assignments -g2 -fno-var-tracking -o entry.o -c entry.cc x86_64-pld-linux-gnux32-g++ -Wall -DHAVE_CONFIG_H -D_FILE_OFFSET_BITS=64 -DUSEGC -DFFTWPP_SINGLE_THREAD -I. -I/usr/include/gc -I/usr/include/gc -I/usr/include/tirpc -O2 -fwrapv -pipe -Wformat -Werror=format-security -gdwarf-4 -fno-debug-types-section -fvar-tracking-assignments -g2 -Wp,-D_FORTIFY_SOURCE=2 -fstack-protector-strong --param=ssp-buffer-size=4 -Werror=trampolines -fPIC -mtune=generic -march=x86-64 -gdwarf-4 -fno-debug-types-section -fvar-tracking-assignments -g2 -O2 -fwrapv -pipe -Wformat -Werror=format-security -gdwarf-4 -fno-debug-types-section -fvar-tracking-assignments -g2 -Wp,-D_FORTIFY_SOURCE=2 -fstack-protector-strong --param=ssp-buffer-size=4 -Werror=trampolines -fPIC -mtune=generic -march=x86-64 -gdwarf-4 -fno-debug-types-section -fvar-tracking-assignments -g2 -fno-var-tracking -o path.o -c path.cc x86_64-pld-linux-gnux32-g++ -Wall -DHAVE_CONFIG_H -D_FILE_OFFSET_BITS=64 -DUSEGC -DFFTWPP_SINGLE_THREAD -I. -I/usr/include/gc -I/usr/include/gc -I/usr/include/tirpc -O2 -fwrapv -pipe -Wformat -Werror=format-security -gdwarf-4 -fno-debug-types-section -fvar-tracking-assignments -g2 -Wp,-D_FORTIFY_SOURCE=2 -fstack-protector-strong --param=ssp-buffer-size=4 -Werror=trampolines -fPIC -mtune=generic -march=x86-64 -gdwarf-4 -fno-debug-types-section -fvar-tracking-assignments -g2 -O2 -fwrapv -pipe -Wformat -Werror=format-security -gdwarf-4 -fno-debug-types-section -fvar-tracking-assignments -g2 -Wp,-D_FORTIFY_SOURCE=2 -fstack-protector-strong --param=ssp-buffer-size=4 -Werror=trampolines -fPIC -mtune=generic -march=x86-64 -gdwarf-4 -fno-debug-types-section -fvar-tracking-assignments -g2 -fno-var-tracking -o stm.o -c stm.cc x86_64-pld-linux-gnux32-g++ -Wall -DHAVE_CONFIG_H -D_FILE_OFFSET_BITS=64 -DUSEGC -DFFTWPP_SINGLE_THREAD -I. -I/usr/include/gc -I/usr/include/gc -I/usr/include/tirpc -O2 -fwrapv -pipe -Wformat -Werror=format-security -gdwarf-4 -fno-debug-types-section -fvar-tracking-assignments -g2 -Wp,-D_FORTIFY_SOURCE=2 -fstack-protector-strong --param=ssp-buffer-size=4 -Werror=trampolines -fPIC -mtune=generic -march=x86-64 -gdwarf-4 -fno-debug-types-section -fvar-tracking-assignments -g2 -O2 -fwrapv -pipe -Wformat -Werror=format-security -gdwarf-4 -fno-debug-types-section -fvar-tracking-assignments -g2 -Wp,-D_FORTIFY_SOURCE=2 -fstack-protector-strong --param=ssp-buffer-size=4 -Werror=trampolines -fPIC -mtune=generic -march=x86-64 -gdwarf-4 -fno-debug-types-section -fvar-tracking-assignments -g2 -fno-var-tracking -o dec.o -c dec.cc x86_64-pld-linux-gnux32-g++ -Wall -DHAVE_CONFIG_H -D_FILE_OFFSET_BITS=64 -DUSEGC -DFFTWPP_SINGLE_THREAD -I. -I/usr/include/gc -I/usr/include/gc -I/usr/include/tirpc -O2 -fwrapv -pipe -Wformat -Werror=format-security -gdwarf-4 -fno-debug-types-section -fvar-tracking-assignments -g2 -Wp,-D_FORTIFY_SOURCE=2 -fstack-protector-strong --param=ssp-buffer-size=4 -Werror=trampolines -fPIC -mtune=generic -march=x86-64 -gdwarf-4 -fno-debug-types-section -fvar-tracking-assignments -g2 -O2 -fwrapv -pipe -Wformat -Werror=format-security -gdwarf-4 -fno-debug-types-section -fvar-tracking-assignments -g2 -Wp,-D_FORTIFY_SOURCE=2 -fstack-protector-strong --param=ssp-buffer-size=4 -Werror=trampolines -fPIC -mtune=generic -march=x86-64 -gdwarf-4 -fno-debug-types-section -fvar-tracking-assignments -g2 -fno-var-tracking -o picture.o -c picture.cc In file included from glrender.h:64, from drawelement.h:21, from picture.h:15, from picture.cc:10: /usr/include/GL/osmesa.h:125:1: error: expected initializer before 'OSMesaCreateContext' 125 | OSMesaCreateContext( GLenum format, OSMesaContext sharelist ); | ^~~~~~~~~~~~~~~~~~~ /usr/include/GL/osmesa.h:138:1: error: expected initializer before 'OSMesaCreateContextExt' 138 | OSMesaCreateContextExt( GLenum format, GLint depthBits, GLint stencilBits, | ^~~~~~~~~~~~~~~~~~~~~~ /usr/include/GL/osmesa.h:167:1: error: expected initializer before 'OSMesaCreateContextAttribs' 167 | OSMesaCreateContextAttribs( const int *attribList, OSMesaContext sharelist ); | ^~~~~~~~~~~~~~~~~~~~~~~~~~ /usr/include/GL/osmesa.h:177:1: error: expected initializer before 'OSMesaDestroyContext' 177 | OSMesaDestroyContext( OSMesaContext ctx ); | ^~~~~~~~~~~~~~~~~~~~ /usr/include/GL/osmesa.h:209:1: error: expected initializer before 'OSMesaMakeCurrent' 209 | OSMesaMakeCurrent( OSMesaContext ctx, void *buffer, GLenum type, | ^~~~~~~~~~~~~~~~~ /usr/include/GL/osmesa.h:219:1: error: expected initializer before 'OSMesaGetCurrentContext' 219 | OSMesaGetCurrentContext( void ); | ^~~~~~~~~~~~~~~~~~~~~~~ /usr/include/GL/osmesa.h:237:1: error: expected initializer before 'OSMesaPixelStore' 237 | OSMesaPixelStore( GLint pname, GLint value ); | ^~~~~~~~~~~~~~~~ /usr/include/GL/osmesa.h:253:1: error: expected initializer before 'OSMesaGetIntegerv' 253 | OSMesaGetIntegerv( GLint pname, GLint *value ); | ^~~~~~~~~~~~~~~~~ /usr/include/GL/osmesa.h:268:1: error: expected initializer before 'OSMesaGetDepthBuffer' 268 | OSMesaGetDepthBuffer( OSMesaContext c, GLint *width, GLint *height, | ^~~~~~~~~~~~~~~~~~~~ /usr/include/GL/osmesa.h:284:1: error: expected initializer before 'OSMesaGetColorBuffer' 284 | OSMesaGetColorBuffer( OSMesaContext c, GLint *width, GLint *height, | ^~~~~~~~~~~~~~~~~~~~ /usr/include/GL/osmesa.h:301:1: error: expected initializer before 'OSMesaGetProcAddress' 301 | OSMesaGetProcAddress( const char *funcName ); | ^~~~~~~~~~~~~~~~~~~~ /usr/include/GL/osmesa.h:310:1: error: expected initializer before 'OSMesaColorClamp' 310 | OSMesaColorClamp(GLboolean enable); | ^~~~~~~~~~~~~~~~ /usr/include/GL/osmesa.h:323:1: error: expected initializer before 'OSMesaPostprocess' 323 | OSMesaPostprocess(OSMesaContext osmesa, const char *filter, | ^~~~~~~~~~~~~~~~~ make: *** [Makefile:364: picture.o] Error 1 x86_64-pld-linux-gnux32-g++ -Wall -DHAVE_CONFIG_H -D_FILE_OFFSET_BITS=64 -DUSEGC -DFFTWPP_SINGLE_THREAD -I. -I/usr/include/gc -I/usr/include/gc -I/usr/include/tirpc -O2 -fwrapv -pipe -Wformat -Werror=format-security -gdwarf-4 -fno-debug-types-section -fvar-tracking-assignments -g2 -Wp,-D_FORTIFY_SOURCE=2 -fstack-protector-strong --param=ssp-buffer-size=4 -Werror=trampolines -fPIC -mtune=generic -march=x86-64 -gdwarf-4 -fno-debug-types-section -fvar-tracking-assignments -g2 -O2 -fwrapv -pipe -Wformat -Werror=format-security -gdwarf-4 -fno-debug-types-section -fvar-tracking-assignments -g2 -Wp,-D_FORTIFY_SOURCE=2 -fstack-protector-strong --param=ssp-buffer-size=4 -Werror=trampolines -fPIC -mtune=generic -march=x86-64 -gdwarf-4 -fno-debug-types-section -fvar-tracking-assignments -g2 -fno-var-tracking -o texfile.o -c texfile.cc x86_64-pld-linux-gnux32-g++ -Wall -DHAVE_CONFIG_H -D_FILE_OFFSET_BITS=64 -DUSEGC -DFFTWPP_SINGLE_THREAD -I. -I/usr/include/gc -I/usr/include/gc -I/usr/include/tirpc -O2 -fwrapv -pipe -Wformat -Werror=format-security -gdwarf-4 -fno-debug-types-section -fvar-tracking-assignments -g2 -Wp,-D_FORTIFY_SOURCE=2 -fstack-protector-strong --param=ssp-buffer-size=4 -Werror=trampolines -fPIC -mtune=generic -march=x86-64 -gdwarf-4 -fno-debug-types-section -fvar-tracking-assignments -g2 -O2 -fwrapv -pipe -Wformat -Werror=format-security -gdwarf-4 -fno-debug-types-section -fvar-tracking-assignments -g2 -Wp,-D_FORTIFY_SOURCE=2 -fstack-protector-strong --param=ssp-buffer-size=4 -Werror=trampolines -fPIC -mtune=generic -march=x86-64 -gdwarf-4 -fno-debug-types-section -fvar-tracking-assignments -g2 -fno-var-tracking -o stack.o -c stack.cc x86_64-pld-linux-gnux32-g++ -Wall -DHAVE_CONFIG_H -D_FILE_OFFSET_BITS=64 -DUSEGC -DFFTWPP_SINGLE_THREAD -I. -I/usr/include/gc -I/usr/include/gc -I/usr/include/tirpc -O2 -fwrapv -pipe -Wformat -Werror=format-security -gdwarf-4 -fno-debug-types-section -fvar-tracking-assignments -g2 -Wp,-D_FORTIFY_SOURCE=2 -fstack-protector-strong --param=ssp-buffer-size=4 -Werror=trampolines -fPIC -mtune=generic -march=x86-64 -gdwarf-4 -fno-debug-types-section -fvar-tracking-assignments -g2 -O2 -fwrapv -pipe -Wformat -Werror=format-security -gdwarf-4 -fno-debug-types-section -fvar-tracking-assignments -g2 -Wp,-D_FORTIFY_SOURCE=2 -fstack-protector-strong --param=ssp-buffer-size=4 -Werror=trampolines -fPIC -mtune=generic -march=x86-64 -gdwarf-4 -fno-debug-types-section -fvar-tracking-assignments -g2 -fno-var-tracking -o lex.yy.o -c lex.yy.cc x86_64-pld-linux-gnux32-g++ -Wall -DHAVE_CONFIG_H -D_FILE_OFFSET_BITS=64 -DUSEGC -DFFTWPP_SINGLE_THREAD -I. -I/usr/include/gc -I/usr/include/gc -I/usr/include/tirpc -O2 -fwrapv -pipe -Wformat -Werror=format-security -gdwarf-4 -fno-debug-types-section -fvar-tracking-assignments -g2 -Wp,-D_FORTIFY_SOURCE=2 -fstack-protector-strong --param=ssp-buffer-size=4 -Werror=trampolines -fPIC -mtune=generic -march=x86-64 -gdwarf-4 -fno-debug-types-section -fvar-tracking-assignments -g2 -O2 -fwrapv -pipe -Wformat -Werror=format-security -gdwarf-4 -fno-debug-types-section -fvar-tracking-assignments -g2 -Wp,-D_FORTIFY_SOURCE=2 -fstack-protector-strong --param=ssp-buffer-size=4 -Werror=trampolines -fPIC -mtune=generic -march=x86-64 -gdwarf-4 -fno-debug-types-section -fvar-tracking-assignments -g2 -fno-var-tracking -o psfile.o -c psfile.cc x86_64-pld-linux-gnux32-g++ -Wall -DHAVE_CONFIG_H -D_FILE_OFFSET_BITS=64 -DUSEGC -DFFTWPP_SINGLE_THREAD -I. -I/usr/include/gc -I/usr/include/gc -I/usr/include/tirpc -O2 -fwrapv -pipe -Wformat -Werror=format-security -gdwarf-4 -fno-debug-types-section -fvar-tracking-assignments -g2 -Wp,-D_FORTIFY_SOURCE=2 -fstack-protector-strong --param=ssp-buffer-size=4 -Werror=trampolines -fPIC -mtune=generic -march=x86-64 -gdwarf-4 -fno-debug-types-section -fvar-tracking-assignments -g2 -O2 -fwrapv -pipe -Wformat -Werror=format-security -gdwarf-4 -fno-debug-types-section -fvar-tracking-assignments -g2 -Wp,-D_FORTIFY_SOURCE=2 -fstack-protector-strong --param=ssp-buffer-size=4 -Werror=trampolines -fPIC -mtune=generic -march=x86-64 -gdwarf-4 -fno-debug-types-section -fvar-tracking-assignments -g2 -fno-var-tracking -o path3.o -c path3.cc x86_64-pld-linux-gnux32-g++ -Wall -E -DNOSYM -DHAVE_CONFIG_H -D_FILE_OFFSET_BITS=64 -DUSEGC -DFFTWPP_SINGLE_THREAD -I. -I/usr/include/gc -I/usr/include/gc -I/usr/include/tirpc -O2 -fwrapv -pipe -Wformat -Werror=format-security -gdwarf-4 -fno-debug-types-section -fvar-tracking-assignments -g2 -Wp,-D_FORTIFY_SOURCE=2 -fstack-protector-strong --param=ssp-buffer-size=4 -Werror=trampolines -fPIC -mtune=generic -march=x86-64 -gdwarf-4 -fno-debug-types-section -fvar-tracking-assignments -g2 -O2 -fwrapv -pipe -Wformat -Werror=format-security -gdwarf-4 -fno-debug-types-section -fvar-tracking-assignments -g2 -Wp,-D_FORTIFY_SOURCE=2 -fstack-protector-strong --param=ssp-buffer-size=4 -Werror=trampolines -fPIC -mtune=generic -march=x86-64 -gdwarf-4 -fno-debug-types-section -fvar-tracking-assignments -g2 -fno-var-tracking types.cc builtin.cc gsl.cc runtime.cc runbacktrace.cc runpicture.cc runlabel.cc runhistory.cc runarray.cc runfile.cc runsystem.cc runpair.cc runtriple.cc runpath.cc runpath3d.cc runstring.cc runmath.cc | \ perl ./findsym.pl allsymbols.h - x86_64-pld-linux-gnux32-g++ -Wall -DHAVE_CONFIG_H -D_FILE_OFFSET_BITS=64 -DUSEGC -DFFTWPP_SINGLE_THREAD -I. -I/usr/include/gc -I/usr/include/gc -I/usr/include/tirpc -O2 -fwrapv -pipe -Wformat -Werror=format-security -gdwarf-4 -fno-debug-types-section -fvar-tracking-assignments -g2 -Wp,-D_FORTIFY_SOURCE=2 -fstack-protector-strong --param=ssp-buffer-size=4 -Werror=trampolines -fPIC -mtune=generic -march=x86-64 -gdwarf-4 -fno-debug-types-section -fvar-tracking-assignments -g2 -O2 -fwrapv -pipe -Wformat -Werror=format-security -gdwarf-4 -fno-debug-types-section -fvar-tracking-assignments -g2 -Wp,-D_FORTIFY_SOURCE=2 -fstack-protector-strong --param=ssp-buffer-size=4 -Werror=trampolines -fPIC -mtune=generic -march=x86-64 -gdwarf-4 -fno-debug-types-section -fvar-tracking-assignments -g2 -fno-var-tracking -o exp.o -c exp.cc x86_64-pld-linux-gnux32-g++ -Wall -DHAVE_CONFIG_H -D_FILE_OFFSET_BITS=64 -DUSEGC -DFFTWPP_SINGLE_THREAD -I. -I/usr/include/gc -I/usr/include/gc -I/usr/include/tirpc -O2 -fwrapv -pipe -Wformat -Werror=format-security -gdwarf-4 -fno-debug-types-section -fvar-tracking-assignments -g2 -Wp,-D_FORTIFY_SOURCE=2 -fstack-protector-strong --param=ssp-buffer-size=4 -Werror=trampolines -fPIC -mtune=generic -march=x86-64 -gdwarf-4 -fno-debug-types-section -fvar-tracking-assignments -g2 -O2 -fwrapv -pipe -Wformat -Werror=format-security -gdwarf-4 -fno-debug-types-section -fvar-tracking-assignments -g2 -Wp,-D_FORTIFY_SOURCE=2 -fstack-protector-strong --param=ssp-buffer-size=4 -Werror=trampolines -fPIC -mtune=generic -march=x86-64 -gdwarf-4 -fno-debug-types-section -fvar-tracking-assignments -g2 -fno-var-tracking -o camp.tab.o -c camp.tab.cc error: Bad exit status from /tmp/B.bxfqee6a/BUILD/tmp/rpm-tmp.WD5k5T (%build) RPM build errors: Bad exit status from /tmp/B.bxfqee6a/BUILD/tmp/rpm-tmp.WD5k5T (%build) ended at: Mon Jun 10 21:35:13 2024, done in 0:00:26.042104 error: No files produced. + chmod -R u+rwX /tmp/B.bxfqee6a/BUILD + rm -rf /tmp/B.bxfqee6a/tmp /tmp/B.bxfqee6a/BUILD + rm -rf /tmp/B.bxfqee6a Begin-PLD-Builder-Info Build-Time: user:200.10s sys:34.31s real:48.26s (faults io:12 non-io:2860769) End-PLD-Builder-Info
[Back to list of logs] [View rpm -qa of builder]