FailedOk

th/SRPMS[OK]
th/x32[OK]
th/i686[OK]
th/x86_64[OK]

ac/SRPMS[OK]
ac/i386[OK]
ac/i586[OK]
ac/i686[OK]
ac/alpha[OK]
ac/amd64[OK]
ac/athlon[OK]
ac/ppc[OK]
ac/sparc[OK]
ac/sparc64[OK]

Advanced Search
main()
Powered by PLD Linux
(c) 2002-2021 PLD Team
$Revision: 1.37 $
Powered by voodoo magic.
Your IP: 3.235.191.87

db5.2 ae6abf09-c639-4b14-bf01-57fc67ebe10a

Status:Failed
Source URL:https://buildlogs.pld-linux.org/pld/th/x32/FAIL/db5.2,ae6abf09-c639-4b14-bf01-57fc67ebe10a.bz2
text/plain URL:View!
full text:View!
rpm -qa of builder:View!
Date:2021/04/08 09:09:01
Runtime:0:00:30.032824

Toc:

  • error 1
  • ../dist/./../src/dbinc/atomic.h:179:19: error: definition of 'int __atomic_compare_exchange(db_atomic_t*, atomic_value_t, atomic_value_t)' ambiguates built-in declaration 'bool __atomic_compare_exchange(unsigned int, volatile void*, void*, void*, int, int)'
  • error 2
  • ../dist/./../src/dbinc/atomic.h:179:19: error: definition of 'int __atomic_compare_exchange(db_atomic_t*, atomic_value_t, atomic_value_t)' ambiguates built-in declaration 'bool __atomic_compare_exchange(unsigned int, volatile void*, void*, void*, int, int)'
  • error 3
  • ../dist/./../src/dbinc/atomic.h:179:19: error: definition of 'int __atomic_compare_exchange(db_atomic_t*, atomic_value_t, atomic_value_t)' ambiguates built-in declaration 'bool __atomic_compare_exchange(unsigned int, volatile void*, void*, void*, int, int)'
  • error 4
  • ../dist/./../src/dbinc/atomic.h:179:19: error: definition of 'int __atomic_compare_exchange(db_atomic_t*, atomic_value_t, atomic_value_t)' ambiguates built-in declaration 'bool __atomic_compare_exchange(unsigned int, volatile void*, void*, void*, int, int)'
  • error 5
  • ../dist/./../src/dbinc/atomic.h:179:19: error: definition of 'int __atomic_compare_exchange(db_atomic_t*, atomic_value_t, atomic_value_t)' ambiguates built-in declaration 'bool __atomic_compare_exchange(unsigned int, volatile void*, void*, void*, int, int)'
  • error 6
  • ../dist/./../src/dbinc/atomic.h:179:19: error: definition of 'int __atomic_compare_exchange(db_atomic_t*, atomic_value_t, atomic_value_t)' ambiguates built-in declaration 'bool __atomic_compare_exchange(unsigned int, volatile void*, void*, void*, int, int)'
  • error 7
  • ../dist/./../src/dbinc/atomic.h:179:19: error: definition of 'int __atomic_compare_exchange(db_atomic_t*, atomic_value_t, atomic_value_t)' ambiguates built-in declaration 'bool __atomic_compare_exchange(unsigned int, volatile void*, void*, void*, int, int)'
  • error 8
  • ../dist/./../src/dbinc/atomic.h:179:19: error: definition of 'int __atomic_compare_exchange(db_atomic_t*, atomic_value_t, atomic_value_t)' ambiguates built-in declaration 'bool __atomic_compare_exchange(unsigned int, volatile void*, void*, void*, int, int)'
  • error 9
  • ../dist/./../src/dbinc/atomic.h:179:19: error: definition of 'int __atomic_compare_exchange(db_atomic_t*, atomic_value_t, atomic_value_t)' ambiguates built-in declaration 'bool __atomic_compare_exchange(unsigned int, volatile void*, void*, void*, int, int)'
  • error 10
  • error: Bad exit status from /tmp/B.3EzWAg/BUILD/tmp/rpm-tmp.4dnEl1 (%build)
  • error 11
  • RPM build errors:
  • error 12
  • error: No files produced.

Content:

../dist/./../src/dbinc/atomic.h:179:19: warning: conflicting types for built-in function '__atomic_compare_exchange'; expected '_Bool(unsigned int,  volatile void *, void *, void *, int,  int)' [-Wbuiltin-declaration-mismatch]
  179 | static inline int __atomic_compare_exchange(
      |                   ^~~~~~~~~~~~~~~~~~~~~~~~~
./libtool --mode=compile x86_64-pld-linux-gnux32-gcc -c -I. -I../dist/./../src  -D_GNU_SOURCE -D_REENTRANT -O2 -fwrapv -pipe -Wformat -Werror=format-security -gdwarf-4 -fno-debug-types-section -fvar-tracking-assignments -g2 -Wp,-D_FORTIFY_SOURCE=2 -fstack-protector-strong --param=ssp-buffer-size=4 -Werror=trampolines -fPIC -mtune=generic -march=x86-64 -gdwarf-4 -fno-debug-types-section -fvar-tracking-assignments -g2   ../dist/./../src/txn/txn_region.c
libtool: compile:  x86_64-pld-linux-gnux32-gcc -c -I. -I../dist/./../src -D_GNU_SOURCE -D_REENTRANT -O2 -fwrapv -pipe -Wformat -Werror=format-security -gdwarf-4 -fno-debug-types-section -fvar-tracking-assignments -g2 -Wp,-D_FORTIFY_SOURCE=2 -fstack-protector-strong --param=ssp-buffer-size=4 -Werror=trampolines -fPIC -mtune=generic -march=x86-64 -gdwarf-4 -fno-debug-types-section -fvar-tracking-assignments -g2 ../dist/./../src/txn/txn_region.c -o txn_region.o
In file included from ../dist/./../src/dbinc/mutex_int.h:12,
                 from ../dist/./../src/dbinc/mutex.h:15,
                 from ./db_int.h:1089,
                 from ../dist/./../src/txn/txn_region.c:11:
../dist/./../src/dbinc/atomic.h:179:19: warning: conflicting types for built-in function '__atomic_compare_exchange'; expected '_Bool(unsigned int,  volatile void *, void *, void *, int,  int)' [-Wbuiltin-declaration-mismatch]
  179 | static inline int __atomic_compare_exchange(
      |                   ^~~~~~~~~~~~~~~~~~~~~~~~~
./libtool --mode=compile x86_64-pld-linux-gnux32-gcc -c -I. -I../dist/./../src  -D_GNU_SOURCE -D_REENTRANT -O2 -fwrapv -pipe -Wformat -Werror=format-security -gdwarf-4 -fno-debug-types-section -fvar-tracking-assignments -g2 -Wp,-D_FORTIFY_SOURCE=2 -fstack-protector-strong --param=ssp-buffer-size=4 -Werror=trampolines -fPIC -mtune=generic -march=x86-64 -gdwarf-4 -fno-debug-types-section -fvar-tracking-assignments -g2   ../dist/./../src/sequence/sequence.c
libtool: compile:  x86_64-pld-linux-gnux32-gcc -c -I. -I../dist/./../src -D_GNU_SOURCE -D_REENTRANT -O2 -fwrapv -pipe -Wformat -Werror=format-security -gdwarf-4 -fno-debug-types-section -fvar-tracking-assignments -g2 -Wp,-D_FORTIFY_SOURCE=2 -fstack-protector-strong --param=ssp-buffer-size=4 -Werror=trampolines -fPIC -mtune=generic -march=x86-64 -gdwarf-4 -fno-debug-types-section -fvar-tracking-assignments -g2 ../dist/./../src/sequence/sequence.c -o sequence.o
In file included from ../dist/./../src/dbinc/mutex_int.h:12,
                 from ../dist/./../src/dbinc/mutex.h:15,
                 from ./db_int.h:1089,
                 from ../dist/./../src/sequence/sequence.c:11:
../dist/./../src/dbinc/atomic.h:179:19: warning: conflicting types for built-in function '__atomic_compare_exchange'; expected '_Bool(unsigned int,  volatile void *, void *, void *, int,  int)' [-Wbuiltin-declaration-mismatch]
  179 | static inline int __atomic_compare_exchange(
      |                   ^~~~~~~~~~~~~~~~~~~~~~~~~
./libtool --mode=compile x86_64-pld-linux-gnux32-gcc -c -I. -I../dist/./../src  -D_GNU_SOURCE -D_REENTRANT -O2 -fwrapv -pipe -Wformat -Werror=format-security -gdwarf-4 -fno-debug-types-section -fvar-tracking-assignments -g2 -Wp,-D_FORTIFY_SOURCE=2 -fstack-protector-strong --param=ssp-buffer-size=4 -Werror=trampolines -fPIC -mtune=generic -march=x86-64 -gdwarf-4 -fno-debug-types-section -fvar-tracking-assignments -g2   ../dist/./../src/txn/txn_rec.c
libtool: compile:  x86_64-pld-linux-gnux32-gcc -c -I. -I../dist/./../src -D_GNU_SOURCE -D_REENTRANT -O2 -fwrapv -pipe -Wformat -Werror=format-security -gdwarf-4 -fno-debug-types-section -fvar-tracking-assignments -g2 -Wp,-D_FORTIFY_SOURCE=2 -fstack-protector-strong --param=ssp-buffer-size=4 -Werror=trampolines -fPIC -mtune=generic -march=x86-64 -gdwarf-4 -fno-debug-types-section -fvar-tracking-assignments -g2 ../dist/./../src/txn/txn_rec.c -o txn_rec.o
In file included from ../dist/./../src/dbinc/mutex_int.h:12,
                 from ../dist/./../src/dbinc/mutex.h:15,
                 from ./db_int.h:1089,
                 from ../dist/./../src/txn/txn_rec.c:39:
../dist/./../src/dbinc/atomic.h:179:19: warning: conflicting types for built-in function '__atomic_compare_exchange'; expected '_Bool(unsigned int,  volatile void *, void *, void *, int,  int)' [-Wbuiltin-declaration-mismatch]
  179 | static inline int __atomic_compare_exchange(
      |                   ^~~~~~~~~~~~~~~~~~~~~~~~~
./libtool --mode=compile x86_64-pld-linux-gnux32-gcc -c -I. -I../dist/./../src  -D_GNU_SOURCE -D_REENTRANT -O2 -fwrapv -pipe -Wformat -Werror=format-security -gdwarf-4 -fno-debug-types-section -fvar-tracking-assignments -g2 -Wp,-D_FORTIFY_SOURCE=2 -fstack-protector-strong --param=ssp-buffer-size=4 -Werror=trampolines -fPIC -mtune=generic -march=x86-64 -gdwarf-4 -fno-debug-types-section -fvar-tracking-assignments -g2   ../dist/./../src/txn/txn_stat.c
libtool: compile:  x86_64-pld-linux-gnux32-gcc -c -I. -I../dist/./../src -D_GNU_SOURCE -D_REENTRANT -O2 -fwrapv -pipe -Wformat -Werror=format-security -gdwarf-4 -fno-debug-types-section -fvar-tracking-assignments -g2 -Wp,-D_FORTIFY_SOURCE=2 -fstack-protector-strong --param=ssp-buffer-size=4 -Werror=trampolines -fPIC -mtune=generic -march=x86-64 -gdwarf-4 -fno-debug-types-section -fvar-tracking-assignments -g2 ../dist/./../src/txn/txn_stat.c -o txn_stat.o
In file included from ../dist/./../src/dbinc/mutex_int.h:12,
                 from ../dist/./../src/dbinc/mutex.h:15,
                 from ./db_int.h:1089,
                 from ../dist/./../src/txn/txn_stat.c:11:
../dist/./../src/dbinc/atomic.h:179:19: warning: conflicting types for built-in function '__atomic_compare_exchange'; expected '_Bool(unsigned int,  volatile void *, void *, void *, int,  int)' [-Wbuiltin-declaration-mismatch]
  179 | static inline int __atomic_compare_exchange(
      |                   ^~~~~~~~~~~~~~~~~~~~~~~~~
./libtool --mode=compile x86_64-pld-linux-gnux32-gcc -c -I. -I../dist/./../src  -D_GNU_SOURCE -D_REENTRANT -O2 -fwrapv -pipe -Wformat -Werror=format-security -gdwarf-4 -fno-debug-types-section -fvar-tracking-assignments -g2 -Wp,-D_FORTIFY_SOURCE=2 -fstack-protector-strong --param=ssp-buffer-size=4 -Werror=trampolines -fPIC -mtune=generic -march=x86-64 -gdwarf-4 -fno-debug-types-section -fvar-tracking-assignments -g2   ../dist/./../src/db/partition.c
libtool: compile:  x86_64-pld-linux-gnux32-gcc -c -I. -I../dist/./../src -D_GNU_SOURCE -D_REENTRANT -O2 -fwrapv -pipe -Wformat -Werror=format-security -gdwarf-4 -fno-debug-types-section -fvar-tracking-assignments -g2 -Wp,-D_FORTIFY_SOURCE=2 -fstack-protector-strong --param=ssp-buffer-size=4 -Werror=trampolines -fPIC -mtune=generic -march=x86-64 -gdwarf-4 -fno-debug-types-section -fvar-tracking-assignments -g2 ../dist/./../src/db/partition.c -o partition.o
In file included from ../dist/./../src/dbinc/mutex_int.h:12,
                 from ../dist/./../src/dbinc/mutex.h:15,
                 from ./db_int.h:1089,
                 from ../dist/./../src/db/partition.c:11:
../dist/./../src/dbinc/atomic.h:179:19: warning: conflicting types for built-in function '__atomic_compare_exchange'; expected '_Bool(unsigned int,  volatile void *, void *, void *, int,  int)' [-Wbuiltin-declaration-mismatch]
  179 | static inline int __atomic_compare_exchange(
      |                   ^~~~~~~~~~~~~~~~~~~~~~~~~
./libtool --mode=compile x86_64-pld-linux-gnux32-gcc -c -I. -I../dist/./../src  -D_GNU_SOURCE -D_REENTRANT -O2 -fwrapv -pipe -Wformat -Werror=format-security -gdwarf-4 -fno-debug-types-section -fvar-tracking-assignments -g2 -Wp,-D_FORTIFY_SOURCE=2 -fstack-protector-strong --param=ssp-buffer-size=4 -Werror=trampolines -fPIC -mtune=generic -march=x86-64 -gdwarf-4 -fno-debug-types-section -fvar-tracking-assignments -g2   ../dist/./../src/txn/txn_util.c
libtool: compile:  x86_64-pld-linux-gnux32-gcc -c -I. -I../dist/./../src -D_GNU_SOURCE -D_REENTRANT -O2 -fwrapv -pipe -Wformat -Werror=format-security -gdwarf-4 -fno-debug-types-section -fvar-tracking-assignments -g2 -Wp,-D_FORTIFY_SOURCE=2 -fstack-protector-strong --param=ssp-buffer-size=4 -Werror=trampolines -fPIC -mtune=generic -march=x86-64 -gdwarf-4 -fno-debug-types-section -fvar-tracking-assignments -g2 ../dist/./../src/txn/txn_util.c -o txn_util.o
In file included from ../dist/./../src/dbinc/mutex_int.h:12,
                 from ../dist/./../src/dbinc/mutex.h:15,
                 from ./db_int.h:1089,
                 from ../dist/./../src/txn/txn_util.c:11:
../dist/./../src/dbinc/atomic.h:179:19: warning: conflicting types for built-in function '__atomic_compare_exchange'; expected '_Bool(unsigned int,  volatile void *, void *, void *, int,  int)' [-Wbuiltin-declaration-mismatch]
  179 | static inline int __atomic_compare_exchange(
      |                   ^~~~~~~~~~~~~~~~~~~~~~~~~
./libtool --mode=compile x86_64-pld-linux-gnux32-gcc -c -I. -I../dist/./../src  -D_GNU_SOURCE -D_REENTRANT -O2 -fwrapv -pipe -Wformat -Werror=format-security -gdwarf-4 -fno-debug-types-section -fvar-tracking-assignments -g2 -Wp,-D_FORTIFY_SOURCE=2 -fstack-protector-strong --param=ssp-buffer-size=4 -Werror=trampolines -fPIC -mtune=generic -march=x86-64 -gdwarf-4 -fno-debug-types-section -fvar-tracking-assignments -g2   ../dist/./../src/xa/xa_map.c
libtool: compile:  x86_64-pld-linux-gnux32-gcc -c -I. -I../dist/./../src -D_GNU_SOURCE -D_REENTRANT -O2 -fwrapv -pipe -Wformat -Werror=format-security -gdwarf-4 -fno-debug-types-section -fvar-tracking-assignments -g2 -Wp,-D_FORTIFY_SOURCE=2 -fstack-protector-strong --param=ssp-buffer-size=4 -Werror=trampolines -fPIC -mtune=generic -march=x86-64 -gdwarf-4 -fno-debug-types-section -fvar-tracking-assignments -g2 ../dist/./../src/xa/xa_map.c -o xa_map.o
In file included from ../dist/./../src/dbinc/mutex_int.h:12,
                 from ../dist/./../src/dbinc/mutex.h:15,
                 from ./db_int.h:1089,
                 from ../dist/./../src/xa/xa_map.c:11:
../dist/./../src/dbinc/atomic.h:179:19: warning: conflicting types for built-in function '__atomic_compare_exchange'; expected '_Bool(unsigned int,  volatile void *, void *, void *, int,  int)' [-Wbuiltin-declaration-mismatch]
  179 | static inline int __atomic_compare_exchange(
      |                   ^~~~~~~~~~~~~~~~~~~~~~~~~
./libtool --mode=compile x86_64-pld-linux-gnux32-gcc -c -I. -I../dist/./../src  -D_GNU_SOURCE -D_REENTRANT -O2 -fwrapv -pipe -Wformat -Werror=format-security -gdwarf-4 -fno-debug-types-section -fvar-tracking-assignments -g2 -Wp,-D_FORTIFY_SOURCE=2 -fstack-protector-strong --param=ssp-buffer-size=4 -Werror=trampolines -fPIC -mtune=generic -march=x86-64 -gdwarf-4 -fno-debug-types-section -fvar-tracking-assignments -g2   ../dist/./../src/common/zerofill.c
libtool: compile:  x86_64-pld-linux-gnux32-gcc -c -I. -I../dist/./../src -D_GNU_SOURCE -D_REENTRANT -O2 -fwrapv -pipe -Wformat -Werror=format-security -gdwarf-4 -fno-debug-types-section -fvar-tracking-assignments -g2 -Wp,-D_FORTIFY_SOURCE=2 -fstack-protector-strong --param=ssp-buffer-size=4 -Werror=trampolines -fPIC -mtune=generic -march=x86-64 -gdwarf-4 -fno-debug-types-section -fvar-tracking-assignments -g2 ../dist/./../src/common/zerofill.c -o zerofill.o
In file included from ../dist/./../src/dbinc/mutex_int.h:12,
                 from ../dist/./../src/dbinc/mutex.h:15,
                 from ./db_int.h:1089,
                 from ../dist/./../src/common/zerofill.c:11:
../dist/./../src/dbinc/atomic.h:179:19: warning: conflicting types for built-in function '__atomic_compare_exchange'; expected '_Bool(unsigned int,  volatile void *, void *, void *, int,  int)' [-Wbuiltin-declaration-mismatch]
  179 | static inline int __atomic_compare_exchange(
      |                   ^~~~~~~~~~~~~~~~~~~~~~~~~
./libtool --mode=compile x86_64-pld-linux-gnux32-gcc -c -I. -I../dist/./../src  -D_GNU_SOURCE -D_REENTRANT -O2 -fwrapv -pipe -Wformat -Werror=format-security -gdwarf-4 -fno-debug-types-section -fvar-tracking-assignments -g2 -Wp,-D_FORTIFY_SOURCE=2 -fstack-protector-strong --param=ssp-buffer-size=4 -Werror=trampolines -fPIC -mtune=generic -march=x86-64 -gdwarf-4 -fno-debug-types-section -fvar-tracking-assignments -g2   ../dist/./../src/xa/xa.c
libtool: compile:  x86_64-pld-linux-gnux32-gcc -c -I. -I../dist/./../src -D_GNU_SOURCE -D_REENTRANT -O2 -fwrapv -pipe -Wformat -Werror=format-security -gdwarf-4 -fno-debug-types-section -fvar-tracking-assignments -g2 -Wp,-D_FORTIFY_SOURCE=2 -fstack-protector-strong --param=ssp-buffer-size=4 -Werror=trampolines -fPIC -mtune=generic -march=x86-64 -gdwarf-4 -fno-debug-types-section -fvar-tracking-assignments -g2 ../dist/./../src/xa/xa.c -o xa.o
In file included from ../dist/./../src/dbinc/mutex_int.h:12,
                 from ../dist/./../src/dbinc/mutex.h:15,
                 from ./db_int.h:1089,
                 from ../dist/./../src/xa/xa.c:11:
../dist/./../src/dbinc/atomic.h:179:19: warning: conflicting types for built-in function '__atomic_compare_exchange'; expected '_Bool(unsigned int,  volatile void *, void *, void *, int,  int)' [-Wbuiltin-declaration-mismatch]
  179 | static inline int __atomic_compare_exchange(
      |                   ^~~~~~~~~~~~~~~~~~~~~~~~~
./libtool --mode=compile x86_64-pld-linux-gnux32-gcc -c -I. -I../dist/./../src  -D_GNU_SOURCE -D_REENTRANT -O2 -fwrapv -pipe -Wformat -Werror=format-security -gdwarf-4 -fno-debug-types-section -fvar-tracking-assignments -g2 -Wp,-D_FORTIFY_SOURCE=2 -fstack-protector-strong --param=ssp-buffer-size=4 -Werror=trampolines -fPIC -mtune=generic -march=x86-64 -gdwarf-4 -fno-debug-types-section -fvar-tracking-assignments -g2   ../dist/./../src/txn/txn.c
libtool: compile:  x86_64-pld-linux-gnux32-gcc -c -I. -I../dist/./../src -D_GNU_SOURCE -D_REENTRANT -O2 -fwrapv -pipe -Wformat -Werror=format-security -gdwarf-4 -fno-debug-types-section -fvar-tracking-assignments -g2 -Wp,-D_FORTIFY_SOURCE=2 -fstack-protector-strong --param=ssp-buffer-size=4 -Werror=trampolines -fPIC -mtune=generic -march=x86-64 -gdwarf-4 -fno-debug-types-section -fvar-tracking-assignments -g2 ../dist/./../src/txn/txn.c -o txn.o
In file included from ../dist/./../src/dbinc/mutex_int.h:12,
                 from ../dist/./../src/dbinc/mutex.h:15,
                 from ./db_int.h:1089,
                 from ../dist/./../src/txn/txn.c:42:
../dist/./../src/dbinc/atomic.h:179:19: warning: conflicting types for built-in function '__atomic_compare_exchange'; expected '_Bool(unsigned int,  volatile void *, void *, void *, int,  int)' [-Wbuiltin-declaration-mismatch]
  179 | static inline int __atomic_compare_exchange(
      |                   ^~~~~~~~~~~~~~~~~~~~~~~~~
./libtool --mode=compile x86_64-pld-linux-gnux32-g++ -c -I. -I../dist/./../src  -D_GNU_SOURCE -D_REENTRANT -O2 -fwrapv -pipe -Wformat -Werror=format-security -gdwarf-4 -fno-debug-types-section -fvar-tracking-assignments -g2 -Wp,-D_FORTIFY_SOURCE=2 -fstack-protector-strong --param=ssp-buffer-size=4 -Werror=trampolines -fPIC -mtune=generic -march=x86-64 -gdwarf-4 -fno-debug-types-section -fvar-tracking-assignments -g2  -fno-implicit-templates ../dist/./../lang/cxx/cxx_channel.cpp
libtool: compile:  x86_64-pld-linux-gnux32-g++ -c -I. -I../dist/./../src -D_GNU_SOURCE -D_REENTRANT -O2 -fwrapv -pipe -Wformat -Werror=format-security -gdwarf-4 -fno-debug-types-section -fvar-tracking-assignments -g2 -Wp,-D_FORTIFY_SOURCE=2 -fstack-protector-strong --param=ssp-buffer-size=4 -Werror=trampolines -fPIC -mtune=generic -march=x86-64 -gdwarf-4 -fno-debug-types-section -fvar-tracking-assignments -g2 -fno-implicit-templates ../dist/./../lang/cxx/cxx_channel.cpp -o cxx_channel.o
In file included from ../dist/./../src/dbinc/mutex_int.h:12,
                 from ../dist/./../src/dbinc/mutex.h:15,
                 from ./db_int.h:1089,
                 from ../dist/./../lang/cxx/cxx_channel.cpp:11:
../dist/./../src/dbinc/atomic.h:179:19: error: definition of 'int __atomic_compare_exchange(db_atomic_t*, atomic_value_t, atomic_value_t)' ambiguates built-in declaration 'bool __atomic_compare_exchange(unsigned int, volatile void*, void*, void*, int, int)'
  179 | static inline int __atomic_compare_exchange(
      |                   ^~~~~~~~~~~~~~~~~~~~~~~~~
make: *** [Makefile:2396: cxx_channel.o] Error 1
make: *** Waiting for unfinished jobs....
./libtool --mode=compile x86_64-pld-linux-gnux32-g++ -c -I. -I../dist/./../src  -D_GNU_SOURCE -D_REENTRANT -O2 -fwrapv -pipe -Wformat -Werror=format-security -gdwarf-4 -fno-debug-types-section -fvar-tracking-assignments -g2 -Wp,-D_FORTIFY_SOURCE=2 -fstack-protector-strong --param=ssp-buffer-size=4 -Werror=trampolines -fPIC -mtune=generic -march=x86-64 -gdwarf-4 -fno-debug-types-section -fvar-tracking-assignments -g2  -fno-implicit-templates ../dist/./../lang/cxx/cxx_db.cpp
libtool: compile:  x86_64-pld-linux-gnux32-g++ -c -I. -I../dist/./../src -D_GNU_SOURCE -D_REENTRANT -O2 -fwrapv -pipe -Wformat -Werror=format-security -gdwarf-4 -fno-debug-types-section -fvar-tracking-assignments -g2 -Wp,-D_FORTIFY_SOURCE=2 -fstack-protector-strong --param=ssp-buffer-size=4 -Werror=trampolines -fPIC -mtune=generic -march=x86-64 -gdwarf-4 -fno-debug-types-section -fvar-tracking-assignments -g2 -fno-implicit-templates ../dist/./../lang/cxx/cxx_db.cpp -o cxx_db.o
In file included from ../dist/./../src/dbinc/mutex_int.h:12,
                 from ../dist/./../src/dbinc/mutex.h:15,
                 from ./db_int.h:1089,
                 from ../dist/./../lang/cxx/cxx_db.cpp:11:
../dist/./../src/dbinc/atomic.h:179:19: error: definition of 'int __atomic_compare_exchange(db_atomic_t*, atomic_value_t, atomic_value_t)' ambiguates built-in declaration 'bool __atomic_compare_exchange(unsigned int, volatile void*, void*, void*, int, int)'
  179 | static inline int __atomic_compare_exchange(
      |                   ^~~~~~~~~~~~~~~~~~~~~~~~~
make: *** [Makefile:2398: cxx_db.o] Error 1
./libtool --mode=compile x86_64-pld-linux-gnux32-g++ -c -I. -I../dist/./../src  -D_GNU_SOURCE -D_REENTRANT -O2 -fwrapv -pipe -Wformat -Werror=format-security -gdwarf-4 -fno-debug-types-section -fvar-tracking-assignments -g2 -Wp,-D_FORTIFY_SOURCE=2 -fstack-protector-strong --param=ssp-buffer-size=4 -Werror=trampolines -fPIC -mtune=generic -march=x86-64 -gdwarf-4 -fno-debug-types-section -fvar-tracking-assignments -g2  -fno-implicit-templates ../dist/./../lang/cxx/cxx_lock.cpp
libtool: compile:  x86_64-pld-linux-gnux32-g++ -c -I. -I../dist/./../src -D_GNU_SOURCE -D_REENTRANT -O2 -fwrapv -pipe -Wformat -Werror=format-security -gdwarf-4 -fno-debug-types-section -fvar-tracking-assignments -g2 -Wp,-D_FORTIFY_SOURCE=2 -fstack-protector-strong --param=ssp-buffer-size=4 -Werror=trampolines -fPIC -mtune=generic -march=x86-64 -gdwarf-4 -fno-debug-types-section -fvar-tracking-assignments -g2 -fno-implicit-templates ../dist/./../lang/cxx/cxx_lock.cpp -o cxx_lock.o
In file included from ../dist/./../src/dbinc/mutex_int.h:12,
                 from ../dist/./../src/dbinc/mutex.h:15,
                 from ./db_int.h:1089,
                 from ../dist/./../lang/cxx/cxx_lock.cpp:11:
../dist/./../src/dbinc/atomic.h:179:19: error: definition of 'int __atomic_compare_exchange(db_atomic_t*, atomic_value_t, atomic_value_t)' ambiguates built-in declaration 'bool __atomic_compare_exchange(unsigned int, volatile void*, void*, void*, int, int)'
  179 | static inline int __atomic_compare_exchange(
      |                   ^~~~~~~~~~~~~~~~~~~~~~~~~
make: *** [Makefile:2408: cxx_lock.o] Error 1
./libtool --mode=compile x86_64-pld-linux-gnux32-g++ -c -I. -I../dist/./../src  -D_GNU_SOURCE -D_REENTRANT -O2 -fwrapv -pipe -Wformat -Werror=format-security -gdwarf-4 -fno-debug-types-section -fvar-tracking-assignments -g2 -Wp,-D_FORTIFY_SOURCE=2 -fstack-protector-strong --param=ssp-buffer-size=4 -Werror=trampolines -fPIC -mtune=generic -march=x86-64 -gdwarf-4 -fno-debug-types-section -fvar-tracking-assignments -g2  -fno-implicit-templates ../dist/./../lang/cxx/cxx_dbc.cpp
libtool: compile:  x86_64-pld-linux-gnux32-g++ -c -I. -I../dist/./../src -D_GNU_SOURCE -D_REENTRANT -O2 -fwrapv -pipe -Wformat -Werror=format-security -gdwarf-4 -fno-debug-types-section -fvar-tracking-assignments -g2 -Wp,-D_FORTIFY_SOURCE=2 -fstack-protector-strong --param=ssp-buffer-size=4 -Werror=trampolines -fPIC -mtune=generic -march=x86-64 -gdwarf-4 -fno-debug-types-section -fvar-tracking-assignments -g2 -fno-implicit-templates ../dist/./../lang/cxx/cxx_dbc.cpp -o cxx_dbc.o
In file included from ../dist/./../src/dbinc/mutex_int.h:12,
                 from ../dist/./../src/dbinc/mutex.h:15,
                 from ./db_int.h:1089,
                 from ../dist/./../lang/cxx/cxx_dbc.cpp:11:
../dist/./../src/dbinc/atomic.h:179:19: error: definition of 'int __atomic_compare_exchange(db_atomic_t*, atomic_value_t, atomic_value_t)' ambiguates built-in declaration 'bool __atomic_compare_exchange(unsigned int, volatile void*, void*, void*, int, int)'
  179 | static inline int __atomic_compare_exchange(
      |                   ^~~~~~~~~~~~~~~~~~~~~~~~~
make: *** [Makefile:2400: cxx_dbc.o] Error 1
./libtool --mode=compile x86_64-pld-linux-gnux32-g++ -c -I. -I../dist/./../src  -D_GNU_SOURCE -D_REENTRANT -O2 -fwrapv -pipe -Wformat -Werror=format-security -gdwarf-4 -fno-debug-types-section -fvar-tracking-assignments -g2 -Wp,-D_FORTIFY_SOURCE=2 -fstack-protector-strong --param=ssp-buffer-size=4 -Werror=trampolines -fPIC -mtune=generic -march=x86-64 -gdwarf-4 -fno-debug-types-section -fvar-tracking-assignments -g2  -fno-implicit-templates ../dist/./../lang/cxx/cxx_dbt.cpp
libtool: compile:  x86_64-pld-linux-gnux32-g++ -c -I. -I../dist/./../src -D_GNU_SOURCE -D_REENTRANT -O2 -fwrapv -pipe -Wformat -Werror=format-security -gdwarf-4 -fno-debug-types-section -fvar-tracking-assignments -g2 -Wp,-D_FORTIFY_SOURCE=2 -fstack-protector-strong --param=ssp-buffer-size=4 -Werror=trampolines -fPIC -mtune=generic -march=x86-64 -gdwarf-4 -fno-debug-types-section -fvar-tracking-assignments -g2 -fno-implicit-templates ../dist/./../lang/cxx/cxx_dbt.cpp -o cxx_dbt.o
In file included from ../dist/./../src/dbinc/mutex_int.h:12,
                 from ../dist/./../src/dbinc/mutex.h:15,
                 from ./db_int.h:1089,
                 from ../dist/./../lang/cxx/cxx_dbt.cpp:11:
../dist/./../src/dbinc/atomic.h:179:19: error: definition of 'int __atomic_compare_exchange(db_atomic_t*, atomic_value_t, atomic_value_t)' ambiguates built-in declaration 'bool __atomic_compare_exchange(unsigned int, volatile void*, void*, void*, int, int)'
  179 | static inline int __atomic_compare_exchange(
      |                   ^~~~~~~~~~~~~~~~~~~~~~~~~
make: *** [Makefile:2402: cxx_dbt.o] Error 1
./libtool --mode=compile x86_64-pld-linux-gnux32-g++ -c -I. -I../dist/./../src  -D_GNU_SOURCE -D_REENTRANT -O2 -fwrapv -pipe -Wformat -Werror=format-security -gdwarf-4 -fno-debug-types-section -fvar-tracking-assignments -g2 -Wp,-D_FORTIFY_SOURCE=2 -fstack-protector-strong --param=ssp-buffer-size=4 -Werror=trampolines -fPIC -mtune=generic -march=x86-64 -gdwarf-4 -fno-debug-types-section -fvar-tracking-assignments -g2  -fno-implicit-templates ../dist/./../lang/cxx/cxx_except.cpp
libtool: compile:  x86_64-pld-linux-gnux32-g++ -c -I. -I../dist/./../src -D_GNU_SOURCE -D_REENTRANT -O2 -fwrapv -pipe -Wformat -Werror=format-security -gdwarf-4 -fno-debug-types-section -fvar-tracking-assignments -g2 -Wp,-D_FORTIFY_SOURCE=2 -fstack-protector-strong --param=ssp-buffer-size=4 -Werror=trampolines -fPIC -mtune=generic -march=x86-64 -gdwarf-4 -fno-debug-types-section -fvar-tracking-assignments -g2 -fno-implicit-templates ../dist/./../lang/cxx/cxx_except.cpp -o cxx_except.o
In file included from ../dist/./../src/dbinc/mutex_int.h:12,
                 from ../dist/./../src/dbinc/mutex.h:15,
                 from ./db_int.h:1089,
                 from ../dist/./../lang/cxx/cxx_except.cpp:11:
../dist/./../src/dbinc/atomic.h:179:19: error: definition of 'int __atomic_compare_exchange(db_atomic_t*, atomic_value_t, atomic_value_t)' ambiguates built-in declaration 'bool __atomic_compare_exchange(unsigned int, volatile void*, void*, void*, int, int)'
  179 | static inline int __atomic_compare_exchange(
      |                   ^~~~~~~~~~~~~~~~~~~~~~~~~
make: *** [Makefile:2406: cxx_except.o] Error 1
./libtool --mode=compile x86_64-pld-linux-gnux32-g++ -c -I. -I../dist/./../src  -D_GNU_SOURCE -D_REENTRANT -O2 -fwrapv -pipe -Wformat -Werror=format-security -gdwarf-4 -fno-debug-types-section -fvar-tracking-assignments -g2 -Wp,-D_FORTIFY_SOURCE=2 -fstack-protector-strong --param=ssp-buffer-size=4 -Werror=trampolines -fPIC -mtune=generic -march=x86-64 -gdwarf-4 -fno-debug-types-section -fvar-tracking-assignments -g2  -fno-implicit-templates ../dist/./../lang/cxx/cxx_env.cpp
libtool: compile:  x86_64-pld-linux-gnux32-g++ -c -I. -I../dist/./../src -D_GNU_SOURCE -D_REENTRANT -O2 -fwrapv -pipe -Wformat -Werror=format-security -gdwarf-4 -fno-debug-types-section -fvar-tracking-assignments -g2 -Wp,-D_FORTIFY_SOURCE=2 -fstack-protector-strong --param=ssp-buffer-size=4 -Werror=trampolines -fPIC -mtune=generic -march=x86-64 -gdwarf-4 -fno-debug-types-section -fvar-tracking-assignments -g2 -fno-implicit-templates ../dist/./../lang/cxx/cxx_env.cpp -o cxx_env.o
In file included from ../dist/./../src/dbinc/mutex_int.h:12,
                 from ../dist/./../src/dbinc/mutex.h:15,
                 from ./db_int.h:1089,
                 from ../dist/./../lang/cxx/cxx_env.cpp:11:
../dist/./../src/dbinc/atomic.h:179:19: error: definition of 'int __atomic_compare_exchange(db_atomic_t*, atomic_value_t, atomic_value_t)' ambiguates built-in declaration 'bool __atomic_compare_exchange(unsigned int, volatile void*, void*, void*, int, int)'
  179 | static inline int __atomic_compare_exchange(
      |                   ^~~~~~~~~~~~~~~~~~~~~~~~~
make: *** [Makefile:2404: cxx_env.o] Error 1
./libtool --mode=compile x86_64-pld-linux-gnux32-g++ -c -I. -I../dist/./../src  -D_GNU_SOURCE -D_REENTRANT -O2 -fwrapv -pipe -Wformat -Werror=format-security -gdwarf-4 -fno-debug-types-section -fvar-tracking-assignments -g2 -Wp,-D_FORTIFY_SOURCE=2 -fstack-protector-strong --param=ssp-buffer-size=4 -Werror=trampolines -fPIC -mtune=generic -march=x86-64 -gdwarf-4 -fno-debug-types-section -fvar-tracking-assignments -g2  -fno-implicit-templates ../dist/./../lang/cxx/cxx_mpool.cpp
libtool: compile:  x86_64-pld-linux-gnux32-g++ -c -I. -I../dist/./../src -D_GNU_SOURCE -D_REENTRANT -O2 -fwrapv -pipe -Wformat -Werror=format-security -gdwarf-4 -fno-debug-types-section -fvar-tracking-assignments -g2 -Wp,-D_FORTIFY_SOURCE=2 -fstack-protector-strong --param=ssp-buffer-size=4 -Werror=trampolines -fPIC -mtune=generic -march=x86-64 -gdwarf-4 -fno-debug-types-section -fvar-tracking-assignments -g2 -fno-implicit-templates ../dist/./../lang/cxx/cxx_mpool.cpp -o cxx_mpool.o
In file included from ../dist/./../src/dbinc/mutex_int.h:12,
                 from ../dist/./../src/dbinc/mutex.h:15,
                 from ./db_int.h:1089,
                 from ../dist/./../lang/cxx/cxx_mpool.cpp:11:
../dist/./../src/dbinc/atomic.h:179:19: error: definition of 'int __atomic_compare_exchange(db_atomic_t*, atomic_value_t, atomic_value_t)' ambiguates built-in declaration 'bool __atomic_compare_exchange(unsigned int, volatile void*, void*, void*, int, int)'
  179 | static inline int __atomic_compare_exchange(
      |                   ^~~~~~~~~~~~~~~~~~~~~~~~~
make: *** [Makefile:2412: cxx_mpool.o] Error 1
./libtool --mode=compile x86_64-pld-linux-gnux32-g++ -c -I. -I../dist/./../src  -D_GNU_SOURCE -D_REENTRANT -O2 -fwrapv -pipe -Wformat -Werror=format-security -gdwarf-4 -fno-debug-types-section -fvar-tracking-assignments -g2 -Wp,-D_FORTIFY_SOURCE=2 -fstack-protector-strong --param=ssp-buffer-size=4 -Werror=trampolines -fPIC -mtune=generic -march=x86-64 -gdwarf-4 -fno-debug-types-section -fvar-tracking-assignments -g2  -fno-implicit-templates ../dist/./../lang/cxx/cxx_logc.cpp
libtool: compile:  x86_64-pld-linux-gnux32-g++ -c -I. -I../dist/./../src -D_GNU_SOURCE -D_REENTRANT -O2 -fwrapv -pipe -Wformat -Werror=format-security -gdwarf-4 -fno-debug-types-section -fvar-tracking-assignments -g2 -Wp,-D_FORTIFY_SOURCE=2 -fstack-protector-strong --param=ssp-buffer-size=4 -Werror=trampolines -fPIC -mtune=generic -march=x86-64 -gdwarf-4 -fno-debug-types-section -fvar-tracking-assignments -g2 -fno-implicit-templates ../dist/./../lang/cxx/cxx_logc.cpp -o cxx_logc.o
In file included from ../dist/./../src/dbinc/mutex_int.h:12,
                 from ../dist/./../src/dbinc/mutex.h:15,
                 from ./db_int.h:1089,
                 from ../dist/./../lang/cxx/cxx_logc.cpp:11:
../dist/./../src/dbinc/atomic.h:179:19: error: definition of 'int __atomic_compare_exchange(db_atomic_t*, atomic_value_t, atomic_value_t)' ambiguates built-in declaration 'bool __atomic_compare_exchange(unsigned int, volatile void*, void*, void*, int, int)'
  179 | static inline int __atomic_compare_exchange(
      |                   ^~~~~~~~~~~~~~~~~~~~~~~~~
make: *** [Makefile:2410: cxx_logc.o] Error 1
error: Bad exit status from /tmp/B.3EzWAg/BUILD/tmp/rpm-tmp.4dnEl1 (%build)


RPM build errors:
    Could not canonicalize hostname: naiad
    Bad exit status from /tmp/B.3EzWAg/BUILD/tmp/rpm-tmp.4dnEl1 (%build)
ended at: Thu Apr  8 09:09:01 2021, done in 0:00:30.032824
error: No files produced.
+ chmod -R u+rwX /tmp/B.3EzWAg/BUILD
+ rm -rf /tmp/B.3EzWAg/tmp /tmp/B.3EzWAg/BUILD
+ rm -rf /tmp/B.3EzWAg
Begin-PLD-Builder-Info
Build-Time: user:114.84s sys:14.33s real:35.42s (faults io:4102 non-io:2629227)

End-PLD-Builder-Info
[Back to list of logs] [View rpm -qa of builder]