FailedOk

th/SRPMS[OK]
th/x32[OK]
th/i686[OK]
th/x86_64[OK]

ac/SRPMS[OK]
ac/i386[OK]
ac/i586[OK]
ac/i686[OK]
ac/alpha[OK]
ac/amd64[OK]
ac/athlon[OK]
ac/ppc[OK]
ac/sparc[OK]
ac/sparc64[OK]

Advanced Search
main()
Powered by PLD Linux
(c) 2002-2021 PLD Team
$Revision: 1.37 $
Powered by NASA.
Your IP: 35.173.234.169

elektra 02e2ebda-fe3b-4fcb-87d3-3cc394e730ec

Status:Failed
Source URL:https://buildlogs.pld-linux.org/pld/th/x32/FAIL/elektra,02e2ebda-fe3b-4fcb-87d3-3cc394e730ec.bz2
text/plain URL:View!
full text:View!
rpm -qa of builder:View!
Date:2021/05/27 17:41:11
Runtime:0:00:32.779736

Toc:

  • error 1
  • /tmp/B.crNwZC/BUILD/elektra-0.8.23/src/tools/kdb/cmdline.cpp:39:99: error: 'numeric_limits' was not declared in this scope
  • error 2
  • /tmp/B.crNwZC/BUILD/elektra-0.8.23/src/tools/kdb/cmdline.cpp:39:114: error: expected primary-expression before 'int'
  • error 3
  • /tmp/B.crNwZC/BUILD/elektra-0.8.23/src/tools/kdb/cmdline.cpp:418:59: error: expected primary-expression before 'int'
  • error 4
  • make[2]: *** [src/tools/kdb/CMakeFiles/kdb-objects.dir/build.make:112: src/tools/kdb/CMakeFiles/kdb-objects.dir/cmdline.cpp.o] Error 1
  • error 5
  • make[1]: *** [CMakeFiles/Makefile2:15884: src/tools/kdb/CMakeFiles/kdb-objects.dir/all] Error 2
  • error 6
  • error: Bad exit status from /tmp/B.crNwZC/BUILD/tmp/rpm-tmp.Q1IEZo (%build)
  • error 7
  • RPM build errors:
  • error 8
  • error: No files produced.

Content:

Scanning dependencies of target OBJ_elektra-io-glib
make[2]: Leaving directory '/tmp/B.crNwZC/BUILD/elektra-0.8.23/build'
/usr/bin/make  -f src/bindings/io/glib/CMakeFiles/OBJ_elektra-io-glib.dir/build.make src/bindings/io/glib/CMakeFiles/OBJ_elektra-io-glib.dir/build
make[1]: Entering directory '/tmp/B.crNwZC/BUILD/elektra-0.8.23/build'
[  7%] Built target elektra_config_headers
make[1]: Leaving directory '/tmp/B.crNwZC/BUILD/elektra-0.8.23/build'
/usr/bin/make  -f src/tools/kdb/CMakeFiles/kdb-objects.dir/build.make src/tools/kdb/CMakeFiles/kdb-objects.dir/depend
make[2]: Entering directory '/tmp/B.crNwZC/BUILD/elektra-0.8.23/build'
cd /tmp/B.crNwZC/BUILD/elektra-0.8.23/build && /usr/bin/cmake -E cmake_depends "Unix Makefiles" /tmp/B.crNwZC/BUILD/elektra-0.8.23 /tmp/B.crNwZC/BUILD/elektra-0.8.23/src/tools/kdb /tmp/B.crNwZC/BUILD/elektra-0.8.23/build /tmp/B.crNwZC/BUILD/elektra-0.8.23/build/src/tools/kdb /tmp/B.crNwZC/BUILD/elektra-0.8.23/build/src/tools/kdb/CMakeFiles/kdb-objects.dir/DependInfo.cmake --color=
Scanning dependencies of target kdb-objects
make[2]: Leaving directory '/tmp/B.crNwZC/BUILD/elektra-0.8.23/build'
/usr/bin/make  -f src/tools/kdb/CMakeFiles/kdb-objects.dir/build.make src/tools/kdb/CMakeFiles/kdb-objects.dir/build
make[2]: Entering directory '/tmp/B.crNwZC/BUILD/elektra-0.8.23/build'
[  6%] Building CXX object gtest/CMakeFiles/gtest_main.dir/src/gtest_main.cc.o
cd /tmp/B.crNwZC/BUILD/elektra-0.8.23/build/gtest && /usr/bin/x86_64-pld-linux-gnux32-g++  -DGTEST_HAS_PTHREAD=1 -I/tmp/B.crNwZC/BUILD/elektra-0.8.23/tests/gtest-1.7.0/include -I/tmp/B.crNwZC/BUILD/elektra-0.8.23/tests/gtest-1.7.0  -std=c++11  -Wno-deprecated-declarations  -Wold-style-cast -Wstrict-null-sentinel -D_GLIBCXX_USE_NANOSLEEP -Wno-missing-field-initializers -Woverloaded-virtual  -Wsign-promo  -Wno-long-long -pedantic -Wno-variadic-macros -Wall -Wextra -Wno-overlength-strings -Wsign-compare -Wfloat-equal -Wformat -Wformat-security -Wshadow -Wcomments -Wtrigraphs -Wundef -Wuninitialized -Winit-self -Wmaybe-uninitialized -O2 -fwrapv -pipe -Wformat -Werror=format-security -gdwarf-4 -fno-debug-types-section -fvar-tracking-assignments -g2 -Wp,-D_FORTIFY_SOURCE=2 -fstack-protector-strong --param=ssp-buffer-size=4 -Werror=trampolines -fPIC -mtune=generic -march=x86-64 -gdwarf-4 -fno-debug-types-section -fvar-tracking-assignments -g2  -DNDEBUG -DQT_NO_DEBUG   -w -o CMakeFiles/gtest_main.dir/src/gtest_main.cc.o -c /tmp/B.crNwZC/BUILD/elektra-0.8.23/tests/gtest-1.7.0/src/gtest_main.cc
make[2]: Leaving directory '/tmp/B.crNwZC/BUILD/elektra-0.8.23/build'
make[2]: Entering directory '/tmp/B.crNwZC/BUILD/elektra-0.8.23/build'
[  6%] Building CXX object src/error/CMakeFiles/exporttranslations.dir/exporttranslations.cpp.o
cd /tmp/B.crNwZC/BUILD/elektra-0.8.23/build/src/error && /usr/bin/x86_64-pld-linux-gnux32-g++    -std=c++11  -Wno-deprecated-declarations  -Wold-style-cast -Wstrict-null-sentinel -D_GLIBCXX_USE_NANOSLEEP -Wno-missing-field-initializers -Woverloaded-virtual  -Wsign-promo  -Wno-long-long -pedantic -Wno-variadic-macros -Wall -Wextra -Wno-overlength-strings -Wsign-compare -Wfloat-equal -Wformat -Wformat-security -Wshadow -Wcomments -Wtrigraphs -Wundef -Wuninitialized -Winit-self -Wmaybe-uninitialized -O2 -fwrapv -pipe -Wformat -Werror=format-security -gdwarf-4 -fno-debug-types-section -fvar-tracking-assignments -g2 -Wp,-D_FORTIFY_SOURCE=2 -fstack-protector-strong --param=ssp-buffer-size=4 -Werror=trampolines -fPIC -mtune=generic -march=x86-64 -gdwarf-4 -fno-debug-types-section -fvar-tracking-assignments -g2  -DNDEBUG -DQT_NO_DEBUG   -o CMakeFiles/exporttranslations.dir/exporttranslations.cpp.o -c /tmp/B.crNwZC/BUILD/elektra-0.8.23/src/error/exporttranslations.cpp
make[2]: Leaving directory '/tmp/B.crNwZC/BUILD/elektra-0.8.23/build'
make[2]: Entering directory '/tmp/B.crNwZC/BUILD/elektra-0.8.23/build'
[  7%] Swig compile kdb.i for ruby
cd /tmp/B.crNwZC/BUILD/elektra-0.8.23/build/src/bindings/swig/ruby && /usr/bin/cmake -E make_directory /tmp/B.crNwZC/BUILD/elektra-0.8.23/build/src/bindings/swig/ruby /tmp/B.crNwZC/BUILD/elektra-0.8.23/build/src/bindings/swig/ruby
cd /tmp/B.crNwZC/BUILD/elektra-0.8.23/build/src/bindings/swig/ruby && /usr/bin/cmake -E touch /tmp/B.crNwZC/BUILD/elektra-0.8.23/build/src/bindings/swig/ruby/CMakeFiles/swig-ruby.dir/kdbRUBY.stamp
cd /tmp/B.crNwZC/BUILD/elektra-0.8.23/build/src/bindings/swig/ruby && /usr/bin/cmake -E env SWIG_LIB=/usr/share/swig/4.0.1 /usr/bin/swig -ruby -O -autorename -DSWIG_NO_EXPORT_ITERATOR_METHODS -DSWIG_WITHOUT_OVERRIDE -initname _kdb -outdir /tmp/B.crNwZC/BUILD/elektra-0.8.23/build/src/bindings/swig/ruby -c++ -I/tmp/B.crNwZC/BUILD/elektra-0.8.23/build/src/include -I/tmp/B.crNwZC/BUILD/elektra-0.8.23/src/include -I/tmp/B.crNwZC/BUILD/elektra-0.8.23/build/src/bindings/cpp/include -I/tmp/B.crNwZC/BUILD/elektra-0.8.23/src/bindings/cpp/include -I/tmp/B.crNwZC/BUILD/elektra-0.8.23/build/src/libs/tools/include -I/tmp/B.crNwZC/BUILD/elektra-0.8.23/src/libs/tools/include -I/tmp/B.crNwZC/BUILD/elektra-0.8.23/src/bindings/swig/ruby -I/usr/libx32/ruby/vendor_ruby/2.6 -I/usr/include/ruby-2.6 -o /tmp/B.crNwZC/BUILD/elektra-0.8.23/build/src/bindings/swig/ruby/kdbRUBY_wrap.cxx /tmp/B.crNwZC/BUILD/elektra-0.8.23/src/bindings/swig/ruby/kdb.i
make[2]: Leaving directory '/tmp/B.crNwZC/BUILD/elektra-0.8.23/build'
make[2]: Entering directory '/tmp/B.crNwZC/BUILD/elektra-0.8.23/build'
[  7%] Linking CXX static library ../lib/libgtest_main.a
cd /tmp/B.crNwZC/BUILD/elektra-0.8.23/build/gtest && /usr/bin/cmake -P CMakeFiles/gtest_main.dir/cmake_clean_target.cmake
cd /tmp/B.crNwZC/BUILD/elektra-0.8.23/build/gtest && /usr/bin/cmake -E cmake_link_script CMakeFiles/gtest_main.dir/link.txt --verbose=1
/usr/bin/ar qc ../lib/libgtest_main.a  CMakeFiles/gtest_main.dir/src/gtest_main.cc.o
/usr/bin/ranlib ../lib/libgtest_main.a
make[2]: Leaving directory '/tmp/B.crNwZC/BUILD/elektra-0.8.23/build'
make[1]: Entering directory '/tmp/B.crNwZC/BUILD/elektra-0.8.23/build'
[  7%] Built target swig-ruby_swig_compilation
make[1]: Leaving directory '/tmp/B.crNwZC/BUILD/elektra-0.8.23/build'
/usr/bin/make  -f doc/CMakeFiles/html.dir/build.make doc/CMakeFiles/html.dir/depend
make[1]: Entering directory '/tmp/B.crNwZC/BUILD/elektra-0.8.23/build'
[  7%] Built target gtest_main
make[1]: Leaving directory '/tmp/B.crNwZC/BUILD/elektra-0.8.23/build'
make[2]: Entering directory '/tmp/B.crNwZC/BUILD/elektra-0.8.23/build'
[  7%] Building C object src/bindings/io/glib/CMakeFiles/OBJ_elektra-io-glib.dir/io_glib.c.o
cd /tmp/B.crNwZC/BUILD/elektra-0.8.23/build/src/bindings/io/glib && /usr/bin/x86_64-pld-linux-gnux32-gcc  -I/tmp/B.crNwZC/BUILD/elektra-0.8.23/build/src/include -I/tmp/B.crNwZC/BUILD/elektra-0.8.23/src/include -isystem /usr/include/glib-2.0 -isystem /usr/libx32/glib-2.0/include  -std=gnu99  -Wno-deprecated-declarations  -Wstrict-prototypes  -Wno-long-long -pedantic -Wno-variadic-macros -Wall -Wextra -Wno-overlength-strings -Wsign-compare -Wfloat-equal -Wformat -Wformat-security -Wshadow -Wcomments -Wtrigraphs -Wundef -Wuninitialized -Winit-self -Wmaybe-uninitialized -Wsign-compare -Wfloat-equal -O2 -fwrapv -pipe -Wformat -Werror=format-security -gdwarf-4 -fno-debug-types-section -fvar-tracking-assignments -g2 -Wp,-D_FORTIFY_SOURCE=2 -fstack-protector-strong --param=ssp-buffer-size=4 -Werror=trampolines -fPIC -mtune=generic -march=x86-64 -gdwarf-4 -fno-debug-types-section -fvar-tracking-assignments -g2  -DNDEBUG -DQT_NO_DEBUG   -o CMakeFiles/OBJ_elektra-io-glib.dir/io_glib.c.o   -c /tmp/B.crNwZC/BUILD/elektra-0.8.23/src/bindings/io/glib/io_glib.c
make[2]: Leaving directory '/tmp/B.crNwZC/BUILD/elektra-0.8.23/build'
make[1]: Entering directory '/tmp/B.crNwZC/BUILD/elektra-0.8.23/build'
[  7%] Built target OBJ_elektra-io-glib
make[1]: Leaving directory '/tmp/B.crNwZC/BUILD/elektra-0.8.23/build'
/usr/bin/make  -f doc/help/CMakeFiles/man.dir/build.make doc/help/CMakeFiles/man.dir/depend
make[2]: Entering directory '/tmp/B.crNwZC/BUILD/elektra-0.8.23/build'
cd /tmp/B.crNwZC/BUILD/elektra-0.8.23/build && /usr/bin/cmake -E cmake_depends "Unix Makefiles" /tmp/B.crNwZC/BUILD/elektra-0.8.23 /tmp/B.crNwZC/BUILD/elektra-0.8.23/doc /tmp/B.crNwZC/BUILD/elektra-0.8.23/build /tmp/B.crNwZC/BUILD/elektra-0.8.23/build/doc /tmp/B.crNwZC/BUILD/elektra-0.8.23/build/doc/CMakeFiles/html.dir/DependInfo.cmake --color=
Scanning dependencies of target html
make[2]: Leaving directory '/tmp/B.crNwZC/BUILD/elektra-0.8.23/build'
/usr/bin/make  -f doc/CMakeFiles/html.dir/build.make doc/CMakeFiles/html.dir/build
make[2]: Entering directory '/tmp/B.crNwZC/BUILD/elektra-0.8.23/build'
cd /tmp/B.crNwZC/BUILD/elektra-0.8.23/build && /usr/bin/cmake -E cmake_depends "Unix Makefiles" /tmp/B.crNwZC/BUILD/elektra-0.8.23 /tmp/B.crNwZC/BUILD/elektra-0.8.23/doc/help /tmp/B.crNwZC/BUILD/elektra-0.8.23/build /tmp/B.crNwZC/BUILD/elektra-0.8.23/build/doc/help /tmp/B.crNwZC/BUILD/elektra-0.8.23/build/doc/help/CMakeFiles/man.dir/DependInfo.cmake --color=
Scanning dependencies of target man
make[2]: Leaving directory '/tmp/B.crNwZC/BUILD/elektra-0.8.23/build'
/usr/bin/make  -f doc/help/CMakeFiles/man.dir/build.make doc/help/CMakeFiles/man.dir/build
make[2]: Nothing to be done for 'doc/help/CMakeFiles/man.dir/build'.
make[1]: Entering directory '/tmp/B.crNwZC/BUILD/elektra-0.8.23/build'
[  7%] Built target man
make[1]: Leaving directory '/tmp/B.crNwZC/BUILD/elektra-0.8.23/build'
make[2]: Entering directory '/tmp/B.crNwZC/BUILD/elektra-0.8.23/build'
[  7%] Building CXX object src/tools/kdb/CMakeFiles/kdb-objects.dir/ansicolors.cpp.o
cd /tmp/B.crNwZC/BUILD/elektra-0.8.23/build/src/tools/kdb && /usr/bin/x86_64-pld-linux-gnux32-g++   -I/tmp/B.crNwZC/BUILD/elektra-0.8.23/build/src/include -I/tmp/B.crNwZC/BUILD/elektra-0.8.23/src/include -I/tmp/B.crNwZC/BUILD/elektra-0.8.23/build/src/bindings/cpp/include -I/tmp/B.crNwZC/BUILD/elektra-0.8.23/src/bindings/cpp/include -I/tmp/B.crNwZC/BUILD/elektra-0.8.23/build/src/libs/tools/include -I/tmp/B.crNwZC/BUILD/elektra-0.8.23/src/libs/tools/include -I/tmp/B.crNwZC/BUILD/elektra-0.8.23/src/tools/kdb  -std=c++11  -Wno-deprecated-declarations  -Wold-style-cast -Wstrict-null-sentinel -D_GLIBCXX_USE_NANOSLEEP -Wno-missing-field-initializers -Woverloaded-virtual  -Wsign-promo  -Wno-long-long -pedantic -Wno-variadic-macros -Wall -Wextra -Wno-overlength-strings -Wsign-compare -Wfloat-equal -Wformat -Wformat-security -Wshadow -Wcomments -Wtrigraphs -Wundef -Wuninitialized -Winit-self -Wmaybe-uninitialized -O2 -fwrapv -pipe -Wformat -Werror=format-security -gdwarf-4 -fno-debug-types-section -fvar-tracking-assignments -g2 -Wp,-D_FORTIFY_SOURCE=2 -fstack-protector-strong --param=ssp-buffer-size=4 -Werror=trampolines -fPIC -mtune=generic -march=x86-64 -gdwarf-4 -fno-debug-types-section -fvar-tracking-assignments -g2  -DNDEBUG -DQT_NO_DEBUG   -o CMakeFiles/kdb-objects.dir/ansicolors.cpp.o -c /tmp/B.crNwZC/BUILD/elektra-0.8.23/src/tools/kdb/ansicolors.cpp
make[2]: Leaving directory '/tmp/B.crNwZC/BUILD/elektra-0.8.23/build'
make[2]: Entering directory '/tmp/B.crNwZC/BUILD/elektra-0.8.23/build'
[  6%] Building CXX object src/error/CMakeFiles/exporttranslations.dir/parser.cpp.o
cd /tmp/B.crNwZC/BUILD/elektra-0.8.23/build/src/error && /usr/bin/x86_64-pld-linux-gnux32-g++    -std=c++11  -Wno-deprecated-declarations  -Wold-style-cast -Wstrict-null-sentinel -D_GLIBCXX_USE_NANOSLEEP -Wno-missing-field-initializers -Woverloaded-virtual  -Wsign-promo  -Wno-long-long -pedantic -Wno-variadic-macros -Wall -Wextra -Wno-overlength-strings -Wsign-compare -Wfloat-equal -Wformat -Wformat-security -Wshadow -Wcomments -Wtrigraphs -Wundef -Wuninitialized -Winit-self -Wmaybe-uninitialized -O2 -fwrapv -pipe -Wformat -Werror=format-security -gdwarf-4 -fno-debug-types-section -fvar-tracking-assignments -g2 -Wp,-D_FORTIFY_SOURCE=2 -fstack-protector-strong --param=ssp-buffer-size=4 -Werror=trampolines -fPIC -mtune=generic -march=x86-64 -gdwarf-4 -fno-debug-types-section -fvar-tracking-assignments -g2  -DNDEBUG -DQT_NO_DEBUG   -o CMakeFiles/exporttranslations.dir/parser.cpp.o -c /tmp/B.crNwZC/BUILD/elektra-0.8.23/src/error/parser.cpp
make[2]: Leaving directory '/tmp/B.crNwZC/BUILD/elektra-0.8.23/build'
make[2]: Entering directory '/tmp/B.crNwZC/BUILD/elektra-0.8.23/build'
[  7%] Linking CXX executable ../../bin/exporttranslations
cd /tmp/B.crNwZC/BUILD/elektra-0.8.23/build/src/error && /usr/bin/cmake -E cmake_link_script CMakeFiles/exporttranslations.dir/link.txt --verbose=1
/usr/bin/x86_64-pld-linux-gnux32-g++   -std=c++11  -Wno-deprecated-declarations  -Wold-style-cast -Wstrict-null-sentinel -D_GLIBCXX_USE_NANOSLEEP -Wno-missing-field-initializers -Woverloaded-virtual  -Wsign-promo  -Wno-long-long -pedantic -Wno-variadic-macros -Wall -Wextra -Wno-overlength-strings -Wsign-compare -Wfloat-equal -Wformat -Wformat-security -Wshadow -Wcomments -Wtrigraphs -Wundef -Wuninitialized -Winit-self -Wmaybe-uninitialized -O2 -fwrapv -pipe -Wformat -Werror=format-security -gdwarf-4 -fno-debug-types-section -fvar-tracking-assignments -g2 -Wp,-D_FORTIFY_SOURCE=2 -fstack-protector-strong --param=ssp-buffer-size=4 -Werror=trampolines -fPIC -mtune=generic -march=x86-64 -gdwarf-4 -fno-debug-types-section -fvar-tracking-assignments -g2  -DNDEBUG -DQT_NO_DEBUG  -Wl,--as-needed -Wl,--no-copy-dt-needed-entries -Wl,-z,relro -Wl,-z,combreloc -rdynamic CMakeFiles/exporttranslations.dir/exporttranslations.cpp.o CMakeFiles/exporttranslations.dir/parser.cpp.o  -o ../../bin/exporttranslations 
make[2]: Leaving directory '/tmp/B.crNwZC/BUILD/elektra-0.8.23/build'
make[1]: Entering directory '/tmp/B.crNwZC/BUILD/elektra-0.8.23/build'
[  7%] Built target exporttranslations
make[1]: Leaving directory '/tmp/B.crNwZC/BUILD/elektra-0.8.23/build'
make[2]: Entering directory '/tmp/B.crNwZC/BUILD/elektra-0.8.23/build'
[  7%] Building CXX object src/tools/kdb/CMakeFiles/kdb-objects.dir/command.cpp.o
cd /tmp/B.crNwZC/BUILD/elektra-0.8.23/build/src/tools/kdb && /usr/bin/x86_64-pld-linux-gnux32-g++   -I/tmp/B.crNwZC/BUILD/elektra-0.8.23/build/src/include -I/tmp/B.crNwZC/BUILD/elektra-0.8.23/src/include -I/tmp/B.crNwZC/BUILD/elektra-0.8.23/build/src/bindings/cpp/include -I/tmp/B.crNwZC/BUILD/elektra-0.8.23/src/bindings/cpp/include -I/tmp/B.crNwZC/BUILD/elektra-0.8.23/build/src/libs/tools/include -I/tmp/B.crNwZC/BUILD/elektra-0.8.23/src/libs/tools/include -I/tmp/B.crNwZC/BUILD/elektra-0.8.23/src/tools/kdb  -std=c++11  -Wno-deprecated-declarations  -Wold-style-cast -Wstrict-null-sentinel -D_GLIBCXX_USE_NANOSLEEP -Wno-missing-field-initializers -Woverloaded-virtual  -Wsign-promo  -Wno-long-long -pedantic -Wno-variadic-macros -Wall -Wextra -Wno-overlength-strings -Wsign-compare -Wfloat-equal -Wformat -Wformat-security -Wshadow -Wcomments -Wtrigraphs -Wundef -Wuninitialized -Winit-self -Wmaybe-uninitialized -O2 -fwrapv -pipe -Wformat -Werror=format-security -gdwarf-4 -fno-debug-types-section -fvar-tracking-assignments -g2 -Wp,-D_FORTIFY_SOURCE=2 -fstack-protector-strong --param=ssp-buffer-size=4 -Werror=trampolines -fPIC -mtune=generic -march=x86-64 -gdwarf-4 -fno-debug-types-section -fvar-tracking-assignments -g2  -DNDEBUG -DQT_NO_DEBUG   -o CMakeFiles/kdb-objects.dir/command.cpp.o -c /tmp/B.crNwZC/BUILD/elektra-0.8.23/src/tools/kdb/command.cpp
make[2]: Leaving directory '/tmp/B.crNwZC/BUILD/elektra-0.8.23/build'
make[2]: Entering directory '/tmp/B.crNwZC/BUILD/elektra-0.8.23/build'
[  7%] Swig compile kdbtools.i for ruby
cd /tmp/B.crNwZC/BUILD/elektra-0.8.23/build/src/bindings/swig/ruby && /usr/bin/cmake -E make_directory /tmp/B.crNwZC/BUILD/elektra-0.8.23/build/src/bindings/swig/ruby /tmp/B.crNwZC/BUILD/elektra-0.8.23/build/src/bindings/swig/ruby
cd /tmp/B.crNwZC/BUILD/elektra-0.8.23/build/src/bindings/swig/ruby && /usr/bin/cmake -E touch /tmp/B.crNwZC/BUILD/elektra-0.8.23/build/src/bindings/swig/ruby/CMakeFiles/swig-ruby-tools.dir/kdbtoolsRUBY.stamp
cd /tmp/B.crNwZC/BUILD/elektra-0.8.23/build/src/bindings/swig/ruby && /usr/bin/cmake -E env SWIG_LIB=/usr/share/swig/4.0.1 /usr/bin/swig -ruby -O -autorename -DSWIG_NO_EXPORT_ITERATOR_METHODS -DSWIG_WITHOUT_OVERRIDE -initname _kdbtools -minherit -outdir /tmp/B.crNwZC/BUILD/elektra-0.8.23/build/src/bindings/swig/ruby -c++ -I/tmp/B.crNwZC/BUILD/elektra-0.8.23/build/src/include -I/tmp/B.crNwZC/BUILD/elektra-0.8.23/src/include -I/tmp/B.crNwZC/BUILD/elektra-0.8.23/build/src/bindings/cpp/include -I/tmp/B.crNwZC/BUILD/elektra-0.8.23/src/bindings/cpp/include -I/tmp/B.crNwZC/BUILD/elektra-0.8.23/build/src/libs/tools/include -I/tmp/B.crNwZC/BUILD/elektra-0.8.23/src/libs/tools/include -I/tmp/B.crNwZC/BUILD/elektra-0.8.23/src/bindings/swig/ruby -I/usr/libx32/ruby/vendor_ruby/2.6 -I/usr/include/ruby-2.6 -o /tmp/B.crNwZC/BUILD/elektra-0.8.23/build/src/bindings/swig/ruby/kdbtoolsRUBY_wrap.cxx /tmp/B.crNwZC/BUILD/elektra-0.8.23/src/bindings/swig/ruby/kdbtools.i
make[2]: Leaving directory '/tmp/B.crNwZC/BUILD/elektra-0.8.23/build'
make[1]: Entering directory '/tmp/B.crNwZC/BUILD/elektra-0.8.23/build'
[  8%] Built target swig-ruby-tools_swig_compilation
make[1]: Leaving directory '/tmp/B.crNwZC/BUILD/elektra-0.8.23/build'
make[2]: Entering directory '/tmp/B.crNwZC/BUILD/elektra-0.8.23/build'
[  6%] Building CXX object src/error/CMakeFiles/elektra-export-errors.dir/exporterrors.cpp.o
cd /tmp/B.crNwZC/BUILD/elektra-0.8.23/build/src/error && /usr/bin/x86_64-pld-linux-gnux32-g++    -std=c++11  -Wno-deprecated-declarations  -Wold-style-cast -Wstrict-null-sentinel -D_GLIBCXX_USE_NANOSLEEP -Wno-missing-field-initializers -Woverloaded-virtual  -Wsign-promo  -Wno-long-long -pedantic -Wno-variadic-macros -Wall -Wextra -Wno-overlength-strings -Wsign-compare -Wfloat-equal -Wformat -Wformat-security -Wshadow -Wcomments -Wtrigraphs -Wundef -Wuninitialized -Winit-self -Wmaybe-uninitialized -O2 -fwrapv -pipe -Wformat -Werror=format-security -gdwarf-4 -fno-debug-types-section -fvar-tracking-assignments -g2 -Wp,-D_FORTIFY_SOURCE=2 -fstack-protector-strong --param=ssp-buffer-size=4 -Werror=trampolines -fPIC -mtune=generic -march=x86-64 -gdwarf-4 -fno-debug-types-section -fvar-tracking-assignments -g2  -DNDEBUG -DQT_NO_DEBUG   -o CMakeFiles/elektra-export-errors.dir/exporterrors.cpp.o -c /tmp/B.crNwZC/BUILD/elektra-0.8.23/src/error/exporterrors.cpp
make[2]: Leaving directory '/tmp/B.crNwZC/BUILD/elektra-0.8.23/build'
make[2]: Entering directory '/tmp/B.crNwZC/BUILD/elektra-0.8.23/build'
[  7%] Building CXX object src/tools/kdb/CMakeFiles/kdb-objects.dir/cmdline.cpp.o
cd /tmp/B.crNwZC/BUILD/elektra-0.8.23/build/src/tools/kdb && /usr/bin/x86_64-pld-linux-gnux32-g++   -I/tmp/B.crNwZC/BUILD/elektra-0.8.23/build/src/include -I/tmp/B.crNwZC/BUILD/elektra-0.8.23/src/include -I/tmp/B.crNwZC/BUILD/elektra-0.8.23/build/src/bindings/cpp/include -I/tmp/B.crNwZC/BUILD/elektra-0.8.23/src/bindings/cpp/include -I/tmp/B.crNwZC/BUILD/elektra-0.8.23/build/src/libs/tools/include -I/tmp/B.crNwZC/BUILD/elektra-0.8.23/src/libs/tools/include -I/tmp/B.crNwZC/BUILD/elektra-0.8.23/src/tools/kdb  -std=c++11  -Wno-deprecated-declarations  -Wold-style-cast -Wstrict-null-sentinel -D_GLIBCXX_USE_NANOSLEEP -Wno-missing-field-initializers -Woverloaded-virtual  -Wsign-promo  -Wno-long-long -pedantic -Wno-variadic-macros -Wall -Wextra -Wno-overlength-strings -Wsign-compare -Wfloat-equal -Wformat -Wformat-security -Wshadow -Wcomments -Wtrigraphs -Wundef -Wuninitialized -Winit-self -Wmaybe-uninitialized -O2 -fwrapv -pipe -Wformat -Werror=format-security -gdwarf-4 -fno-debug-types-section -fvar-tracking-assignments -g2 -Wp,-D_FORTIFY_SOURCE=2 -fstack-protector-strong --param=ssp-buffer-size=4 -Werror=trampolines -fPIC -mtune=generic -march=x86-64 -gdwarf-4 -fno-debug-types-section -fvar-tracking-assignments -g2  -DNDEBUG -DQT_NO_DEBUG   -o CMakeFiles/kdb-objects.dir/cmdline.cpp.o -c /tmp/B.crNwZC/BUILD/elektra-0.8.23/src/tools/kdb/cmdline.cpp
/tmp/B.crNwZC/BUILD/elektra-0.8.23/src/tools/kdb/cmdline.cpp: In constructor 'Cmdline::Cmdline(int, char**, Command*)':
/tmp/B.crNwZC/BUILD/elektra-0.8.23/src/tools/kdb/cmdline.cpp:39:99: error: 'numeric_limits' was not declared in this scope
   39 |   debug (), force (), load (), humanReadable (), help (), interactive (), minDepth (0), maxDepth (numeric_limits<int>::max ()),
      |                                                                                                   ^~~~~~~~~~~~~~
/tmp/B.crNwZC/BUILD/elektra-0.8.23/src/tools/kdb/cmdline.cpp:39:114: error: expected primary-expression before 'int'
   39 |   debug (), force (), load (), humanReadable (), help (), interactive (), minDepth (0), maxDepth (numeric_limits<int>::max ()),
      |                                                                                                                  ^~~
/tmp/B.crNwZC/BUILD/elektra-0.8.23/src/tools/kdb/cmdline.cpp:418:59: error: expected primary-expression before 'int'
  418 |                                 maxDepth = numeric_limits<int>::max ();
      |                                                           ^~~
make[2]: *** [src/tools/kdb/CMakeFiles/kdb-objects.dir/build.make:112: src/tools/kdb/CMakeFiles/kdb-objects.dir/cmdline.cpp.o] Error 1
make[2]: Leaving directory '/tmp/B.crNwZC/BUILD/elektra-0.8.23/build'
make[2]: *** Waiting for unfinished jobs....
make[2]: Entering directory '/tmp/B.crNwZC/BUILD/elektra-0.8.23/build'
[  7%] Building CXX object src/error/CMakeFiles/elektra-export-errors.dir/parser.cpp.o
cd /tmp/B.crNwZC/BUILD/elektra-0.8.23/build/src/error && /usr/bin/x86_64-pld-linux-gnux32-g++    -std=c++11  -Wno-deprecated-declarations  -Wold-style-cast -Wstrict-null-sentinel -D_GLIBCXX_USE_NANOSLEEP -Wno-missing-field-initializers -Woverloaded-virtual  -Wsign-promo  -Wno-long-long -pedantic -Wno-variadic-macros -Wall -Wextra -Wno-overlength-strings -Wsign-compare -Wfloat-equal -Wformat -Wformat-security -Wshadow -Wcomments -Wtrigraphs -Wundef -Wuninitialized -Winit-self -Wmaybe-uninitialized -O2 -fwrapv -pipe -Wformat -Werror=format-security -gdwarf-4 -fno-debug-types-section -fvar-tracking-assignments -g2 -Wp,-D_FORTIFY_SOURCE=2 -fstack-protector-strong --param=ssp-buffer-size=4 -Werror=trampolines -fPIC -mtune=generic -march=x86-64 -gdwarf-4 -fno-debug-types-section -fvar-tracking-assignments -g2  -DNDEBUG -DQT_NO_DEBUG   -o CMakeFiles/elektra-export-errors.dir/parser.cpp.o -c /tmp/B.crNwZC/BUILD/elektra-0.8.23/src/error/parser.cpp
make[2]: Leaving directory '/tmp/B.crNwZC/BUILD/elektra-0.8.23/build'
make[2]: Entering directory '/tmp/B.crNwZC/BUILD/elektra-0.8.23/build'
[  8%] Linking CXX executable ../../bin/elektra-export-errors
cd /tmp/B.crNwZC/BUILD/elektra-0.8.23/build/src/error && /usr/bin/cmake -E cmake_link_script CMakeFiles/elektra-export-errors.dir/link.txt --verbose=1
/usr/bin/x86_64-pld-linux-gnux32-g++   -std=c++11  -Wno-deprecated-declarations  -Wold-style-cast -Wstrict-null-sentinel -D_GLIBCXX_USE_NANOSLEEP -Wno-missing-field-initializers -Woverloaded-virtual  -Wsign-promo  -Wno-long-long -pedantic -Wno-variadic-macros -Wall -Wextra -Wno-overlength-strings -Wsign-compare -Wfloat-equal -Wformat -Wformat-security -Wshadow -Wcomments -Wtrigraphs -Wundef -Wuninitialized -Winit-self -Wmaybe-uninitialized -O2 -fwrapv -pipe -Wformat -Werror=format-security -gdwarf-4 -fno-debug-types-section -fvar-tracking-assignments -g2 -Wp,-D_FORTIFY_SOURCE=2 -fstack-protector-strong --param=ssp-buffer-size=4 -Werror=trampolines -fPIC -mtune=generic -march=x86-64 -gdwarf-4 -fno-debug-types-section -fvar-tracking-assignments -g2  -DNDEBUG -DQT_NO_DEBUG  -Wl,--as-needed -Wl,--no-copy-dt-needed-entries -Wl,-z,relro -Wl,-z,combreloc -rdynamic CMakeFiles/elektra-export-errors.dir/exporterrors.cpp.o CMakeFiles/elektra-export-errors.dir/parser.cpp.o  -o ../../bin/elektra-export-errors 
make[2]: Leaving directory '/tmp/B.crNwZC/BUILD/elektra-0.8.23/build'
make[1]: Entering directory '/tmp/B.crNwZC/BUILD/elektra-0.8.23/build'
[  8%] Built target elektra-export-errors
make[1]: Leaving directory '/tmp/B.crNwZC/BUILD/elektra-0.8.23/build'
/usr/bin/make  -f src/error/CMakeFiles/kdberrors_generated.dir/build.make src/error/CMakeFiles/kdberrors_generated.dir/depend
make[2]: Entering directory '/tmp/B.crNwZC/BUILD/elektra-0.8.23/build'
cd /tmp/B.crNwZC/BUILD/elektra-0.8.23/build && /usr/bin/cmake -E cmake_depends "Unix Makefiles" /tmp/B.crNwZC/BUILD/elektra-0.8.23 /tmp/B.crNwZC/BUILD/elektra-0.8.23/src/error /tmp/B.crNwZC/BUILD/elektra-0.8.23/build /tmp/B.crNwZC/BUILD/elektra-0.8.23/build/src/error /tmp/B.crNwZC/BUILD/elektra-0.8.23/build/src/error/CMakeFiles/kdberrors_generated.dir/DependInfo.cmake --color=
Scanning dependencies of target kdberrors_generated
make[2]: Leaving directory '/tmp/B.crNwZC/BUILD/elektra-0.8.23/build'
/usr/bin/make  -f src/error/CMakeFiles/kdberrors_generated.dir/build.make src/error/CMakeFiles/kdberrors_generated.dir/build
make[2]: Entering directory '/tmp/B.crNwZC/BUILD/elektra-0.8.23/build'
[  8%] Generating ../include/kdberrors.h
cd /tmp/B.crNwZC/BUILD/elektra-0.8.23/build/src/error && ../../bin/elektra-export-errors /tmp/B.crNwZC/BUILD/elektra-0.8.23/src/error/specification /tmp/B.crNwZC/BUILD/elektra-0.8.23/build/src/include/kdberrors.h
make[2]: Leaving directory '/tmp/B.crNwZC/BUILD/elektra-0.8.23/build'
make[1]: Entering directory '/tmp/B.crNwZC/BUILD/elektra-0.8.23/build'
[  8%] Built target kdberrors_generated
make[1]: Leaving directory '/tmp/B.crNwZC/BUILD/elektra-0.8.23/build'
/usr/bin/make  -f src/libs/elektra/CMakeFiles/elektra-core.dir/build.make src/libs/elektra/CMakeFiles/elektra-core.dir/depend
/usr/bin/make  -f src/plugins/augeas/CMakeFiles/elektra-augeas-objects.dir/build.make src/plugins/augeas/CMakeFiles/elektra-augeas-objects.dir/depend
make[2]: Entering directory '/tmp/B.crNwZC/BUILD/elektra-0.8.23/build'
cd /tmp/B.crNwZC/BUILD/elektra-0.8.23/build && /usr/bin/cmake -E cmake_depends "Unix Makefiles" /tmp/B.crNwZC/BUILD/elektra-0.8.23 /tmp/B.crNwZC/BUILD/elektra-0.8.23/src/plugins/augeas /tmp/B.crNwZC/BUILD/elektra-0.8.23/build /tmp/B.crNwZC/BUILD/elektra-0.8.23/build/src/plugins/augeas /tmp/B.crNwZC/BUILD/elektra-0.8.23/build/src/plugins/augeas/CMakeFiles/elektra-augeas-objects.dir/DependInfo.cmake --color=
Scanning dependencies of target elektra-augeas-objects
make[2]: Leaving directory '/tmp/B.crNwZC/BUILD/elektra-0.8.23/build'
/usr/bin/make  -f src/plugins/augeas/CMakeFiles/elektra-augeas-objects.dir/build.make src/plugins/augeas/CMakeFiles/elektra-augeas-objects.dir/build
make[2]: Entering directory '/tmp/B.crNwZC/BUILD/elektra-0.8.23/build'
[  8%] Generating exported_symbols.h
cd /tmp/B.crNwZC/BUILD/elektra-0.8.23/build/src/libs/elektra && ../../../bin/elektra-export-symbols resolver_fm_hpu_b dump augeas base64 blockresolver boolean c cachefilter camel ccode conditionals constants counter crypto_gcrypt crypto_openssl csvstorage curlget date dbus dbusrecv desktop dini directoryvalue doc dpkg dump enum error fcrypt file filecheck fstab gitresolver glob hexcode hidden hosts iconv ini internalnotification ipaddr iterate journald keytometa line lineendings list logchange lua mathcheck mini mozprefs multifile network ni noresolver null passwd path profile python python2 range regexstore rename required resolver_fm_b_b resolver_fm_hb_b resolver_fm_hp_b resolver_fm_hpu_b resolver_fm_pb_b resolver_fm_ub_x resolver_fm_uhb_xb resolver_fm_xb_x resolver_fm_xhp_x resolver_fm_xp_x ruby semlock shell simpleini simplespeclang spec struct sync syslog tcl template timeofday tracer type uname validation wresolver xerces xmltool yajl yamlcpp
Exporting symbols for dump augeas base64 blockresolver boolean c cachefilter camel ccode conditionals constants counter crypto_gcrypt crypto_openssl csvstorage curlget date dbus dbusrecv desktop dini directoryvalue doc dpkg dump enum error fcrypt file filecheck fstab gitresolver glob hexcode hidden hosts iconv ini internalnotification ipaddr iterate journald keytometa line lineendings list logchange lua mathcheck mini mozprefs multifile network ni noresolver null passwd path profile python python2 range regexstore rename required resolver_fm_b_b resolver_fm_hb_b resolver_fm_hp_b resolver_fm_hpu_b resolver_fm_pb_b resolver_fm_ub_x resolver_fm_uhb_xb resolver_fm_xb_x resolver_fm_xhp_x resolver_fm_xp_x ruby semlock shell simpleini simplespeclang spec struct sync syslog tcl template timeofday tracer type uname validation wresolver xerces xmltool yajl yamlcpp 
make[2]: Leaving directory '/tmp/B.crNwZC/BUILD/elektra-0.8.23/build'
make[2]: Entering directory '/tmp/B.crNwZC/BUILD/elektra-0.8.23/build'
cd /tmp/B.crNwZC/BUILD/elektra-0.8.23/build && /usr/bin/cmake -E cmake_depends "Unix Makefiles" /tmp/B.crNwZC/BUILD/elektra-0.8.23 /tmp/B.crNwZC/BUILD/elektra-0.8.23/src/libs/elektra /tmp/B.crNwZC/BUILD/elektra-0.8.23/build /tmp/B.crNwZC/BUILD/elektra-0.8.23/build/src/libs/elektra /tmp/B.crNwZC/BUILD/elektra-0.8.23/build/src/libs/elektra/CMakeFiles/elektra-core.dir/DependInfo.cmake --color=
Scanning dependencies of target elektra-core
make[2]: Leaving directory '/tmp/B.crNwZC/BUILD/elektra-0.8.23/build'
/usr/bin/make  -f src/libs/elektra/CMakeFiles/elektra-core.dir/build.make src/libs/elektra/CMakeFiles/elektra-core.dir/build
make[2]: Entering directory '/tmp/B.crNwZC/BUILD/elektra-0.8.23/build'
[  8%] Building C object src/libs/elektra/CMakeFiles/elektra-core.dir/global.c.o
cd /tmp/B.crNwZC/BUILD/elektra-0.8.23/build/src/libs/elektra && /usr/bin/x86_64-pld-linux-gnux32-gcc -DHAVE_KDBCONFIG_H -Delektra_core_EXPORTS -I/tmp/B.crNwZC/BUILD/elektra-0.8.23/build/src/include -I/tmp/B.crNwZC/BUILD/elektra-0.8.23/src/include -I/tmp/B.crNwZC/BUILD/elektra-0.8.23/build/src/libs/elektra  -std=gnu99  -Wno-deprecated-declarations  -Wstrict-prototypes  -Wno-long-long -pedantic -Wno-variadic-macros -Wall -Wextra -Wno-overlength-strings -Wsign-compare -Wfloat-equal -Wformat -Wformat-security -Wshadow -Wcomments -Wtrigraphs -Wundef -Wuninitialized -Winit-self -Wmaybe-uninitialized -Wsign-compare -Wfloat-equal -O2 -fwrapv -pipe -Wformat -Werror=format-security -gdwarf-4 -fno-debug-types-section -fvar-tracking-assignments -g2 -Wp,-D_FORTIFY_SOURCE=2 -fstack-protector-strong --param=ssp-buffer-size=4 -Werror=trampolines -fPIC -mtune=generic -march=x86-64 -gdwarf-4 -fno-debug-types-section -fvar-tracking-assignments -g2  -DNDEBUG -DQT_NO_DEBUG -fPIC   -o CMakeFiles/elektra-core.dir/global.c.o   -c /tmp/B.crNwZC/BUILD/elektra-0.8.23/src/libs/elektra/global.c
make[2]: Leaving directory '/tmp/B.crNwZC/BUILD/elektra-0.8.23/build'
make[2]: Entering directory '/tmp/B.crNwZC/BUILD/elektra-0.8.23/build'
[  7%] Building CXX object src/tools/kdb/CMakeFiles/kdb-objects.dir/check.cpp.o
cd /tmp/B.crNwZC/BUILD/elektra-0.8.23/build/src/tools/kdb && /usr/bin/x86_64-pld-linux-gnux32-g++   -I/tmp/B.crNwZC/BUILD/elektra-0.8.23/build/src/include -I/tmp/B.crNwZC/BUILD/elektra-0.8.23/src/include -I/tmp/B.crNwZC/BUILD/elektra-0.8.23/build/src/bindings/cpp/include -I/tmp/B.crNwZC/BUILD/elektra-0.8.23/src/bindings/cpp/include -I/tmp/B.crNwZC/BUILD/elektra-0.8.23/build/src/libs/tools/include -I/tmp/B.crNwZC/BUILD/elektra-0.8.23/src/libs/tools/include -I/tmp/B.crNwZC/BUILD/elektra-0.8.23/src/tools/kdb  -std=c++11  -Wno-deprecated-declarations  -Wold-style-cast -Wstrict-null-sentinel -D_GLIBCXX_USE_NANOSLEEP -Wno-missing-field-initializers -Woverloaded-virtual  -Wsign-promo  -Wno-long-long -pedantic -Wno-variadic-macros -Wall -Wextra -Wno-overlength-strings -Wsign-compare -Wfloat-equal -Wformat -Wformat-security -Wshadow -Wcomments -Wtrigraphs -Wundef -Wuninitialized -Winit-self -Wmaybe-uninitialized -O2 -fwrapv -pipe -Wformat -Werror=format-security -gdwarf-4 -fno-debug-types-section -fvar-tracking-assignments -g2 -Wp,-D_FORTIFY_SOURCE=2 -fstack-protector-strong --param=ssp-buffer-size=4 -Werror=trampolines -fPIC -mtune=generic -march=x86-64 -gdwarf-4 -fno-debug-types-section -fvar-tracking-assignments -g2  -DNDEBUG -DQT_NO_DEBUG   -o CMakeFiles/kdb-objects.dir/check.cpp.o -c /tmp/B.crNwZC/BUILD/elektra-0.8.23/src/tools/kdb/check.cpp
make[2]: Leaving directory '/tmp/B.crNwZC/BUILD/elektra-0.8.23/build'
make[2]: Entering directory '/tmp/B.crNwZC/BUILD/elektra-0.8.23/build'
[  8%] Building C object src/libs/elektra/CMakeFiles/elektra-core.dir/kdbenum.c.o
cd /tmp/B.crNwZC/BUILD/elektra-0.8.23/build/src/libs/elektra && /usr/bin/x86_64-pld-linux-gnux32-gcc -DHAVE_KDBCONFIG_H -Delektra_core_EXPORTS -I/tmp/B.crNwZC/BUILD/elektra-0.8.23/build/src/include -I/tmp/B.crNwZC/BUILD/elektra-0.8.23/src/include -I/tmp/B.crNwZC/BUILD/elektra-0.8.23/build/src/libs/elektra  -std=gnu99  -Wno-deprecated-declarations  -Wstrict-prototypes  -Wno-long-long -pedantic -Wno-variadic-macros -Wall -Wextra -Wno-overlength-strings -Wsign-compare -Wfloat-equal -Wformat -Wformat-security -Wshadow -Wcomments -Wtrigraphs -Wundef -Wuninitialized -Winit-self -Wmaybe-uninitialized -Wsign-compare -Wfloat-equal -O2 -fwrapv -pipe -Wformat -Werror=format-security -gdwarf-4 -fno-debug-types-section -fvar-tracking-assignments -g2 -Wp,-D_FORTIFY_SOURCE=2 -fstack-protector-strong --param=ssp-buffer-size=4 -Werror=trampolines -fPIC -mtune=generic -march=x86-64 -gdwarf-4 -fno-debug-types-section -fvar-tracking-assignments -g2  -DNDEBUG -DQT_NO_DEBUG -fPIC   -o CMakeFiles/elektra-core.dir/kdbenum.c.o   -c /tmp/B.crNwZC/BUILD/elektra-0.8.23/src/libs/elektra/kdbenum.c
make[2]: Leaving directory '/tmp/B.crNwZC/BUILD/elektra-0.8.23/build'
make[2]: Entering directory '/tmp/B.crNwZC/BUILD/elektra-0.8.23/build'
[  8%] Building CXX object src/tools/kdb/CMakeFiles/kdb-objects.dir/convert.cpp.o
cd /tmp/B.crNwZC/BUILD/elektra-0.8.23/build/src/tools/kdb && /usr/bin/x86_64-pld-linux-gnux32-g++   -I/tmp/B.crNwZC/BUILD/elektra-0.8.23/build/src/include -I/tmp/B.crNwZC/BUILD/elektra-0.8.23/src/include -I/tmp/B.crNwZC/BUILD/elektra-0.8.23/build/src/bindings/cpp/include -I/tmp/B.crNwZC/BUILD/elektra-0.8.23/src/bindings/cpp/include -I/tmp/B.crNwZC/BUILD/elektra-0.8.23/build/src/libs/tools/include -I/tmp/B.crNwZC/BUILD/elektra-0.8.23/src/libs/tools/include -I/tmp/B.crNwZC/BUILD/elektra-0.8.23/src/tools/kdb  -std=c++11  -Wno-deprecated-declarations  -Wold-style-cast -Wstrict-null-sentinel -D_GLIBCXX_USE_NANOSLEEP -Wno-missing-field-initializers -Woverloaded-virtual  -Wsign-promo  -Wno-long-long -pedantic -Wno-variadic-macros -Wall -Wextra -Wno-overlength-strings -Wsign-compare -Wfloat-equal -Wformat -Wformat-security -Wshadow -Wcomments -Wtrigraphs -Wundef -Wuninitialized -Winit-self -Wmaybe-uninitialized -O2 -fwrapv -pipe -Wformat -Werror=format-security -gdwarf-4 -fno-debug-types-section -fvar-tracking-assignments -g2 -Wp,-D_FORTIFY_SOURCE=2 -fstack-protector-strong --param=ssp-buffer-size=4 -Werror=trampolines -fPIC -mtune=generic -march=x86-64 -gdwarf-4 -fno-debug-types-section -fvar-tracking-assignments -g2  -DNDEBUG -DQT_NO_DEBUG   -o CMakeFiles/kdb-objects.dir/convert.cpp.o -c /tmp/B.crNwZC/BUILD/elektra-0.8.23/src/tools/kdb/convert.cpp
make[2]: Leaving directory '/tmp/B.crNwZC/BUILD/elektra-0.8.23/build'
make[2]: Entering directory '/tmp/B.crNwZC/BUILD/elektra-0.8.23/build'
[  8%] Building C object src/libs/elektra/CMakeFiles/elektra-core.dir/internal.c.o
cd /tmp/B.crNwZC/BUILD/elektra-0.8.23/build/src/libs/elektra && /usr/bin/x86_64-pld-linux-gnux32-gcc -DHAVE_KDBCONFIG_H -Delektra_core_EXPORTS -I/tmp/B.crNwZC/BUILD/elektra-0.8.23/build/src/include -I/tmp/B.crNwZC/BUILD/elektra-0.8.23/src/include -I/tmp/B.crNwZC/BUILD/elektra-0.8.23/build/src/libs/elektra  -std=gnu99  -Wno-deprecated-declarations  -Wstrict-prototypes  -Wno-long-long -pedantic -Wno-variadic-macros -Wall -Wextra -Wno-overlength-strings -Wsign-compare -Wfloat-equal -Wformat -Wformat-security -Wshadow -Wcomments -Wtrigraphs -Wundef -Wuninitialized -Winit-self -Wmaybe-uninitialized -Wsign-compare -Wfloat-equal -O2 -fwrapv -pipe -Wformat -Werror=format-security -gdwarf-4 -fno-debug-types-section -fvar-tracking-assignments -g2 -Wp,-D_FORTIFY_SOURCE=2 -fstack-protector-strong --param=ssp-buffer-size=4 -Werror=trampolines -fPIC -mtune=generic -march=x86-64 -gdwarf-4 -fno-debug-types-section -fvar-tracking-assignments -g2  -DNDEBUG -DQT_NO_DEBUG -fPIC   -o CMakeFiles/elektra-core.dir/internal.c.o   -c /tmp/B.crNwZC/BUILD/elektra-0.8.23/src/libs/elektra/internal.c
make[2]: Leaving directory '/tmp/B.crNwZC/BUILD/elektra-0.8.23/build'
make[2]: Entering directory '/tmp/B.crNwZC/BUILD/elektra-0.8.23/build'
[  8%] Building C object src/libs/elektra/CMakeFiles/elektra-core.dir/key.c.o
cd /tmp/B.crNwZC/BUILD/elektra-0.8.23/build/src/libs/elektra && /usr/bin/x86_64-pld-linux-gnux32-gcc -DHAVE_KDBCONFIG_H -Delektra_core_EXPORTS -I/tmp/B.crNwZC/BUILD/elektra-0.8.23/build/src/include -I/tmp/B.crNwZC/BUILD/elektra-0.8.23/src/include -I/tmp/B.crNwZC/BUILD/elektra-0.8.23/build/src/libs/elektra  -std=gnu99  -Wno-deprecated-declarations  -Wstrict-prototypes  -Wno-long-long -pedantic -Wno-variadic-macros -Wall -Wextra -Wno-overlength-strings -Wsign-compare -Wfloat-equal -Wformat -Wformat-security -Wshadow -Wcomments -Wtrigraphs -Wundef -Wuninitialized -Winit-self -Wmaybe-uninitialized -Wsign-compare -Wfloat-equal -O2 -fwrapv -pipe -Wformat -Werror=format-security -gdwarf-4 -fno-debug-types-section -fvar-tracking-assignments -g2 -Wp,-D_FORTIFY_SOURCE=2 -fstack-protector-strong --param=ssp-buffer-size=4 -Werror=trampolines -fPIC -mtune=generic -march=x86-64 -gdwarf-4 -fno-debug-types-section -fvar-tracking-assignments -g2  -DNDEBUG -DQT_NO_DEBUG -fPIC   -o CMakeFiles/elektra-core.dir/key.c.o   -c /tmp/B.crNwZC/BUILD/elektra-0.8.23/src/libs/elektra/key.c
make[2]: Leaving directory '/tmp/B.crNwZC/BUILD/elektra-0.8.23/build'
make[2]: Entering directory '/tmp/B.crNwZC/BUILD/elektra-0.8.23/build'
[  8%] Building C object src/plugins/augeas/CMakeFiles/elektra-augeas-objects.dir/augeas.c.o
cd /tmp/B.crNwZC/BUILD/elektra-0.8.23/build/src/plugins/augeas && /usr/bin/x86_64-pld-linux-gnux32-gcc -DELEKTRA_STATIC -DHAVE_KDBCONFIG_H -DLIBAUGEAS_PREFIX=\"/usr\" -DPLUGIN_SHORT_NAME=augeas -DREADME=readme_augeas.c -I/tmp/B.crNwZC/BUILD/elektra-0.8.23/build/src/include -I/tmp/B.crNwZC/BUILD/elektra-0.8.23/src/include -I/usr/include/libxml2 -I/tmp/B.crNwZC/BUILD/elektra-0.8.23/build/src/plugins/augeas  -std=gnu99  -Wno-deprecated-declarations  -Wstrict-prototypes  -Wno-long-long -pedantic -Wno-variadic-macros -Wall -Wextra -Wno-overlength-strings -Wsign-compare -Wfloat-equal -Wformat -Wformat-security -Wshadow -Wcomments -Wtrigraphs -Wundef -Wuninitialized -Winit-self -Wmaybe-uninitialized -Wsign-compare -Wfloat-equal -O2 -fwrapv -pipe -Wformat -Werror=format-security -gdwarf-4 -fno-debug-types-section -fvar-tracking-assignments -g2 -Wp,-D_FORTIFY_SOURCE=2 -fstack-protector-strong --param=ssp-buffer-size=4 -Werror=trampolines -fPIC -mtune=generic -march=x86-64 -gdwarf-4 -fno-debug-types-section -fvar-tracking-assignments -g2  -DNDEBUG -DQT_NO_DEBUG   -fPIC -o CMakeFiles/elektra-augeas-objects.dir/augeas.c.o   -c /tmp/B.crNwZC/BUILD/elektra-0.8.23/src/plugins/augeas/augeas.c
make[2]: Leaving directory '/tmp/B.crNwZC/BUILD/elektra-0.8.23/build'
make[1]: Entering directory '/tmp/B.crNwZC/BUILD/elektra-0.8.23/build'
[  8%] Built target elektra-augeas-objects
make[1]: Leaving directory '/tmp/B.crNwZC/BUILD/elektra-0.8.23/build'
/usr/bin/make  -f src/plugins/base64/CMakeFiles/elektra-base64-objects.dir/build.make src/plugins/base64/CMakeFiles/elektra-base64-objects.dir/depend
make[2]: Entering directory '/tmp/B.crNwZC/BUILD/elektra-0.8.23/build'
[  8%] Building C object src/libs/elektra/CMakeFiles/elektra-core.dir/keymeta.c.o
cd /tmp/B.crNwZC/BUILD/elektra-0.8.23/build/src/libs/elektra && /usr/bin/x86_64-pld-linux-gnux32-gcc -DHAVE_KDBCONFIG_H -Delektra_core_EXPORTS -I/tmp/B.crNwZC/BUILD/elektra-0.8.23/build/src/include -I/tmp/B.crNwZC/BUILD/elektra-0.8.23/src/include -I/tmp/B.crNwZC/BUILD/elektra-0.8.23/build/src/libs/elektra  -std=gnu99  -Wno-deprecated-declarations  -Wstrict-prototypes  -Wno-long-long -pedantic -Wno-variadic-macros -Wall -Wextra -Wno-overlength-strings -Wsign-compare -Wfloat-equal -Wformat -Wformat-security -Wshadow -Wcomments -Wtrigraphs -Wundef -Wuninitialized -Winit-self -Wmaybe-uninitialized -Wsign-compare -Wfloat-equal -O2 -fwrapv -pipe -Wformat -Werror=format-security -gdwarf-4 -fno-debug-types-section -fvar-tracking-assignments -g2 -Wp,-D_FORTIFY_SOURCE=2 -fstack-protector-strong --param=ssp-buffer-size=4 -Werror=trampolines -fPIC -mtune=generic -march=x86-64 -gdwarf-4 -fno-debug-types-section -fvar-tracking-assignments -g2  -DNDEBUG -DQT_NO_DEBUG -fPIC   -o CMakeFiles/elektra-core.dir/keymeta.c.o   -c /tmp/B.crNwZC/BUILD/elektra-0.8.23/src/libs/elektra/keymeta.c
make[2]: Leaving directory '/tmp/B.crNwZC/BUILD/elektra-0.8.23/build'
make[2]: Entering directory '/tmp/B.crNwZC/BUILD/elektra-0.8.23/build'
cd /tmp/B.crNwZC/BUILD/elektra-0.8.23/build && /usr/bin/cmake -E cmake_depends "Unix Makefiles" /tmp/B.crNwZC/BUILD/elektra-0.8.23 /tmp/B.crNwZC/BUILD/elektra-0.8.23/src/plugins/base64 /tmp/B.crNwZC/BUILD/elektra-0.8.23/build /tmp/B.crNwZC/BUILD/elektra-0.8.23/build/src/plugins/base64 /tmp/B.crNwZC/BUILD/elektra-0.8.23/build/src/plugins/base64/CMakeFiles/elektra-base64-objects.dir/DependInfo.cmake --color=
Scanning dependencies of target elektra-base64-objects
make[2]: Leaving directory '/tmp/B.crNwZC/BUILD/elektra-0.8.23/build'
/usr/bin/make  -f src/plugins/base64/CMakeFiles/elektra-base64-objects.dir/build.make src/plugins/base64/CMakeFiles/elektra-base64-objects.dir/build
make[2]: Entering directory '/tmp/B.crNwZC/BUILD/elektra-0.8.23/build'
[  8%] Building C object src/libs/elektra/CMakeFiles/elektra-core.dir/keyhelpers.c.o
cd /tmp/B.crNwZC/BUILD/elektra-0.8.23/build/src/libs/elektra && /usr/bin/x86_64-pld-linux-gnux32-gcc -DHAVE_KDBCONFIG_H -Delektra_core_EXPORTS -I/tmp/B.crNwZC/BUILD/elektra-0.8.23/build/src/include -I/tmp/B.crNwZC/BUILD/elektra-0.8.23/src/include -I/tmp/B.crNwZC/BUILD/elektra-0.8.23/build/src/libs/elektra  -std=gnu99  -Wno-deprecated-declarations  -Wstrict-prototypes  -Wno-long-long -pedantic -Wno-variadic-macros -Wall -Wextra -Wno-overlength-strings -Wsign-compare -Wfloat-equal -Wformat -Wformat-security -Wshadow -Wcomments -Wtrigraphs -Wundef -Wuninitialized -Winit-self -Wmaybe-uninitialized -Wsign-compare -Wfloat-equal -O2 -fwrapv -pipe -Wformat -Werror=format-security -gdwarf-4 -fno-debug-types-section -fvar-tracking-assignments -g2 -Wp,-D_FORTIFY_SOURCE=2 -fstack-protector-strong --param=ssp-buffer-size=4 -Werror=trampolines -fPIC -mtune=generic -march=x86-64 -gdwarf-4 -fno-debug-types-section -fvar-tracking-assignments -g2  -DNDEBUG -DQT_NO_DEBUG -fPIC   -o CMakeFiles/elektra-core.dir/keyhelpers.c.o   -c /tmp/B.crNwZC/BUILD/elektra-0.8.23/src/libs/elektra/keyhelpers.c
make[2]: Leaving directory '/tmp/B.crNwZC/BUILD/elektra-0.8.23/build'
make[2]: Entering directory '/tmp/B.crNwZC/BUILD/elektra-0.8.23/build'
[  8%] Building CXX object src/tools/kdb/CMakeFiles/kdb-objects.dir/cp.cpp.o
cd /tmp/B.crNwZC/BUILD/elektra-0.8.23/build/src/tools/kdb && /usr/bin/x86_64-pld-linux-gnux32-g++   -I/tmp/B.crNwZC/BUILD/elektra-0.8.23/build/src/include -I/tmp/B.crNwZC/BUILD/elektra-0.8.23/src/include -I/tmp/B.crNwZC/BUILD/elektra-0.8.23/build/src/bindings/cpp/include -I/tmp/B.crNwZC/BUILD/elektra-0.8.23/src/bindings/cpp/include -I/tmp/B.crNwZC/BUILD/elektra-0.8.23/build/src/libs/tools/include -I/tmp/B.crNwZC/BUILD/elektra-0.8.23/src/libs/tools/include -I/tmp/B.crNwZC/BUILD/elektra-0.8.23/src/tools/kdb  -std=c++11  -Wno-deprecated-declarations  -Wold-style-cast -Wstrict-null-sentinel -D_GLIBCXX_USE_NANOSLEEP -Wno-missing-field-initializers -Woverloaded-virtual  -Wsign-promo  -Wno-long-long -pedantic -Wno-variadic-macros -Wall -Wextra -Wno-overlength-strings -Wsign-compare -Wfloat-equal -Wformat -Wformat-security -Wshadow -Wcomments -Wtrigraphs -Wundef -Wuninitialized -Winit-self -Wmaybe-uninitialized -O2 -fwrapv -pipe -Wformat -Werror=format-security -gdwarf-4 -fno-debug-types-section -fvar-tracking-assignments -g2 -Wp,-D_FORTIFY_SOURCE=2 -fstack-protector-strong --param=ssp-buffer-size=4 -Werror=trampolines -fPIC -mtune=generic -march=x86-64 -gdwarf-4 -fno-debug-types-section -fvar-tracking-assignments -g2  -DNDEBUG -DQT_NO_DEBUG   -o CMakeFiles/kdb-objects.dir/cp.cpp.o -c /tmp/B.crNwZC/BUILD/elektra-0.8.23/src/tools/kdb/cp.cpp
make[2]: Leaving directory '/tmp/B.crNwZC/BUILD/elektra-0.8.23/build'
make[2]: Entering directory '/tmp/B.crNwZC/BUILD/elektra-0.8.23/build'
[  8%] Building C object src/libs/elektra/CMakeFiles/elektra-core.dir/keyname.c.o
cd /tmp/B.crNwZC/BUILD/elektra-0.8.23/build/src/libs/elektra && /usr/bin/x86_64-pld-linux-gnux32-gcc -DHAVE_KDBCONFIG_H -Delektra_core_EXPORTS -I/tmp/B.crNwZC/BUILD/elektra-0.8.23/build/src/include -I/tmp/B.crNwZC/BUILD/elektra-0.8.23/src/include -I/tmp/B.crNwZC/BUILD/elektra-0.8.23/build/src/libs/elektra  -std=gnu99  -Wno-deprecated-declarations  -Wstrict-prototypes  -Wno-long-long -pedantic -Wno-variadic-macros -Wall -Wextra -Wno-overlength-strings -Wsign-compare -Wfloat-equal -Wformat -Wformat-security -Wshadow -Wcomments -Wtrigraphs -Wundef -Wuninitialized -Winit-self -Wmaybe-uninitialized -Wsign-compare -Wfloat-equal -O2 -fwrapv -pipe -Wformat -Werror=format-security -gdwarf-4 -fno-debug-types-section -fvar-tracking-assignments -g2 -Wp,-D_FORTIFY_SOURCE=2 -fstack-protector-strong --param=ssp-buffer-size=4 -Werror=trampolines -fPIC -mtune=generic -march=x86-64 -gdwarf-4 -fno-debug-types-section -fvar-tracking-assignments -g2  -DNDEBUG -DQT_NO_DEBUG -fPIC   -o CMakeFiles/elektra-core.dir/keyname.c.o   -c /tmp/B.crNwZC/BUILD/elektra-0.8.23/src/libs/elektra/keyname.c
make[2]: Leaving directory '/tmp/B.crNwZC/BUILD/elektra-0.8.23/build'
make[2]: Entering directory '/tmp/B.crNwZC/BUILD/elektra-0.8.23/build'
[  8%] Building CXX object src/tools/kdb/CMakeFiles/kdb-objects.dir/editor.cpp.o
cd /tmp/B.crNwZC/BUILD/elektra-0.8.23/build/src/tools/kdb && /usr/bin/x86_64-pld-linux-gnux32-g++   -I/tmp/B.crNwZC/BUILD/elektra-0.8.23/build/src/include -I/tmp/B.crNwZC/BUILD/elektra-0.8.23/src/include -I/tmp/B.crNwZC/BUILD/elektra-0.8.23/build/src/bindings/cpp/include -I/tmp/B.crNwZC/BUILD/elektra-0.8.23/src/bindings/cpp/include -I/tmp/B.crNwZC/BUILD/elektra-0.8.23/build/src/libs/tools/include -I/tmp/B.crNwZC/BUILD/elektra-0.8.23/src/libs/tools/include -I/tmp/B.crNwZC/BUILD/elektra-0.8.23/src/tools/kdb  -std=c++11  -Wno-deprecated-declarations  -Wold-style-cast -Wstrict-null-sentinel -D_GLIBCXX_USE_NANOSLEEP -Wno-missing-field-initializers -Woverloaded-virtual  -Wsign-promo  -Wno-long-long -pedantic -Wno-variadic-macros -Wall -Wextra -Wno-overlength-strings -Wsign-compare -Wfloat-equal -Wformat -Wformat-security -Wshadow -Wcomments -Wtrigraphs -Wundef -Wuninitialized -Winit-self -Wmaybe-uninitialized -O2 -fwrapv -pipe -Wformat -Werror=format-security -gdwarf-4 -fno-debug-types-section -fvar-tracking-assignments -g2 -Wp,-D_FORTIFY_SOURCE=2 -fstack-protector-strong --param=ssp-buffer-size=4 -Werror=trampolines -fPIC -mtune=generic -march=x86-64 -gdwarf-4 -fno-debug-types-section -fvar-tracking-assignments -g2  -DNDEBUG -DQT_NO_DEBUG   -o CMakeFiles/kdb-objects.dir/editor.cpp.o -c /tmp/B.crNwZC/BUILD/elektra-0.8.23/src/tools/kdb/editor.cpp
make[2]: Leaving directory '/tmp/B.crNwZC/BUILD/elektra-0.8.23/build'
make[2]: Entering directory '/tmp/B.crNwZC/BUILD/elektra-0.8.23/build'
[  9%] Building C object src/plugins/base64/CMakeFiles/elektra-base64-objects.dir/base64_functions.c.o
cd /tmp/B.crNwZC/BUILD/elektra-0.8.23/build/src/plugins/base64 && /usr/bin/x86_64-pld-linux-gnux32-gcc -DELEKTRA_PLUGIN_NAME=\"base64\" -DELEKTRA_PLUGIN_NAME_C=base64 -DELEKTRA_STATIC -DHAVE_KDBCONFIG_H -DPLUGIN_SHORT_NAME=base64 -DREADME=readme_base64.c -I/tmp/B.crNwZC/BUILD/elektra-0.8.23/build/src/include -I/tmp/B.crNwZC/BUILD/elektra-0.8.23/src/include -I/tmp/B.crNwZC/BUILD/elektra-0.8.23/build/src/plugins/base64  -std=gnu99  -Wno-deprecated-declarations  -Wstrict-prototypes  -Wno-long-long -pedantic -Wno-variadic-macros -Wall -Wextra -Wno-overlength-strings -Wsign-compare -Wfloat-equal -Wformat -Wformat-security -Wshadow -Wcomments -Wtrigraphs -Wundef -Wuninitialized -Winit-self -Wmaybe-uninitialized -Wsign-compare -Wfloat-equal -O2 -fwrapv -pipe -Wformat -Werror=format-security -gdwarf-4 -fno-debug-types-section -fvar-tracking-assignments -g2 -Wp,-D_FORTIFY_SOURCE=2 -fstack-protector-strong --param=ssp-buffer-size=4 -Werror=trampolines -fPIC -mtune=generic -march=x86-64 -gdwarf-4 -fno-debug-types-section -fvar-tracking-assignments -g2  -DNDEBUG -DQT_NO_DEBUG   -fPIC -o CMakeFiles/elektra-base64-objects.dir/base64_functions.c.o   -c /tmp/B.crNwZC/BUILD/elektra-0.8.23/src/plugins/base64/base64_functions.c
make[2]: Leaving directory '/tmp/B.crNwZC/BUILD/elektra-0.8.23/build'
make[2]: Entering directory '/tmp/B.crNwZC/BUILD/elektra-0.8.23/build'
[  9%] Building C object src/libs/elektra/CMakeFiles/elektra-core.dir/keytest.c.o
cd /tmp/B.crNwZC/BUILD/elektra-0.8.23/build/src/libs/elektra && /usr/bin/x86_64-pld-linux-gnux32-gcc -DHAVE_KDBCONFIG_H -Delektra_core_EXPORTS -I/tmp/B.crNwZC/BUILD/elektra-0.8.23/build/src/include -I/tmp/B.crNwZC/BUILD/elektra-0.8.23/src/include -I/tmp/B.crNwZC/BUILD/elektra-0.8.23/build/src/libs/elektra  -std=gnu99  -Wno-deprecated-declarations  -Wstrict-prototypes  -Wno-long-long -pedantic -Wno-variadic-macros -Wall -Wextra -Wno-overlength-strings -Wsign-compare -Wfloat-equal -Wformat -Wformat-security -Wshadow -Wcomments -Wtrigraphs -Wundef -Wuninitialized -Winit-self -Wmaybe-uninitialized -Wsign-compare -Wfloat-equal -O2 -fwrapv -pipe -Wformat -Werror=format-security -gdwarf-4 -fno-debug-types-section -fvar-tracking-assignments -g2 -Wp,-D_FORTIFY_SOURCE=2 -fstack-protector-strong --param=ssp-buffer-size=4 -Werror=trampolines -fPIC -mtune=generic -march=x86-64 -gdwarf-4 -fno-debug-types-section -fvar-tracking-assignments -g2  -DNDEBUG -DQT_NO_DEBUG -fPIC   -o CMakeFiles/elektra-core.dir/keytest.c.o   -c /tmp/B.crNwZC/BUILD/elektra-0.8.23/src/libs/elektra/keytest.c
make[2]: Leaving directory '/tmp/B.crNwZC/BUILD/elektra-0.8.23/build'
make[2]: Entering directory '/tmp/B.crNwZC/BUILD/elektra-0.8.23/build'
[ 10%] Building C object src/libs/elektra/CMakeFiles/elektra-core.dir/nolog.c.o
cd /tmp/B.crNwZC/BUILD/elektra-0.8.23/build/src/libs/elektra && /usr/bin/x86_64-pld-linux-gnux32-gcc -DHAVE_KDBCONFIG_H -Delektra_core_EXPORTS -I/tmp/B.crNwZC/BUILD/elektra-0.8.23/build/src/include -I/tmp/B.crNwZC/BUILD/elektra-0.8.23/src/include -I/tmp/B.crNwZC/BUILD/elektra-0.8.23/build/src/libs/elektra  -std=gnu99  -Wno-deprecated-declarations  -Wstrict-prototypes  -Wno-long-long -pedantic -Wno-variadic-macros -Wall -Wextra -Wno-overlength-strings -Wsign-compare -Wfloat-equal -Wformat -Wformat-security -Wshadow -Wcomments -Wtrigraphs -Wundef -Wuninitialized -Winit-self -Wmaybe-uninitialized -Wsign-compare -Wfloat-equal -O2 -fwrapv -pipe -Wformat -Werror=format-security -gdwarf-4 -fno-debug-types-section -fvar-tracking-assignments -g2 -Wp,-D_FORTIFY_SOURCE=2 -fstack-protector-strong --param=ssp-buffer-size=4 -Werror=trampolines -fPIC -mtune=generic -march=x86-64 -gdwarf-4 -fno-debug-types-section -fvar-tracking-assignments -g2  -DNDEBUG -DQT_NO_DEBUG -fPIC   -o CMakeFiles/elektra-core.dir/nolog.c.o   -c /tmp/B.crNwZC/BUILD/elektra-0.8.23/src/libs/elektra/nolog.c
make[2]: Leaving directory '/tmp/B.crNwZC/BUILD/elektra-0.8.23/build'
make[2]: Entering directory '/tmp/B.crNwZC/BUILD/elektra-0.8.23/build'
[ 10%] Building C object src/libs/elektra/CMakeFiles/elektra-core.dir/keyvalue.c.o
cd /tmp/B.crNwZC/BUILD/elektra-0.8.23/build/src/libs/elektra && /usr/bin/x86_64-pld-linux-gnux32-gcc -DHAVE_KDBCONFIG_H -Delektra_core_EXPORTS -I/tmp/B.crNwZC/BUILD/elektra-0.8.23/build/src/include -I/tmp/B.crNwZC/BUILD/elektra-0.8.23/src/include -I/tmp/B.crNwZC/BUILD/elektra-0.8.23/build/src/libs/elektra  -std=gnu99  -Wno-deprecated-declarations  -Wstrict-prototypes  -Wno-long-long -pedantic -Wno-variadic-macros -Wall -Wextra -Wno-overlength-strings -Wsign-compare -Wfloat-equal -Wformat -Wformat-security -Wshadow -Wcomments -Wtrigraphs -Wundef -Wuninitialized -Winit-self -Wmaybe-uninitialized -Wsign-compare -Wfloat-equal -O2 -fwrapv -pipe -Wformat -Werror=format-security -gdwarf-4 -fno-debug-types-section -fvar-tracking-assignments -g2 -Wp,-D_FORTIFY_SOURCE=2 -fstack-protector-strong --param=ssp-buffer-size=4 -Werror=trampolines -fPIC -mtune=generic -march=x86-64 -gdwarf-4 -fno-debug-types-section -fvar-tracking-assignments -g2  -DNDEBUG -DQT_NO_DEBUG -fPIC   -o CMakeFiles/elektra-core.dir/keyvalue.c.o   -c /tmp/B.crNwZC/BUILD/elektra-0.8.23/src/libs/elektra/keyvalue.c
make[2]: Leaving directory '/tmp/B.crNwZC/BUILD/elektra-0.8.23/build'
make[2]: Entering directory '/tmp/B.crNwZC/BUILD/elektra-0.8.23/build'
[ 10%] Building C object src/libs/elektra/CMakeFiles/elektra-core.dir/owner.c.o
cd /tmp/B.crNwZC/BUILD/elektra-0.8.23/build/src/libs/elektra && /usr/bin/x86_64-pld-linux-gnux32-gcc -DHAVE_KDBCONFIG_H -Delektra_core_EXPORTS -I/tmp/B.crNwZC/BUILD/elektra-0.8.23/build/src/include -I/tmp/B.crNwZC/BUILD/elektra-0.8.23/src/include -I/tmp/B.crNwZC/BUILD/elektra-0.8.23/build/src/libs/elektra  -std=gnu99  -Wno-deprecated-declarations  -Wstrict-prototypes  -Wno-long-long -pedantic -Wno-variadic-macros -Wall -Wextra -Wno-overlength-strings -Wsign-compare -Wfloat-equal -Wformat -Wformat-security -Wshadow -Wcomments -Wtrigraphs -Wundef -Wuninitialized -Winit-self -Wmaybe-uninitialized -Wsign-compare -Wfloat-equal -O2 -fwrapv -pipe -Wformat -Werror=format-security -gdwarf-4 -fno-debug-types-section -fvar-tracking-assignments -g2 -Wp,-D_FORTIFY_SOURCE=2 -fstack-protector-strong --param=ssp-buffer-size=4 -Werror=trampolines -fPIC -mtune=generic -march=x86-64 -gdwarf-4 -fno-debug-types-section -fvar-tracking-assignments -g2  -DNDEBUG -DQT_NO_DEBUG -fPIC   -o CMakeFiles/elektra-core.dir/owner.c.o   -c /tmp/B.crNwZC/BUILD/elektra-0.8.23/src/libs/elektra/owner.c
make[2]: Leaving directory '/tmp/B.crNwZC/BUILD/elektra-0.8.23/build'
make[2]: Entering directory '/tmp/B.crNwZC/BUILD/elektra-0.8.23/build'
[ 10%] Building C object src/libs/elektra/CMakeFiles/elektra-core.dir/rand.c.o
cd /tmp/B.crNwZC/BUILD/elektra-0.8.23/build/src/libs/elektra && /usr/bin/x86_64-pld-linux-gnux32-gcc -DHAVE_KDBCONFIG_H -Delektra_core_EXPORTS -I/tmp/B.crNwZC/BUILD/elektra-0.8.23/build/src/include -I/tmp/B.crNwZC/BUILD/elektra-0.8.23/src/include -I/tmp/B.crNwZC/BUILD/elektra-0.8.23/build/src/libs/elektra  -std=gnu99  -Wno-deprecated-declarations  -Wstrict-prototypes  -Wno-long-long -pedantic -Wno-variadic-macros -Wall -Wextra -Wno-overlength-strings -Wsign-compare -Wfloat-equal -Wformat -Wformat-security -Wshadow -Wcomments -Wtrigraphs -Wundef -Wuninitialized -Winit-self -Wmaybe-uninitialized -Wsign-compare -Wfloat-equal -O2 -fwrapv -pipe -Wformat -Werror=format-security -gdwarf-4 -fno-debug-types-section -fvar-tracking-assignments -g2 -Wp,-D_FORTIFY_SOURCE=2 -fstack-protector-strong --param=ssp-buffer-size=4 -Werror=trampolines -fPIC -mtune=generic -march=x86-64 -gdwarf-4 -fno-debug-types-section -fvar-tracking-assignments -g2  -DNDEBUG -DQT_NO_DEBUG -fPIC   -o CMakeFiles/elektra-core.dir/rand.c.o   -c /tmp/B.crNwZC/BUILD/elektra-0.8.23/src/libs/elektra/rand.c
make[2]: Leaving directory '/tmp/B.crNwZC/BUILD/elektra-0.8.23/build'
/usr/bin/make  -f src/libs/elektra/CMakeFiles/elektra.dir/build.make src/libs/elektra/CMakeFiles/elektra.dir/depend
make[2]: Entering directory '/tmp/B.crNwZC/BUILD/elektra-0.8.23/build'
[ 10%] Building C object src/libs/elektra/CMakeFiles/elektra-core.dir/proposal.c.o
cd /tmp/B.crNwZC/BUILD/elektra-0.8.23/build/src/libs/elektra && /usr/bin/x86_64-pld-linux-gnux32-gcc -DHAVE_KDBCONFIG_H -Delektra_core_EXPORTS -I/tmp/B.crNwZC/BUILD/elektra-0.8.23/build/src/include -I/tmp/B.crNwZC/BUILD/elektra-0.8.23/src/include -I/tmp/B.crNwZC/BUILD/elektra-0.8.23/build/src/libs/elektra  -std=gnu99  -Wno-deprecated-declarations  -Wstrict-prototypes  -Wno-long-long -pedantic -Wno-variadic-macros -Wall -Wextra -Wno-overlength-strings -Wsign-compare -Wfloat-equal -Wformat -Wformat-security -Wshadow -Wcomments -Wtrigraphs -Wundef -Wuninitialized -Winit-self -Wmaybe-uninitialized -Wsign-compare -Wfloat-equal -O2 -fwrapv -pipe -Wformat -Werror=format-security -gdwarf-4 -fno-debug-types-section -fvar-tracking-assignments -g2 -Wp,-D_FORTIFY_SOURCE=2 -fstack-protector-strong --param=ssp-buffer-size=4 -Werror=trampolines -fPIC -mtune=generic -march=x86-64 -gdwarf-4 -fno-debug-types-section -fvar-tracking-assignments -g2  -DNDEBUG -DQT_NO_DEBUG -fPIC   -o CMakeFiles/elektra-core.dir/proposal.c.o   -c /tmp/B.crNwZC/BUILD/elektra-0.8.23/src/libs/elektra/proposal.c
make[2]: Leaving directory '/tmp/B.crNwZC/BUILD/elektra-0.8.23/build'
/usr/bin/make  -f src/plugins/blockresolver/CMakeFiles/elektra-blockresolver-objects.dir/build.make src/plugins/blockresolver/CMakeFiles/elektra-blockresolver-objects.dir/depend
make[2]: Entering directory '/tmp/B.crNwZC/BUILD/elektra-0.8.23/build'
cd /tmp/B.crNwZC/BUILD/elektra-0.8.23/build && /usr/bin/cmake -E cmake_depends "Unix Makefiles" /tmp/B.crNwZC/BUILD/elektra-0.8.23 /tmp/B.crNwZC/BUILD/elektra-0.8.23/src/libs/elektra /tmp/B.crNwZC/BUILD/elektra-0.8.23/build /tmp/B.crNwZC/BUILD/elektra-0.8.23/build/src/libs/elektra /tmp/B.crNwZC/BUILD/elektra-0.8.23/build/src/libs/elektra/CMakeFiles/elektra.dir/DependInfo.cmake --color=
Scanning dependencies of target elektra
make[2]: Leaving directory '/tmp/B.crNwZC/BUILD/elektra-0.8.23/build'
/usr/bin/make  -f src/libs/elektra/CMakeFiles/elektra.dir/build.make src/libs/elektra/CMakeFiles/elektra.dir/build
make[2]: Entering directory '/tmp/B.crNwZC/BUILD/elektra-0.8.23/build'
cd /tmp/B.crNwZC/BUILD/elektra-0.8.23/build && /usr/bin/cmake -E cmake_depends "Unix Makefiles" /tmp/B.crNwZC/BUILD/elektra-0.8.23 /tmp/B.crNwZC/BUILD/elektra-0.8.23/src/plugins/blockresolver /tmp/B.crNwZC/BUILD/elektra-0.8.23/build /tmp/B.crNwZC/BUILD/elektra-0.8.23/build/src/plugins/blockresolver /tmp/B.crNwZC/BUILD/elektra-0.8.23/build/src/plugins/blockresolver/CMakeFiles/elektra-blockresolver-objects.dir/DependInfo.cmake --color=
Scanning dependencies of target elektra-blockresolver-objects
make[2]: Leaving directory '/tmp/B.crNwZC/BUILD/elektra-0.8.23/build'
/usr/bin/make  -f src/plugins/blockresolver/CMakeFiles/elektra-blockresolver-objects.dir/build.make src/plugins/blockresolver/CMakeFiles/elektra-blockresolver-objects.dir/build
make[2]: Entering directory '/tmp/B.crNwZC/BUILD/elektra-0.8.23/build'
[ 10%] Building C object src/libs/elektra/CMakeFiles/elektra-core.dir/opmphm.c.o
cd /tmp/B.crNwZC/BUILD/elektra-0.8.23/build/src/libs/elektra && /usr/bin/x86_64-pld-linux-gnux32-gcc -DHAVE_KDBCONFIG_H -Delektra_core_EXPORTS -I/tmp/B.crNwZC/BUILD/elektra-0.8.23/build/src/include -I/tmp/B.crNwZC/BUILD/elektra-0.8.23/src/include -I/tmp/B.crNwZC/BUILD/elektra-0.8.23/build/src/libs/elektra  -std=gnu99  -Wno-deprecated-declarations  -Wstrict-prototypes  -Wno-long-long -pedantic -Wno-variadic-macros -Wall -Wextra -Wno-overlength-strings -Wsign-compare -Wfloat-equal -Wformat -Wformat-security -Wshadow -Wcomments -Wtrigraphs -Wundef -Wuninitialized -Winit-self -Wmaybe-uninitialized -Wsign-compare -Wfloat-equal -O2 -fwrapv -pipe -Wformat -Werror=format-security -gdwarf-4 -fno-debug-types-section -fvar-tracking-assignments -g2 -Wp,-D_FORTIFY_SOURCE=2 -fstack-protector-strong --param=ssp-buffer-size=4 -Werror=trampolines -fPIC -mtune=generic -march=x86-64 -gdwarf-4 -fno-debug-types-section -fvar-tracking-assignments -g2  -DNDEBUG -DQT_NO_DEBUG -fPIC   -o CMakeFiles/elektra-core.dir/opmphm.c.o   -c /tmp/B.crNwZC/BUILD/elektra-0.8.23/src/libs/elektra/opmphm.c
make[2]: Leaving directory '/tmp/B.crNwZC/BUILD/elektra-0.8.23/build'
make[2]: Entering directory '/tmp/B.crNwZC/BUILD/elektra-0.8.23/build'
[  8%] Building C object src/libs/elektra/CMakeFiles/elektra-core.dir/keyset.c.o
cd /tmp/B.crNwZC/BUILD/elektra-0.8.23/build/src/libs/elektra && /usr/bin/x86_64-pld-linux-gnux32-gcc -DHAVE_KDBCONFIG_H -Delektra_core_EXPORTS -I/tmp/B.crNwZC/BUILD/elektra-0.8.23/build/src/include -I/tmp/B.crNwZC/BUILD/elektra-0.8.23/src/include -I/tmp/B.crNwZC/BUILD/elektra-0.8.23/build/src/libs/elektra  -std=gnu99  -Wno-deprecated-declarations  -Wstrict-prototypes  -Wno-long-long -pedantic -Wno-variadic-macros -Wall -Wextra -Wno-overlength-strings -Wsign-compare -Wfloat-equal -Wformat -Wformat-security -Wshadow -Wcomments -Wtrigraphs -Wundef -Wuninitialized -Winit-self -Wmaybe-uninitialized -Wsign-compare -Wfloat-equal -O2 -fwrapv -pipe -Wformat -Werror=format-security -gdwarf-4 -fno-debug-types-section -fvar-tracking-assignments -g2 -Wp,-D_FORTIFY_SOURCE=2 -fstack-protector-strong --param=ssp-buffer-size=4 -Werror=trampolines -fPIC -mtune=generic -march=x86-64 -gdwarf-4 -fno-debug-types-section -fvar-tracking-assignments -g2  -DNDEBUG -DQT_NO_DEBUG -fPIC   -o CMakeFiles/elektra-core.dir/keyset.c.o   -c /tmp/B.crNwZC/BUILD/elektra-0.8.23/src/libs/elektra/keyset.c
In file included from /usr/include/string.h:519,
                 from /tmp/B.crNwZC/BUILD/elektra-0.8.23/src/libs/elektra/keyset.c:26:
In function 'strncpy',
    inlined from 'elektraLookupByCascading' at /tmp/B.crNwZC/BUILD/elektra-0.8.23/src/libs/elektra/keyset.c:1801:3:
/usr/include/bits/string_fortified.h:95:10: warning: '__builtin_strncpy' output truncated before terminating nul copying 4 bytes from a string of the same length [-Wstringop-truncation]
   95 |   return __builtin___strncpy_chk (__dest, __src, __len,
      |          ^~~~~~~~~~~~~~~~~~~~~~~~~~~~~~~~~~~~~~~~~~~~~~
   96 |                                   __glibc_objsize (__dest));
      |                                   ~~~~~~~~~~~~~~~~~~~~~~~~~
In function 'strncpy',
    inlined from 'elektraLookupByCascading' at /tmp/B.crNwZC/BUILD/elektra-0.8.23/src/libs/elektra/keyset.c:1832:2:
/usr/include/bits/string_fortified.h:95:10: warning: '__builtin_strncpy' output truncated before terminating nul copying 4 bytes from a string of the same length [-Wstringop-truncation]
   95 |   return __builtin___strncpy_chk (__dest, __src, __len,
      |          ^~~~~~~~~~~~~~~~~~~~~~~~~~~~~~~~~~~~~~~~~~~~~~
   96 |                                   __glibc_objsize (__dest));
      |                                   ~~~~~~~~~~~~~~~~~~~~~~~~~
In function 'strncpy',
    inlined from 'elektraLookupByCascading' at /tmp/B.crNwZC/BUILD/elektra-0.8.23/src/libs/elektra/keyset.c:1851:3:
/usr/include/bits/string_fortified.h:95:10: warning: '__builtin_strncpy' output truncated before terminating nul copying 4 bytes from a string of the same length [-Wstringop-truncation]
   95 |   return __builtin___strncpy_chk (__dest, __src, __len,
      |          ^~~~~~~~~~~~~~~~~~~~~~~~~~~~~~~~~~~~~~~~~~~~~~
   96 |                                   __glibc_objsize (__dest));
      |                                   ~~~~~~~~~~~~~~~~~~~~~~~~~
In function 'strncpy',
    inlined from 'elektraLookupByCascading' at /tmp/B.crNwZC/BUILD/elektra-0.8.23/src/libs/elektra/keyset.c:1841:3:
/usr/include/bits/string_fortified.h:95:10: warning: '__builtin_strncpy' output truncated before terminating nul copying 3 bytes from a string of the same length [-Wstringop-truncation]
   95 |   return __builtin___strncpy_chk (__dest, __src, __len,
      |          ^~~~~~~~~~~~~~~~~~~~~~~~~~~~~~~~~~~~~~~~~~~~~~
   96 |                                   __glibc_objsize (__dest));
      |                                   ~~~~~~~~~~~~~~~~~~~~~~~~~
In function 'strncpy',
    inlined from 'elektraLookupByCascading' at /tmp/B.crNwZC/BUILD/elektra-0.8.23/src/libs/elektra/keyset.c:1861:3:
/usr/include/bits/string_fortified.h:95:10: warning: '__builtin_strncpy' output truncated before terminating nul copying 6 bytes from a string of the same length [-Wstringop-truncation]
   95 |   return __builtin___strncpy_chk (__dest, __src, __len,
      |          ^~~~~~~~~~~~~~~~~~~~~~~~~~~~~~~~~~~~~~~~~~~~~~
   96 |                                   __glibc_objsize (__dest));
      |                                   ~~~~~~~~~~~~~~~~~~~~~~~~~
In function 'strncpy',
    inlined from 'ksCut' at /tmp/B.crNwZC/BUILD/elektra-0.8.23/src/libs/elektra/keyset.c:1089:5:
/usr/include/bits/string_fortified.h:95:10: warning: '__builtin_strncpy' output truncated before terminating nul copying 4 bytes from a string of the same length [-Wstringop-truncation]
   95 |   return __builtin___strncpy_chk (__dest, __src, __len,
      |          ^~~~~~~~~~~~~~~~~~~~~~~~~~~~~~~~~~~~~~~~~~~~~~
   96 |                                   __glibc_objsize (__dest));
      |                                   ~~~~~~~~~~~~~~~~~~~~~~~~~
In function 'strncpy',
    inlined from 'ksCut' at /tmp/B.crNwZC/BUILD/elektra-0.8.23/src/libs/elektra/keyset.c:1097:5:
/usr/include/bits/string_fortified.h:95:10: warning: '__builtin_strncpy' output truncated before terminating nul copying 4 bytes from a string of the same length [-Wstringop-truncation]
   95 |   return __builtin___strncpy_chk (__dest, __src, __len,
      |          ^~~~~~~~~~~~~~~~~~~~~~~~~~~~~~~~~~~~~~~~~~~~~~
   96 |                                   __glibc_objsize (__dest));
      |                                   ~~~~~~~~~~~~~~~~~~~~~~~~~
In function 'strncpy',
    inlined from 'ksCut' at /tmp/B.crNwZC/BUILD/elektra-0.8.23/src/libs/elektra/keyset.c:1105:5:
/usr/include/bits/string_fortified.h:95:10: warning: '__builtin_strncpy' output truncated before terminating nul copying 3 bytes from a string of the same length [-Wstringop-truncation]
   95 |   return __builtin___strncpy_chk (__dest, __src, __len,
      |          ^~~~~~~~~~~~~~~~~~~~~~~~~~~~~~~~~~~~~~~~~~~~~~
   96 |                                   __glibc_objsize (__dest));
      |                                   ~~~~~~~~~~~~~~~~~~~~~~~~~
In function 'strncpy',
    inlined from 'ksCut' at /tmp/B.crNwZC/BUILD/elektra-0.8.23/src/libs/elektra/keyset.c:1113:5:
/usr/include/bits/string_fortified.h:95:10: warning: '__builtin_strncpy' output truncated before terminating nul copying 4 bytes from a string of the same length [-Wstringop-truncation]
   95 |   return __builtin___strncpy_chk (__dest, __src, __len,
      |          ^~~~~~~~~~~~~~~~~~~~~~~~~~~~~~~~~~~~~~~~~~~~~~
   96 |                                   __glibc_objsize (__dest));
      |                                   ~~~~~~~~~~~~~~~~~~~~~~~~~
In function 'strncpy',
    inlined from 'ksCut' at /tmp/B.crNwZC/BUILD/elektra-0.8.23/src/libs/elektra/keyset.c:1121:5:
/usr/include/bits/string_fortified.h:95:10: warning: '__builtin_strncpy' output truncated before terminating nul copying 6 bytes from a string of the same length [-Wstringop-truncation]
   95 |   return __builtin___strncpy_chk (__dest, __src, __len,
      |          ^~~~~~~~~~~~~~~~~~~~~~~~~~~~~~~~~~~~~~~~~~~~~~
   96 |                                   __glibc_objsize (__dest));
      |                                   ~~~~~~~~~~~~~~~~~~~~~~~~~
make[2]: Leaving directory '/tmp/B.crNwZC/BUILD/elektra-0.8.23/build'
make[2]: Entering directory '/tmp/B.crNwZC/BUILD/elektra-0.8.23/build'
[ 10%] Building C object src/plugins/base64/CMakeFiles/elektra-base64-objects.dir/base64.c.o
cd /tmp/B.crNwZC/BUILD/elektra-0.8.23/build/src/plugins/base64 && /usr/bin/x86_64-pld-linux-gnux32-gcc -DELEKTRA_PLUGIN_NAME=\"base64\" -DELEKTRA_PLUGIN_NAME_C=base64 -DELEKTRA_STATIC -DHAVE_KDBCONFIG_H -DPLUGIN_SHORT_NAME=base64 -DREADME=readme_base64.c -I/tmp/B.crNwZC/BUILD/elektra-0.8.23/build/src/include -I/tmp/B.crNwZC/BUILD/elektra-0.8.23/src/include -I/tmp/B.crNwZC/BUILD/elektra-0.8.23/build/src/plugins/base64  -std=gnu99  -Wno-deprecated-declarations  -Wstrict-prototypes  -Wno-long-long -pedantic -Wno-variadic-macros -Wall -Wextra -Wno-overlength-strings -Wsign-compare -Wfloat-equal -Wformat -Wformat-security -Wshadow -Wcomments -Wtrigraphs -Wundef -Wuninitialized -Winit-self -Wmaybe-uninitialized -Wsign-compare -Wfloat-equal -O2 -fwrapv -pipe -Wformat -Werror=format-security -gdwarf-4 -fno-debug-types-section -fvar-tracking-assignments -g2 -Wp,-D_FORTIFY_SOURCE=2 -fstack-protector-strong --param=ssp-buffer-size=4 -Werror=trampolines -fPIC -mtune=generic -march=x86-64 -gdwarf-4 -fno-debug-types-section -fvar-tracking-assignments -g2  -DNDEBUG -DQT_NO_DEBUG   -fPIC -o CMakeFiles/elektra-base64-objects.dir/base64.c.o   -c /tmp/B.crNwZC/BUILD/elektra-0.8.23/src/plugins/base64/base64.c
make[2]: Leaving directory '/tmp/B.crNwZC/BUILD/elektra-0.8.23/build'
make[1]: Entering directory '/tmp/B.crNwZC/BUILD/elektra-0.8.23/build'
[ 10%] Built target elektra-base64-objects
make[1]: Leaving directory '/tmp/B.crNwZC/BUILD/elektra-0.8.23/build'
/usr/bin/make  -f src/plugins/boolean/CMakeFiles/elektra-boolean-objects.dir/build.make src/plugins/boolean/CMakeFiles/elektra-boolean-objects.dir/depend
make[2]: Entering directory '/tmp/B.crNwZC/BUILD/elektra-0.8.23/build'
cd /tmp/B.crNwZC/BUILD/elektra-0.8.23/build && /usr/bin/cmake -E cmake_depends "Unix Makefiles" /tmp/B.crNwZC/BUILD/elektra-0.8.23 /tmp/B.crNwZC/BUILD/elektra-0.8.23/src/plugins/boolean /tmp/B.crNwZC/BUILD/elektra-0.8.23/build /tmp/B.crNwZC/BUILD/elektra-0.8.23/build/src/plugins/boolean /tmp/B.crNwZC/BUILD/elektra-0.8.23/build/src/plugins/boolean/CMakeFiles/elektra-boolean-objects.dir/DependInfo.cmake --color=
Scanning dependencies of target elektra-boolean-objects
make[2]: Leaving directory '/tmp/B.crNwZC/BUILD/elektra-0.8.23/build'
/usr/bin/make  -f src/plugins/boolean/CMakeFiles/elektra-boolean-objects.dir/build.make src/plugins/boolean/CMakeFiles/elektra-boolean-objects.dir/build
make[2]: Entering directory '/tmp/B.crNwZC/BUILD/elektra-0.8.23/build'
[ 10%] Building C object src/libs/elektra/CMakeFiles/elektra-core.dir/__/loader/dl.c.o
cd /tmp/B.crNwZC/BUILD/elektra-0.8.23/build/src/libs/elektra && /usr/bin/x86_64-pld-linux-gnux32-gcc -DHAVE_KDBCONFIG_H -Delektra_core_EXPORTS -I/tmp/B.crNwZC/BUILD/elektra-0.8.23/build/src/include -I/tmp/B.crNwZC/BUILD/elektra-0.8.23/src/include -I/tmp/B.crNwZC/BUILD/elektra-0.8.23/build/src/libs/elektra  -std=gnu99  -Wno-deprecated-declarations  -Wstrict-prototypes  -Wno-long-long -pedantic -Wno-variadic-macros -Wall -Wextra -Wno-overlength-strings -Wsign-compare -Wfloat-equal -Wformat -Wformat-security -Wshadow -Wcomments -Wtrigraphs -Wundef -Wuninitialized -Winit-self -Wmaybe-uninitialized -Wsign-compare -Wfloat-equal -O2 -fwrapv -pipe -Wformat -Werror=format-security -gdwarf-4 -fno-debug-types-section -fvar-tracking-assignments -g2 -Wp,-D_FORTIFY_SOURCE=2 -fstack-protector-strong --param=ssp-buffer-size=4 -Werror=trampolines -fPIC -mtune=generic -march=x86-64 -gdwarf-4 -fno-debug-types-section -fvar-tracking-assignments -g2  -DNDEBUG -DQT_NO_DEBUG -fPIC   -o CMakeFiles/elektra-core.dir/__/loader/dl.c.o   -c /tmp/B.crNwZC/BUILD/elektra-0.8.23/src/libs/loader/dl.c
make[2]: Leaving directory '/tmp/B.crNwZC/BUILD/elektra-0.8.23/build'
make[2]: Entering directory '/tmp/B.crNwZC/BUILD/elektra-0.8.23/build'
[  7%] Building CXX object src/tools/kdb/CMakeFiles/kdb-objects.dir/complete.cpp.o
cd /tmp/B.crNwZC/BUILD/elektra-0.8.23/build/src/tools/kdb && /usr/bin/x86_64-pld-linux-gnux32-g++   -I/tmp/B.crNwZC/BUILD/elektra-0.8.23/build/src/include -I/tmp/B.crNwZC/BUILD/elektra-0.8.23/src/include -I/tmp/B.crNwZC/BUILD/elektra-0.8.23/build/src/bindings/cpp/include -I/tmp/B.crNwZC/BUILD/elektra-0.8.23/src/bindings/cpp/include -I/tmp/B.crNwZC/BUILD/elektra-0.8.23/build/src/libs/tools/include -I/tmp/B.crNwZC/BUILD/elektra-0.8.23/src/libs/tools/include -I/tmp/B.crNwZC/BUILD/elektra-0.8.23/src/tools/kdb  -std=c++11  -Wno-deprecated-declarations  -Wold-style-cast -Wstrict-null-sentinel -D_GLIBCXX_USE_NANOSLEEP -Wno-missing-field-initializers -Woverloaded-virtual  -Wsign-promo  -Wno-long-long -pedantic -Wno-variadic-macros -Wall -Wextra -Wno-overlength-strings -Wsign-compare -Wfloat-equal -Wformat -Wformat-security -Wshadow -Wcomments -Wtrigraphs -Wundef -Wuninitialized -Winit-self -Wmaybe-uninitialized -O2 -fwrapv -pipe -Wformat -Werror=format-security -gdwarf-4 -fno-debug-types-section -fvar-tracking-assignments -g2 -Wp,-D_FORTIFY_SOURCE=2 -fstack-protector-strong --param=ssp-buffer-size=4 -Werror=trampolines -fPIC -mtune=generic -march=x86-64 -gdwarf-4 -fno-debug-types-section -fvar-tracking-assignments -g2  -DNDEBUG -DQT_NO_DEBUG   -o CMakeFiles/kdb-objects.dir/complete.cpp.o -c /tmp/B.crNwZC/BUILD/elektra-0.8.23/src/tools/kdb/complete.cpp
/tmp/B.crNwZC/BUILD/elektra-0.8.23/src/tools/kdb/complete.cpp: In member function 'void CompleteCommand::addNamespaces(std::map<kdb::Key, std::pair<int, int> >&, const Cmdline&)':
/tmp/B.crNwZC/BUILD/elektra-0.8.23/src/tools/kdb/complete.cpp:320:43: warning: loop variable 'ns' creates a copy from type 'const string' {aka 'const std::__cxx11::basic_string<char>'} [-Wrange-loop-construct]
  320 |                         for (const string ns : namespaces)
      |                                           ^~
/tmp/B.crNwZC/BUILD/elektra-0.8.23/src/tools/kdb/complete.cpp:320:43: note: use reference type to prevent copying
  320 |                         for (const string ns : namespaces)
      |                                           ^~
      |                                           &
/tmp/B.crNwZC/BUILD/elektra-0.8.23/src/tools/kdb/complete.cpp:331:27: warning: loop variable 'ns' creates a copy from type 'const string' {aka 'const std::__cxx11::basic_string<char>'} [-Wrange-loop-construct]
  331 |         for (const string ns : namespaces)
      |                           ^~
/tmp/B.crNwZC/BUILD/elektra-0.8.23/src/tools/kdb/complete.cpp:331:27: note: use reference type to prevent copying
  331 |         for (const string ns : namespaces)
      |                           ^~
      |                           &
make[2]: Leaving directory '/tmp/B.crNwZC/BUILD/elektra-0.8.23/build'
make[1]: *** [CMakeFiles/Makefile2:15884: src/tools/kdb/CMakeFiles/kdb-objects.dir/all] Error 2
make[1]: *** Waiting for unfinished jobs....
make[2]: Entering directory '/tmp/B.crNwZC/BUILD/elektra-0.8.23/build'
[ 10%] Linking C shared library ../../../lib/libelektra-core.so
cd /tmp/B.crNwZC/BUILD/elektra-0.8.23/build/src/libs/elektra && /usr/bin/cmake -E cmake_link_script CMakeFiles/elektra-core.dir/link.txt --verbose=1
/usr/bin/x86_64-pld-linux-gnux32-gcc -fPIC  -std=gnu99  -Wno-deprecated-declarations  -Wstrict-prototypes  -Wno-long-long -pedantic -Wno-variadic-macros -Wall -Wextra -Wno-overlength-strings -Wsign-compare -Wfloat-equal -Wformat -Wformat-security -Wshadow -Wcomments -Wtrigraphs -Wundef -Wuninitialized -Winit-self -Wmaybe-uninitialized -Wsign-compare -Wfloat-equal -O2 -fwrapv -pipe -Wformat -Werror=format-security -gdwarf-4 -fno-debug-types-section -fvar-tracking-assignments -g2 -Wp,-D_FORTIFY_SOURCE=2 -fstack-protector-strong --param=ssp-buffer-size=4 -Werror=trampolines -fPIC -mtune=generic -march=x86-64 -gdwarf-4 -fno-debug-types-section -fvar-tracking-assignments -g2  -DNDEBUG -DQT_NO_DEBUG -Wl,--version-script=/tmp/B.crNwZC/BUILD/elektra-0.8.23/src/libs/elektra/libelektra-symbols.map -Wl,--as-needed -Wl,--no-copy-dt-needed-entries -Wl,-z,relro -Wl,-z,combreloc -shared -Wl,-soname,libelektra-core.so.4 -o ../../../lib/libelektra-core.so.0.8.23 CMakeFiles/elektra-core.dir/global.c.o CMakeFiles/elektra-core.dir/internal.c.o CMakeFiles/elektra-core.dir/kdbenum.c.o CMakeFiles/elektra-core.dir/key.c.o CMakeFiles/elektra-core.dir/keyhelpers.c.o CMakeFiles/elektra-core.dir/keymeta.c.o CMakeFiles/elektra-core.dir/keyname.c.o CMakeFiles/elektra-core.dir/keyset.c.o CMakeFiles/elektra-core.dir/keytest.c.o CMakeFiles/elektra-core.dir/keyvalue.c.o CMakeFiles/elektra-core.dir/nolog.c.o CMakeFiles/elektra-core.dir/opmphm.c.o CMakeFiles/elektra-core.dir/owner.c.o CMakeFiles/elektra-core.dir/proposal.c.o CMakeFiles/elektra-core.dir/rand.c.o CMakeFiles/elektra-core.dir/__/loader/dl.c.o  -Wl,-rpath,::::::::::::::::::: -ldl 
cd /tmp/B.crNwZC/BUILD/elektra-0.8.23/build/src/libs/elektra && /usr/bin/cmake -E cmake_symlink_library ../../../lib/libelektra-core.so.0.8.23 ../../../lib/libelektra-core.so.4 ../../../lib/libelektra-core.so
make[2]: Leaving directory '/tmp/B.crNwZC/BUILD/elektra-0.8.23/build'
make[1]: Entering directory '/tmp/B.crNwZC/BUILD/elektra-0.8.23/build'
[ 10%] Built target elektra-core
make[1]: Leaving directory '/tmp/B.crNwZC/BUILD/elektra-0.8.23/build'
make[2]: Entering directory '/tmp/B.crNwZC/BUILD/elektra-0.8.23/build'
[ 10%] Building C object src/libs/elektra/CMakeFiles/elektra.dir/backend.c.o
cd /tmp/B.crNwZC/BUILD/elektra-0.8.23/build/src/libs/elektra && /usr/bin/x86_64-pld-linux-gnux32-gcc -DHAVE_KDBCONFIG_H -Delektra_EXPORTS -I/tmp/B.crNwZC/BUILD/elektra-0.8.23/build/src/include -I/tmp/B.crNwZC/BUILD/elektra-0.8.23/src/include -I/tmp/B.crNwZC/BUILD/elektra-0.8.23/build/src/libs/elektra  -std=gnu99  -Wno-deprecated-declarations  -Wstrict-prototypes  -Wno-long-long -pedantic -Wno-variadic-macros -Wall -Wextra -Wno-overlength-strings -Wsign-compare -Wfloat-equal -Wformat -Wformat-security -Wshadow -Wcomments -Wtrigraphs -Wundef -Wuninitialized -Winit-self -Wmaybe-uninitialized -Wsign-compare -Wfloat-equal -O2 -fwrapv -pipe -Wformat -Werror=format-security -gdwarf-4 -fno-debug-types-section -fvar-tracking-assignments -g2 -Wp,-D_FORTIFY_SOURCE=2 -fstack-protector-strong --param=ssp-buffer-size=4 -Werror=trampolines -fPIC -mtune=generic -march=x86-64 -gdwarf-4 -fno-debug-types-section -fvar-tracking-assignments -g2  -DNDEBUG -DQT_NO_DEBUG -fPIC   -o CMakeFiles/elektra.dir/backend.c.o   -c /tmp/B.crNwZC/BUILD/elektra-0.8.23/src/libs/elektra/backend.c
make[2]: Leaving directory '/tmp/B.crNwZC/BUILD/elektra-0.8.23/build'
make[2]: Entering directory '/tmp/B.crNwZC/BUILD/elektra-0.8.23/build'
[ 10%] Building C object src/plugins/blockresolver/CMakeFiles/elektra-blockresolver-objects.dir/blockresolver.c.o
cd /tmp/B.crNwZC/BUILD/elektra-0.8.23/build/src/plugins/blockresolver && /usr/bin/x86_64-pld-linux-gnux32-gcc -DELEKTRA_STATIC -DHAVE_KDBCONFIG_H -DPLUGIN_SHORT_NAME=blockresolver -DREADME=readme_blockresolver.c -I/tmp/B.crNwZC/BUILD/elektra-0.8.23/build/src/include -I/tmp/B.crNwZC/BUILD/elektra-0.8.23/src/include -I/tmp/B.crNwZC/BUILD/elektra-0.8.23/build/src/plugins/blockresolver  -std=gnu99  -Wno-deprecated-declarations  -Wstrict-prototypes  -Wno-long-long -pedantic -Wno-variadic-macros -Wall -Wextra -Wno-overlength-strings -Wsign-compare -Wfloat-equal -Wformat -Wformat-security -Wshadow -Wcomments -Wtrigraphs -Wundef -Wuninitialized -Winit-self -Wmaybe-uninitialized -Wsign-compare -Wfloat-equal -O2 -fwrapv -pipe -Wformat -Werror=format-security -gdwarf-4 -fno-debug-types-section -fvar-tracking-assignments -g2 -Wp,-D_FORTIFY_SOURCE=2 -fstack-protector-strong --param=ssp-buffer-size=4 -Werror=trampolines -fPIC -mtune=generic -march=x86-64 -gdwarf-4 -fno-debug-types-section -fvar-tracking-assignments -g2  -DNDEBUG -DQT_NO_DEBUG   -fPIC -o CMakeFiles/elektra-blockresolver-objects.dir/blockresolver.c.o   -c /tmp/B.crNwZC/BUILD/elektra-0.8.23/src/plugins/blockresolver/blockresolver.c
/tmp/B.crNwZC/BUILD/elektra-0.8.23/src/plugins/blockresolver/blockresolver.c: In function 'genTempFilename':
/tmp/B.crNwZC/BUILD/elektra-0.8.23/src/plugins/blockresolver/blockresolver.c:100:77: warning: format '%lu' expects argument of type 'long unsigned int', but argument 5 has type '__time_t' {aka 'long long int'} [-Wformat=]
  100 |         snprintf (tmpFile, strlen (tmpFilePrefix) + TV_MAX_DIGITS + 2, "%s%lu:" ELEKTRA_TIME_USEC_F, tmpFilePrefix, tv.tv_sec, tv.tv_usec);
      |                                                                           ~~^                                       ~~~~~~~~~
      |                                                                             |                                         |
      |                                                                             long unsigned int                         __time_t {aka long long int}
      |                                                                           %llu
make[2]: Leaving directory '/tmp/B.crNwZC/BUILD/elektra-0.8.23/build'
make[1]: Entering directory '/tmp/B.crNwZC/BUILD/elektra-0.8.23/build'
[ 10%] Built target elektra-blockresolver-objects
make[1]: Leaving directory '/tmp/B.crNwZC/BUILD/elektra-0.8.23/build'
make[2]: Entering directory '/tmp/B.crNwZC/BUILD/elektra-0.8.23/build'
[ 10%] Building C object src/libs/elektra/CMakeFiles/elektra.dir/global.c.o
cd /tmp/B.crNwZC/BUILD/elektra-0.8.23/build/src/libs/elektra && /usr/bin/x86_64-pld-linux-gnux32-gcc -DHAVE_KDBCONFIG_H -Delektra_EXPORTS -I/tmp/B.crNwZC/BUILD/elektra-0.8.23/build/src/include -I/tmp/B.crNwZC/BUILD/elektra-0.8.23/src/include -I/tmp/B.crNwZC/BUILD/elektra-0.8.23/build/src/libs/elektra  -std=gnu99  -Wno-deprecated-declarations  -Wstrict-prototypes  -Wno-long-long -pedantic -Wno-variadic-macros -Wall -Wextra -Wno-overlength-strings -Wsign-compare -Wfloat-equal -Wformat -Wformat-security -Wshadow -Wcomments -Wtrigraphs -Wundef -Wuninitialized -Winit-self -Wmaybe-uninitialized -Wsign-compare -Wfloat-equal -O2 -fwrapv -pipe -Wformat -Werror=format-security -gdwarf-4 -fno-debug-types-section -fvar-tracking-assignments -g2 -Wp,-D_FORTIFY_SOURCE=2 -fstack-protector-strong --param=ssp-buffer-size=4 -Werror=trampolines -fPIC -mtune=generic -march=x86-64 -gdwarf-4 -fno-debug-types-section -fvar-tracking-assignments -g2  -DNDEBUG -DQT_NO_DEBUG -fPIC   -o CMakeFiles/elektra.dir/global.c.o   -c /tmp/B.crNwZC/BUILD/elektra-0.8.23/src/libs/elektra/global.c
make[2]: Leaving directory '/tmp/B.crNwZC/BUILD/elektra-0.8.23/build'
make[2]: Entering directory '/tmp/B.crNwZC/BUILD/elektra-0.8.23/build'
[ 10%] Building C object src/libs/elektra/CMakeFiles/elektra.dir/mount.c.o
cd /tmp/B.crNwZC/BUILD/elektra-0.8.23/build/src/libs/elektra && /usr/bin/x86_64-pld-linux-gnux32-gcc -DHAVE_KDBCONFIG_H -Delektra_EXPORTS -I/tmp/B.crNwZC/BUILD/elektra-0.8.23/build/src/include -I/tmp/B.crNwZC/BUILD/elektra-0.8.23/src/include -I/tmp/B.crNwZC/BUILD/elektra-0.8.23/build/src/libs/elektra  -std=gnu99  -Wno-deprecated-declarations  -Wstrict-prototypes  -Wno-long-long -pedantic -Wno-variadic-macros -Wall -Wextra -Wno-overlength-strings -Wsign-compare -Wfloat-equal -Wformat -Wformat-security -Wshadow -Wcomments -Wtrigraphs -Wundef -Wuninitialized -Winit-self -Wmaybe-uninitialized -Wsign-compare -Wfloat-equal -O2 -fwrapv -pipe -Wformat -Werror=format-security -gdwarf-4 -fno-debug-types-section -fvar-tracking-assignments -g2 -Wp,-D_FORTIFY_SOURCE=2 -fstack-protector-strong --param=ssp-buffer-size=4 -Werror=trampolines -fPIC -mtune=generic -march=x86-64 -gdwarf-4 -fno-debug-types-section -fvar-tracking-assignments -g2  -DNDEBUG -DQT_NO_DEBUG -fPIC   -o CMakeFiles/elektra.dir/mount.c.o   -c /tmp/B.crNwZC/BUILD/elektra-0.8.23/src/libs/elektra/mount.c
make[2]: Leaving directory '/tmp/B.crNwZC/BUILD/elektra-0.8.23/build'
make[2]: Entering directory '/tmp/B.crNwZC/BUILD/elektra-0.8.23/build'
[ 11%] Building C object src/libs/elektra/CMakeFiles/elektra.dir/kdbenum.c.o
cd /tmp/B.crNwZC/BUILD/elektra-0.8.23/build/src/libs/elektra && /usr/bin/x86_64-pld-linux-gnux32-gcc -DHAVE_KDBCONFIG_H -Delektra_EXPORTS -I/tmp/B.crNwZC/BUILD/elektra-0.8.23/build/src/include -I/tmp/B.crNwZC/BUILD/elektra-0.8.23/src/include -I/tmp/B.crNwZC/BUILD/elektra-0.8.23/build/src/libs/elektra  -std=gnu99  -Wno-deprecated-declarations  -Wstrict-prototypes  -Wno-long-long -pedantic -Wno-variadic-macros -Wall -Wextra -Wno-overlength-strings -Wsign-compare -Wfloat-equal -Wformat -Wformat-security -Wshadow -Wcomments -Wtrigraphs -Wundef -Wuninitialized -Winit-self -Wmaybe-uninitialized -Wsign-compare -Wfloat-equal -O2 -fwrapv -pipe -Wformat -Werror=format-security -gdwarf-4 -fno-debug-types-section -fvar-tracking-assignments -g2 -Wp,-D_FORTIFY_SOURCE=2 -fstack-protector-strong --param=ssp-buffer-size=4 -Werror=trampolines -fPIC -mtune=generic -march=x86-64 -gdwarf-4 -fno-debug-types-section -fvar-tracking-assignments -g2  -DNDEBUG -DQT_NO_DEBUG -fPIC   -o CMakeFiles/elektra.dir/kdbenum.c.o   -c /tmp/B.crNwZC/BUILD/elektra-0.8.23/src/libs/elektra/kdbenum.c
make[2]: Leaving directory '/tmp/B.crNwZC/BUILD/elektra-0.8.23/build'
make[2]: Entering directory '/tmp/B.crNwZC/BUILD/elektra-0.8.23/build'
[ 11%] Building C object src/libs/elektra/CMakeFiles/elektra.dir/key.c.o
cd /tmp/B.crNwZC/BUILD/elektra-0.8.23/build/src/libs/elektra && /usr/bin/x86_64-pld-linux-gnux32-gcc -DHAVE_KDBCONFIG_H -Delektra_EXPORTS -I/tmp/B.crNwZC/BUILD/elektra-0.8.23/build/src/include -I/tmp/B.crNwZC/BUILD/elektra-0.8.23/src/include -I/tmp/B.crNwZC/BUILD/elektra-0.8.23/build/src/libs/elektra  -std=gnu99  -Wno-deprecated-declarations  -Wstrict-prototypes  -Wno-long-long -pedantic -Wno-variadic-macros -Wall -Wextra -Wno-overlength-strings -Wsign-compare -Wfloat-equal -Wformat -Wformat-security -Wshadow -Wcomments -Wtrigraphs -Wundef -Wuninitialized -Winit-self -Wmaybe-uninitialized -Wsign-compare -Wfloat-equal -O2 -fwrapv -pipe -Wformat -Werror=format-security -gdwarf-4 -fno-debug-types-section -fvar-tracking-assignments -g2 -Wp,-D_FORTIFY_SOURCE=2 -fstack-protector-strong --param=ssp-buffer-size=4 -Werror=trampolines -fPIC -mtune=generic -march=x86-64 -gdwarf-4 -fno-debug-types-section -fvar-tracking-assignments -g2  -DNDEBUG -DQT_NO_DEBUG -fPIC   -o CMakeFiles/elektra.dir/key.c.o   -c /tmp/B.crNwZC/BUILD/elektra-0.8.23/src/libs/elektra/key.c
make[2]: Leaving directory '/tmp/B.crNwZC/BUILD/elektra-0.8.23/build'
make[2]: Entering directory '/tmp/B.crNwZC/BUILD/elektra-0.8.23/build'
[ 10%] Building C object src/plugins/boolean/CMakeFiles/elektra-boolean-objects.dir/boolean.c.o
cd /tmp/B.crNwZC/BUILD/elektra-0.8.23/build/src/plugins/boolean && /usr/bin/x86_64-pld-linux-gnux32-gcc -DELEKTRA_STATIC -DHAVE_KDBCONFIG_H -DPLUGIN_SHORT_NAME=boolean -DREADME=readme_boolean.c -I/tmp/B.crNwZC/BUILD/elektra-0.8.23/build/src/include -I/tmp/B.crNwZC/BUILD/elektra-0.8.23/src/include -I/tmp/B.crNwZC/BUILD/elektra-0.8.23/build/src/plugins/boolean  -std=gnu99  -Wno-deprecated-declarations  -Wstrict-prototypes  -Wno-long-long -pedantic -Wno-variadic-macros -Wall -Wextra -Wno-overlength-strings -Wsign-compare -Wfloat-equal -Wformat -Wformat-security -Wshadow -Wcomments -Wtrigraphs -Wundef -Wuninitialized -Winit-self -Wmaybe-uninitialized -Wsign-compare -Wfloat-equal -O2 -fwrapv -pipe -Wformat -Werror=format-security -gdwarf-4 -fno-debug-types-section -fvar-tracking-assignments -g2 -Wp,-D_FORTIFY_SOURCE=2 -fstack-protector-strong --param=ssp-buffer-size=4 -Werror=trampolines -fPIC -mtune=generic -march=x86-64 -gdwarf-4 -fno-debug-types-section -fvar-tracking-assignments -g2  -DNDEBUG -DQT_NO_DEBUG   -fPIC -o CMakeFiles/elektra-boolean-objects.dir/boolean.c.o   -c /tmp/B.crNwZC/BUILD/elektra-0.8.23/src/plugins/boolean/boolean.c
make[2]: Leaving directory '/tmp/B.crNwZC/BUILD/elektra-0.8.23/build'
make[1]: Entering directory '/tmp/B.crNwZC/BUILD/elektra-0.8.23/build'
[ 11%] Built target elektra-boolean-objects
make[1]: Leaving directory '/tmp/B.crNwZC/BUILD/elektra-0.8.23/build'
make[2]: Entering directory '/tmp/B.crNwZC/BUILD/elektra-0.8.23/build'
[ 11%] Building C object src/libs/elektra/CMakeFiles/elektra.dir/keyhelpers.c.o
cd /tmp/B.crNwZC/BUILD/elektra-0.8.23/build/src/libs/elektra && /usr/bin/x86_64-pld-linux-gnux32-gcc -DHAVE_KDBCONFIG_H -Delektra_EXPORTS -I/tmp/B.crNwZC/BUILD/elektra-0.8.23/build/src/include -I/tmp/B.crNwZC/BUILD/elektra-0.8.23/src/include -I/tmp/B.crNwZC/BUILD/elektra-0.8.23/build/src/libs/elektra  -std=gnu99  -Wno-deprecated-declarations  -Wstrict-prototypes  -Wno-long-long -pedantic -Wno-variadic-macros -Wall -Wextra -Wno-overlength-strings -Wsign-compare -Wfloat-equal -Wformat -Wformat-security -Wshadow -Wcomments -Wtrigraphs -Wundef -Wuninitialized -Winit-self -Wmaybe-uninitialized -Wsign-compare -Wfloat-equal -O2 -fwrapv -pipe -Wformat -Werror=format-security -gdwarf-4 -fno-debug-types-section -fvar-tracking-assignments -g2 -Wp,-D_FORTIFY_SOURCE=2 -fstack-protector-strong --param=ssp-buffer-size=4 -Werror=trampolines -fPIC -mtune=generic -march=x86-64 -gdwarf-4 -fno-debug-types-section -fvar-tracking-assignments -g2  -DNDEBUG -DQT_NO_DEBUG -fPIC   -o CMakeFiles/elektra.dir/keyhelpers.c.o   -c /tmp/B.crNwZC/BUILD/elektra-0.8.23/src/libs/elektra/keyhelpers.c
make[2]: Leaving directory '/tmp/B.crNwZC/BUILD/elektra-0.8.23/build'
make[2]: Entering directory '/tmp/B.crNwZC/BUILD/elektra-0.8.23/build'
[ 11%] Building C object src/libs/elektra/CMakeFiles/elektra.dir/keymeta.c.o
cd /tmp/B.crNwZC/BUILD/elektra-0.8.23/build/src/libs/elektra && /usr/bin/x86_64-pld-linux-gnux32-gcc -DHAVE_KDBCONFIG_H -Delektra_EXPORTS -I/tmp/B.crNwZC/BUILD/elektra-0.8.23/build/src/include -I/tmp/B.crNwZC/BUILD/elektra-0.8.23/src/include -I/tmp/B.crNwZC/BUILD/elektra-0.8.23/build/src/libs/elektra  -std=gnu99  -Wno-deprecated-declarations  -Wstrict-prototypes  -Wno-long-long -pedantic -Wno-variadic-macros -Wall -Wextra -Wno-overlength-strings -Wsign-compare -Wfloat-equal -Wformat -Wformat-security -Wshadow -Wcomments -Wtrigraphs -Wundef -Wuninitialized -Winit-self -Wmaybe-uninitialized -Wsign-compare -Wfloat-equal -O2 -fwrapv -pipe -Wformat -Werror=format-security -gdwarf-4 -fno-debug-types-section -fvar-tracking-assignments -g2 -Wp,-D_FORTIFY_SOURCE=2 -fstack-protector-strong --param=ssp-buffer-size=4 -Werror=trampolines -fPIC -mtune=generic -march=x86-64 -gdwarf-4 -fno-debug-types-section -fvar-tracking-assignments -g2  -DNDEBUG -DQT_NO_DEBUG -fPIC   -o CMakeFiles/elektra.dir/keymeta.c.o   -c /tmp/B.crNwZC/BUILD/elektra-0.8.23/src/libs/elektra/keymeta.c
make[2]: Leaving directory '/tmp/B.crNwZC/BUILD/elektra-0.8.23/build'
make[2]: Entering directory '/tmp/B.crNwZC/BUILD/elektra-0.8.23/build'
[ 10%] Building C object src/libs/elektra/CMakeFiles/elektra.dir/kdb.c.o
cd /tmp/B.crNwZC/BUILD/elektra-0.8.23/build/src/libs/elektra && /usr/bin/x86_64-pld-linux-gnux32-gcc -DHAVE_KDBCONFIG_H -Delektra_EXPORTS -I/tmp/B.crNwZC/BUILD/elektra-0.8.23/build/src/include -I/tmp/B.crNwZC/BUILD/elektra-0.8.23/src/include -I/tmp/B.crNwZC/BUILD/elektra-0.8.23/build/src/libs/elektra  -std=gnu99  -Wno-deprecated-declarations  -Wstrict-prototypes  -Wno-long-long -pedantic -Wno-variadic-macros -Wall -Wextra -Wno-overlength-strings -Wsign-compare -Wfloat-equal -Wformat -Wformat-security -Wshadow -Wcomments -Wtrigraphs -Wundef -Wuninitialized -Winit-self -Wmaybe-uninitialized -Wsign-compare -Wfloat-equal -O2 -fwrapv -pipe -Wformat -Werror=format-security -gdwarf-4 -fno-debug-types-section -fvar-tracking-assignments -g2 -Wp,-D_FORTIFY_SOURCE=2 -fstack-protector-strong --param=ssp-buffer-size=4 -Werror=trampolines -fPIC -mtune=generic -march=x86-64 -gdwarf-4 -fno-debug-types-section -fvar-tracking-assignments -g2  -DNDEBUG -DQT_NO_DEBUG -fPIC   -o CMakeFiles/elektra.dir/kdb.c.o   -c /tmp/B.crNwZC/BUILD/elektra-0.8.23/src/libs/elektra/kdb.c
make[2]: Leaving directory '/tmp/B.crNwZC/BUILD/elektra-0.8.23/build'
make[2]: Entering directory '/tmp/B.crNwZC/BUILD/elektra-0.8.23/build'
[ 10%] Building C object src/libs/elektra/CMakeFiles/elektra.dir/split.c.o
cd /tmp/B.crNwZC/BUILD/elektra-0.8.23/build/src/libs/elektra && /usr/bin/x86_64-pld-linux-gnux32-gcc -DHAVE_KDBCONFIG_H -Delektra_EXPORTS -I/tmp/B.crNwZC/BUILD/elektra-0.8.23/build/src/include -I/tmp/B.crNwZC/BUILD/elektra-0.8.23/src/include -I/tmp/B.crNwZC/BUILD/elektra-0.8.23/build/src/libs/elektra  -std=gnu99  -Wno-deprecated-declarations  -Wstrict-prototypes  -Wno-long-long -pedantic -Wno-variadic-macros -Wall -Wextra -Wno-overlength-strings -Wsign-compare -Wfloat-equal -Wformat -Wformat-security -Wshadow -Wcomments -Wtrigraphs -Wundef -Wuninitialized -Winit-self -Wmaybe-uninitialized -Wsign-compare -Wfloat-equal -O2 -fwrapv -pipe -Wformat -Werror=format-security -gdwarf-4 -fno-debug-types-section -fvar-tracking-assignments -g2 -Wp,-D_FORTIFY_SOURCE=2 -fstack-protector-strong --param=ssp-buffer-size=4 -Werror=trampolines -fPIC -mtune=generic -march=x86-64 -gdwarf-4 -fno-debug-types-section -fvar-tracking-assignments -g2  -DNDEBUG -DQT_NO_DEBUG -fPIC   -o CMakeFiles/elektra.dir/split.c.o   -c /tmp/B.crNwZC/BUILD/elektra-0.8.23/src/libs/elektra/split.c
make[2]: Leaving directory '/tmp/B.crNwZC/BUILD/elektra-0.8.23/build'
make[2]: Entering directory '/tmp/B.crNwZC/BUILD/elektra-0.8.23/build'
[ 10%] Building C object src/libs/elektra/CMakeFiles/elektra.dir/trie.c.o
cd /tmp/B.crNwZC/BUILD/elektra-0.8.23/build/src/libs/elektra && /usr/bin/x86_64-pld-linux-gnux32-gcc -DHAVE_KDBCONFIG_H -Delektra_EXPORTS -I/tmp/B.crNwZC/BUILD/elektra-0.8.23/build/src/include -I/tmp/B.crNwZC/BUILD/elektra-0.8.23/src/include -I/tmp/B.crNwZC/BUILD/elektra-0.8.23/build/src/libs/elektra  -std=gnu99  -Wno-deprecated-declarations  -Wstrict-prototypes  -Wno-long-long -pedantic -Wno-variadic-macros -Wall -Wextra -Wno-overlength-strings -Wsign-compare -Wfloat-equal -Wformat -Wformat-security -Wshadow -Wcomments -Wtrigraphs -Wundef -Wuninitialized -Winit-self -Wmaybe-uninitialized -Wsign-compare -Wfloat-equal -O2 -fwrapv -pipe -Wformat -Werror=format-security -gdwarf-4 -fno-debug-types-section -fvar-tracking-assignments -g2 -Wp,-D_FORTIFY_SOURCE=2 -fstack-protector-strong --param=ssp-buffer-size=4 -Werror=trampolines -fPIC -mtune=generic -march=x86-64 -gdwarf-4 -fno-debug-types-section -fvar-tracking-assignments -g2  -DNDEBUG -DQT_NO_DEBUG -fPIC   -o CMakeFiles/elektra.dir/trie.c.o   -c /tmp/B.crNwZC/BUILD/elektra-0.8.23/src/libs/elektra/trie.c
make[2]: Leaving directory '/tmp/B.crNwZC/BUILD/elektra-0.8.23/build'
make[2]: Entering directory '/tmp/B.crNwZC/BUILD/elektra-0.8.23/build'
[ 10%] Building C object src/libs/elektra/CMakeFiles/elektra.dir/plugin.c.o
cd /tmp/B.crNwZC/BUILD/elektra-0.8.23/build/src/libs/elektra && /usr/bin/x86_64-pld-linux-gnux32-gcc -DHAVE_KDBCONFIG_H -Delektra_EXPORTS -I/tmp/B.crNwZC/BUILD/elektra-0.8.23/build/src/include -I/tmp/B.crNwZC/BUILD/elektra-0.8.23/src/include -I/tmp/B.crNwZC/BUILD/elektra-0.8.23/build/src/libs/elektra  -std=gnu99  -Wno-deprecated-declarations  -Wstrict-prototypes  -Wno-long-long -pedantic -Wno-variadic-macros -Wall -Wextra -Wno-overlength-strings -Wsign-compare -Wfloat-equal -Wformat -Wformat-security -Wshadow -Wcomments -Wtrigraphs -Wundef -Wuninitialized -Winit-self -Wmaybe-uninitialized -Wsign-compare -Wfloat-equal -O2 -fwrapv -pipe -Wformat -Werror=format-security -gdwarf-4 -fno-debug-types-section -fvar-tracking-assignments -g2 -Wp,-D_FORTIFY_SOURCE=2 -fstack-protector-strong --param=ssp-buffer-size=4 -Werror=trampolines -fPIC -mtune=generic -march=x86-64 -gdwarf-4 -fno-debug-types-section -fvar-tracking-assignments -g2  -DNDEBUG -DQT_NO_DEBUG -fPIC   -o CMakeFiles/elektra.dir/plugin.c.o   -c /tmp/B.crNwZC/BUILD/elektra-0.8.23/src/libs/elektra/plugin.c
make[2]: Leaving directory '/tmp/B.crNwZC/BUILD/elektra-0.8.23/build'
make[2]: Entering directory '/tmp/B.crNwZC/BUILD/elektra-0.8.23/build'
[ 11%] Building C object src/libs/elektra/CMakeFiles/elektra.dir/keyvalue.c.o
cd /tmp/B.crNwZC/BUILD/elektra-0.8.23/build/src/libs/elektra && /usr/bin/x86_64-pld-linux-gnux32-gcc -DHAVE_KDBCONFIG_H -Delektra_EXPORTS -I/tmp/B.crNwZC/BUILD/elektra-0.8.23/build/src/include -I/tmp/B.crNwZC/BUILD/elektra-0.8.23/src/include -I/tmp/B.crNwZC/BUILD/elektra-0.8.23/build/src/libs/elektra  -std=gnu99  -Wno-deprecated-declarations  -Wstrict-prototypes  -Wno-long-long -pedantic -Wno-variadic-macros -Wall -Wextra -Wno-overlength-strings -Wsign-compare -Wfloat-equal -Wformat -Wformat-security -Wshadow -Wcomments -Wtrigraphs -Wundef -Wuninitialized -Winit-self -Wmaybe-uninitialized -Wsign-compare -Wfloat-equal -O2 -fwrapv -pipe -Wformat -Werror=format-security -gdwarf-4 -fno-debug-types-section -fvar-tracking-assignments -g2 -Wp,-D_FORTIFY_SOURCE=2 -fstack-protector-strong --param=ssp-buffer-size=4 -Werror=trampolines -fPIC -mtune=generic -march=x86-64 -gdwarf-4 -fno-debug-types-section -fvar-tracking-assignments -g2  -DNDEBUG -DQT_NO_DEBUG -fPIC   -o CMakeFiles/elektra.dir/keyvalue.c.o   -c /tmp/B.crNwZC/BUILD/elektra-0.8.23/src/libs/elektra/keyvalue.c
make[2]: Leaving directory '/tmp/B.crNwZC/BUILD/elektra-0.8.23/build'
make[2]: Entering directory '/tmp/B.crNwZC/BUILD/elektra-0.8.23/build'
[ 11%] Building C object src/libs/elektra/CMakeFiles/elektra.dir/nolog.c.o
cd /tmp/B.crNwZC/BUILD/elektra-0.8.23/build/src/libs/elektra && /usr/bin/x86_64-pld-linux-gnux32-gcc -DHAVE_KDBCONFIG_H -Delektra_EXPORTS -I/tmp/B.crNwZC/BUILD/elektra-0.8.23/build/src/include -I/tmp/B.crNwZC/BUILD/elektra-0.8.23/src/include -I/tmp/B.crNwZC/BUILD/elektra-0.8.23/build/src/libs/elektra  -std=gnu99  -Wno-deprecated-declarations  -Wstrict-prototypes  -Wno-long-long -pedantic -Wno-variadic-macros -Wall -Wextra -Wno-overlength-strings -Wsign-compare -Wfloat-equal -Wformat -Wformat-security -Wshadow -Wcomments -Wtrigraphs -Wundef -Wuninitialized -Winit-self -Wmaybe-uninitialized -Wsign-compare -Wfloat-equal -O2 -fwrapv -pipe -Wformat -Werror=format-security -gdwarf-4 -fno-debug-types-section -fvar-tracking-assignments -g2 -Wp,-D_FORTIFY_SOURCE=2 -fstack-protector-strong --param=ssp-buffer-size=4 -Werror=trampolines -fPIC -mtune=generic -march=x86-64 -gdwarf-4 -fno-debug-types-section -fvar-tracking-assignments -g2  -DNDEBUG -DQT_NO_DEBUG -fPIC   -o CMakeFiles/elektra.dir/nolog.c.o   -c /tmp/B.crNwZC/BUILD/elektra-0.8.23/src/libs/elektra/nolog.c
make[2]: Leaving directory '/tmp/B.crNwZC/BUILD/elektra-0.8.23/build'
make[2]: Entering directory '/tmp/B.crNwZC/BUILD/elektra-0.8.23/build'
[ 11%] Building C object src/libs/elektra/CMakeFiles/elektra.dir/owner.c.o
cd /tmp/B.crNwZC/BUILD/elektra-0.8.23/build/src/libs/elektra && /usr/bin/x86_64-pld-linux-gnux32-gcc -DHAVE_KDBCONFIG_H -Delektra_EXPORTS -I/tmp/B.crNwZC/BUILD/elektra-0.8.23/build/src/include -I/tmp/B.crNwZC/BUILD/elektra-0.8.23/src/include -I/tmp/B.crNwZC/BUILD/elektra-0.8.23/build/src/libs/elektra  -std=gnu99  -Wno-deprecated-declarations  -Wstrict-prototypes  -Wno-long-long -pedantic -Wno-variadic-macros -Wall -Wextra -Wno-overlength-strings -Wsign-compare -Wfloat-equal -Wformat -Wformat-security -Wshadow -Wcomments -Wtrigraphs -Wundef -Wuninitialized -Winit-self -Wmaybe-uninitialized -Wsign-compare -Wfloat-equal -O2 -fwrapv -pipe -Wformat -Werror=format-security -gdwarf-4 -fno-debug-types-section -fvar-tracking-assignments -g2 -Wp,-D_FORTIFY_SOURCE=2 -fstack-protector-strong --param=ssp-buffer-size=4 -Werror=trampolines -fPIC -mtune=generic -march=x86-64 -gdwarf-4 -fno-debug-types-section -fvar-tracking-assignments -g2  -DNDEBUG -DQT_NO_DEBUG -fPIC   -o CMakeFiles/elektra.dir/owner.c.o   -c /tmp/B.crNwZC/BUILD/elektra-0.8.23/src/libs/elektra/owner.c
make[2]: Leaving directory '/tmp/B.crNwZC/BUILD/elektra-0.8.23/build'
make[2]: Entering directory '/tmp/B.crNwZC/BUILD/elektra-0.8.23/build'
[ 12%] Building C object src/libs/elektra/CMakeFiles/elektra.dir/proposal.c.o
cd /tmp/B.crNwZC/BUILD/elektra-0.8.23/build/src/libs/elektra && /usr/bin/x86_64-pld-linux-gnux32-gcc -DHAVE_KDBCONFIG_H -Delektra_EXPORTS -I/tmp/B.crNwZC/BUILD/elektra-0.8.23/build/src/include -I/tmp/B.crNwZC/BUILD/elektra-0.8.23/src/include -I/tmp/B.crNwZC/BUILD/elektra-0.8.23/build/src/libs/elektra  -std=gnu99  -Wno-deprecated-declarations  -Wstrict-prototypes  -Wno-long-long -pedantic -Wno-variadic-macros -Wall -Wextra -Wno-overlength-strings -Wsign-compare -Wfloat-equal -Wformat -Wformat-security -Wshadow -Wcomments -Wtrigraphs -Wundef -Wuninitialized -Winit-self -Wmaybe-uninitialized -Wsign-compare -Wfloat-equal -O2 -fwrapv -pipe -Wformat -Werror=format-security -gdwarf-4 -fno-debug-types-section -fvar-tracking-assignments -g2 -Wp,-D_FORTIFY_SOURCE=2 -fstack-protector-strong --param=ssp-buffer-size=4 -Werror=trampolines -fPIC -mtune=generic -march=x86-64 -gdwarf-4 -fno-debug-types-section -fvar-tracking-assignments -g2  -DNDEBUG -DQT_NO_DEBUG -fPIC   -o CMakeFiles/elektra.dir/proposal.c.o   -c /tmp/B.crNwZC/BUILD/elektra-0.8.23/src/libs/elektra/proposal.c
make[2]: Leaving directory '/tmp/B.crNwZC/BUILD/elektra-0.8.23/build'
make[2]: Entering directory '/tmp/B.crNwZC/BUILD/elektra-0.8.23/build'
[ 10%] Building C object src/libs/elektra/CMakeFiles/elektra.dir/internal.c.o
cd /tmp/B.crNwZC/BUILD/elektra-0.8.23/build/src/libs/elektra && /usr/bin/x86_64-pld-linux-gnux32-gcc -DHAVE_KDBCONFIG_H -Delektra_EXPORTS -I/tmp/B.crNwZC/BUILD/elektra-0.8.23/build/src/include -I/tmp/B.crNwZC/BUILD/elektra-0.8.23/src/include -I/tmp/B.crNwZC/BUILD/elektra-0.8.23/build/src/libs/elektra  -std=gnu99  -Wno-deprecated-declarations  -Wstrict-prototypes  -Wno-long-long -pedantic -Wno-variadic-macros -Wall -Wextra -Wno-overlength-strings -Wsign-compare -Wfloat-equal -Wformat -Wformat-security -Wshadow -Wcomments -Wtrigraphs -Wundef -Wuninitialized -Winit-self -Wmaybe-uninitialized -Wsign-compare -Wfloat-equal -O2 -fwrapv -pipe -Wformat -Werror=format-security -gdwarf-4 -fno-debug-types-section -fvar-tracking-assignments -g2 -Wp,-D_FORTIFY_SOURCE=2 -fstack-protector-strong --param=ssp-buffer-size=4 -Werror=trampolines -fPIC -mtune=generic -march=x86-64 -gdwarf-4 -fno-debug-types-section -fvar-tracking-assignments -g2  -DNDEBUG -DQT_NO_DEBUG -fPIC   -o CMakeFiles/elektra.dir/internal.c.o   -c /tmp/B.crNwZC/BUILD/elektra-0.8.23/src/libs/elektra/internal.c
make[2]: Leaving directory '/tmp/B.crNwZC/BUILD/elektra-0.8.23/build'
make[2]: Entering directory '/tmp/B.crNwZC/BUILD/elektra-0.8.23/build'
[ 12%] Building C object src/libs/elektra/CMakeFiles/elektra.dir/rand.c.o
cd /tmp/B.crNwZC/BUILD/elektra-0.8.23/build/src/libs/elektra && /usr/bin/x86_64-pld-linux-gnux32-gcc -DHAVE_KDBCONFIG_H -Delektra_EXPORTS -I/tmp/B.crNwZC/BUILD/elektra-0.8.23/build/src/include -I/tmp/B.crNwZC/BUILD/elektra-0.8.23/src/include -I/tmp/B.crNwZC/BUILD/elektra-0.8.23/build/src/libs/elektra  -std=gnu99  -Wno-deprecated-declarations  -Wstrict-prototypes  -Wno-long-long -pedantic -Wno-variadic-macros -Wall -Wextra -Wno-overlength-strings -Wsign-compare -Wfloat-equal -Wformat -Wformat-security -Wshadow -Wcomments -Wtrigraphs -Wundef -Wuninitialized -Winit-self -Wmaybe-uninitialized -Wsign-compare -Wfloat-equal -O2 -fwrapv -pipe -Wformat -Werror=format-security -gdwarf-4 -fno-debug-types-section -fvar-tracking-assignments -g2 -Wp,-D_FORTIFY_SOURCE=2 -fstack-protector-strong --param=ssp-buffer-size=4 -Werror=trampolines -fPIC -mtune=generic -march=x86-64 -gdwarf-4 -fno-debug-types-section -fvar-tracking-assignments -g2  -DNDEBUG -DQT_NO_DEBUG -fPIC   -o CMakeFiles/elektra.dir/rand.c.o   -c /tmp/B.crNwZC/BUILD/elektra-0.8.23/src/libs/elektra/rand.c
make[2]: Leaving directory '/tmp/B.crNwZC/BUILD/elektra-0.8.23/build'
make[2]: Entering directory '/tmp/B.crNwZC/BUILD/elektra-0.8.23/build'
[ 11%] Building C object src/libs/elektra/CMakeFiles/elektra.dir/opmphm.c.o
cd /tmp/B.crNwZC/BUILD/elektra-0.8.23/build/src/libs/elektra && /usr/bin/x86_64-pld-linux-gnux32-gcc -DHAVE_KDBCONFIG_H -Delektra_EXPORTS -I/tmp/B.crNwZC/BUILD/elektra-0.8.23/build/src/include -I/tmp/B.crNwZC/BUILD/elektra-0.8.23/src/include -I/tmp/B.crNwZC/BUILD/elektra-0.8.23/build/src/libs/elektra  -std=gnu99  -Wno-deprecated-declarations  -Wstrict-prototypes  -Wno-long-long -pedantic -Wno-variadic-macros -Wall -Wextra -Wno-overlength-strings -Wsign-compare -Wfloat-equal -Wformat -Wformat-security -Wshadow -Wcomments -Wtrigraphs -Wundef -Wuninitialized -Winit-self -Wmaybe-uninitialized -Wsign-compare -Wfloat-equal -O2 -fwrapv -pipe -Wformat -Werror=format-security -gdwarf-4 -fno-debug-types-section -fvar-tracking-assignments -g2 -Wp,-D_FORTIFY_SOURCE=2 -fstack-protector-strong --param=ssp-buffer-size=4 -Werror=trampolines -fPIC -mtune=generic -march=x86-64 -gdwarf-4 -fno-debug-types-section -fvar-tracking-assignments -g2  -DNDEBUG -DQT_NO_DEBUG -fPIC   -o CMakeFiles/elektra.dir/opmphm.c.o   -c /tmp/B.crNwZC/BUILD/elektra-0.8.23/src/libs/elektra/opmphm.c
make[2]: Leaving directory '/tmp/B.crNwZC/BUILD/elektra-0.8.23/build'
make[2]: Entering directory '/tmp/B.crNwZC/BUILD/elektra-0.8.23/build'
[ 11%] Building C object src/libs/elektra/CMakeFiles/elektra.dir/keyname.c.o
cd /tmp/B.crNwZC/BUILD/elektra-0.8.23/build/src/libs/elektra && /usr/bin/x86_64-pld-linux-gnux32-gcc -DHAVE_KDBCONFIG_H -Delektra_EXPORTS -I/tmp/B.crNwZC/BUILD/elektra-0.8.23/build/src/include -I/tmp/B.crNwZC/BUILD/elektra-0.8.23/src/include -I/tmp/B.crNwZC/BUILD/elektra-0.8.23/build/src/libs/elektra  -std=gnu99  -Wno-deprecated-declarations  -Wstrict-prototypes  -Wno-long-long -pedantic -Wno-variadic-macros -Wall -Wextra -Wno-overlength-strings -Wsign-compare -Wfloat-equal -Wformat -Wformat-security -Wshadow -Wcomments -Wtrigraphs -Wundef -Wuninitialized -Winit-self -Wmaybe-uninitialized -Wsign-compare -Wfloat-equal -O2 -fwrapv -pipe -Wformat -Werror=format-security -gdwarf-4 -fno-debug-types-section -fvar-tracking-assignments -g2 -Wp,-D_FORTIFY_SOURCE=2 -fstack-protector-strong --param=ssp-buffer-size=4 -Werror=trampolines -fPIC -mtune=generic -march=x86-64 -gdwarf-4 -fno-debug-types-section -fvar-tracking-assignments -g2  -DNDEBUG -DQT_NO_DEBUG -fPIC   -o CMakeFiles/elektra.dir/keyname.c.o   -c /tmp/B.crNwZC/BUILD/elektra-0.8.23/src/libs/elektra/keyname.c
make[2]: Leaving directory '/tmp/B.crNwZC/BUILD/elektra-0.8.23/build'
make[2]: Entering directory '/tmp/B.crNwZC/BUILD/elektra-0.8.23/build'
[ 11%] Building C object src/libs/elektra/CMakeFiles/elektra.dir/keytest.c.o
cd /tmp/B.crNwZC/BUILD/elektra-0.8.23/build/src/libs/elektra && /usr/bin/x86_64-pld-linux-gnux32-gcc -DHAVE_KDBCONFIG_H -Delektra_EXPORTS -I/tmp/B.crNwZC/BUILD/elektra-0.8.23/build/src/include -I/tmp/B.crNwZC/BUILD/elektra-0.8.23/src/include -I/tmp/B.crNwZC/BUILD/elektra-0.8.23/build/src/libs/elektra  -std=gnu99  -Wno-deprecated-declarations  -Wstrict-prototypes  -Wno-long-long -pedantic -Wno-variadic-macros -Wall -Wextra -Wno-overlength-strings -Wsign-compare -Wfloat-equal -Wformat -Wformat-security -Wshadow -Wcomments -Wtrigraphs -Wundef -Wuninitialized -Winit-self -Wmaybe-uninitialized -Wsign-compare -Wfloat-equal -O2 -fwrapv -pipe -Wformat -Werror=format-security -gdwarf-4 -fno-debug-types-section -fvar-tracking-assignments -g2 -Wp,-D_FORTIFY_SOURCE=2 -fstack-protector-strong --param=ssp-buffer-size=4 -Werror=trampolines -fPIC -mtune=generic -march=x86-64 -gdwarf-4 -fno-debug-types-section -fvar-tracking-assignments -g2  -DNDEBUG -DQT_NO_DEBUG -fPIC   -o CMakeFiles/elektra.dir/keytest.c.o   -c /tmp/B.crNwZC/BUILD/elektra-0.8.23/src/libs/elektra/keytest.c
make[2]: Leaving directory '/tmp/B.crNwZC/BUILD/elektra-0.8.23/build'
make[2]: Entering directory '/tmp/B.crNwZC/BUILD/elektra-0.8.23/build'
[ 11%] Building C object src/libs/elektra/CMakeFiles/elektra.dir/keyset.c.o
cd /tmp/B.crNwZC/BUILD/elektra-0.8.23/build/src/libs/elektra && /usr/bin/x86_64-pld-linux-gnux32-gcc -DHAVE_KDBCONFIG_H -Delektra_EXPORTS -I/tmp/B.crNwZC/BUILD/elektra-0.8.23/build/src/include -I/tmp/B.crNwZC/BUILD/elektra-0.8.23/src/include -I/tmp/B.crNwZC/BUILD/elektra-0.8.23/build/src/libs/elektra  -std=gnu99  -Wno-deprecated-declarations  -Wstrict-prototypes  -Wno-long-long -pedantic -Wno-variadic-macros -Wall -Wextra -Wno-overlength-strings -Wsign-compare -Wfloat-equal -Wformat -Wformat-security -Wshadow -Wcomments -Wtrigraphs -Wundef -Wuninitialized -Winit-self -Wmaybe-uninitialized -Wsign-compare -Wfloat-equal -O2 -fwrapv -pipe -Wformat -Werror=format-security -gdwarf-4 -fno-debug-types-section -fvar-tracking-assignments -g2 -Wp,-D_FORTIFY_SOURCE=2 -fstack-protector-strong --param=ssp-buffer-size=4 -Werror=trampolines -fPIC -mtune=generic -march=x86-64 -gdwarf-4 -fno-debug-types-section -fvar-tracking-assignments -g2  -DNDEBUG -DQT_NO_DEBUG -fPIC   -o CMakeFiles/elektra.dir/keyset.c.o   -c /tmp/B.crNwZC/BUILD/elektra-0.8.23/src/libs/elektra/keyset.c
In file included from /usr/include/string.h:519,
                 from /tmp/B.crNwZC/BUILD/elektra-0.8.23/src/libs/elektra/keyset.c:26:
In function 'strncpy',
    inlined from 'elektraLookupByCascading' at /tmp/B.crNwZC/BUILD/elektra-0.8.23/src/libs/elektra/keyset.c:1801:3:
/usr/include/bits/string_fortified.h:95:10: warning: '__builtin_strncpy' output truncated before terminating nul copying 4 bytes from a string of the same length [-Wstringop-truncation]
   95 |   return __builtin___strncpy_chk (__dest, __src, __len,
      |          ^~~~~~~~~~~~~~~~~~~~~~~~~~~~~~~~~~~~~~~~~~~~~~
   96 |                                   __glibc_objsize (__dest));
      |                                   ~~~~~~~~~~~~~~~~~~~~~~~~~
In function 'strncpy',
    inlined from 'elektraLookupByCascading' at /tmp/B.crNwZC/BUILD/elektra-0.8.23/src/libs/elektra/keyset.c:1832:2:
/usr/include/bits/string_fortified.h:95:10: warning: '__builtin_strncpy' output truncated before terminating nul copying 4 bytes from a string of the same length [-Wstringop-truncation]
   95 |   return __builtin___strncpy_chk (__dest, __src, __len,
      |          ^~~~~~~~~~~~~~~~~~~~~~~~~~~~~~~~~~~~~~~~~~~~~~
   96 |                                   __glibc_objsize (__dest));
      |                                   ~~~~~~~~~~~~~~~~~~~~~~~~~
In function 'strncpy',
    inlined from 'elektraLookupByCascading' at /tmp/B.crNwZC/BUILD/elektra-0.8.23/src/libs/elektra/keyset.c:1851:3:
/usr/include/bits/string_fortified.h:95:10: warning: '__builtin_strncpy' output truncated before terminating nul copying 4 bytes from a string of the same length [-Wstringop-truncation]
   95 |   return __builtin___strncpy_chk (__dest, __src, __len,
      |          ^~~~~~~~~~~~~~~~~~~~~~~~~~~~~~~~~~~~~~~~~~~~~~
   96 |                                   __glibc_objsize (__dest));
      |                                   ~~~~~~~~~~~~~~~~~~~~~~~~~
In function 'strncpy',
    inlined from 'elektraLookupByCascading' at /tmp/B.crNwZC/BUILD/elektra-0.8.23/src/libs/elektra/keyset.c:1841:3:
/usr/include/bits/string_fortified.h:95:10: warning: '__builtin_strncpy' output truncated before terminating nul copying 3 bytes from a string of the same length [-Wstringop-truncation]
   95 |   return __builtin___strncpy_chk (__dest, __src, __len,
      |          ^~~~~~~~~~~~~~~~~~~~~~~~~~~~~~~~~~~~~~~~~~~~~~
   96 |                                   __glibc_objsize (__dest));
      |                                   ~~~~~~~~~~~~~~~~~~~~~~~~~
In function 'strncpy',
    inlined from 'elektraLookupByCascading' at /tmp/B.crNwZC/BUILD/elektra-0.8.23/src/libs/elektra/keyset.c:1861:3:
/usr/include/bits/string_fortified.h:95:10: warning: '__builtin_strncpy' output truncated before terminating nul copying 6 bytes from a string of the same length [-Wstringop-truncation]
   95 |   return __builtin___strncpy_chk (__dest, __src, __len,
      |          ^~~~~~~~~~~~~~~~~~~~~~~~~~~~~~~~~~~~~~~~~~~~~~
   96 |                                   __glibc_objsize (__dest));
      |                                   ~~~~~~~~~~~~~~~~~~~~~~~~~
In function 'strncpy',
    inlined from 'ksCut' at /tmp/B.crNwZC/BUILD/elektra-0.8.23/src/libs/elektra/keyset.c:1089:5:
/usr/include/bits/string_fortified.h:95:10: warning: '__builtin_strncpy' output truncated before terminating nul copying 4 bytes from a string of the same length [-Wstringop-truncation]
   95 |   return __builtin___strncpy_chk (__dest, __src, __len,
      |          ^~~~~~~~~~~~~~~~~~~~~~~~~~~~~~~~~~~~~~~~~~~~~~
   96 |                                   __glibc_objsize (__dest));
      |                                   ~~~~~~~~~~~~~~~~~~~~~~~~~
In function 'strncpy',
    inlined from 'ksCut' at /tmp/B.crNwZC/BUILD/elektra-0.8.23/src/libs/elektra/keyset.c:1097:5:
/usr/include/bits/string_fortified.h:95:10: warning: '__builtin_strncpy' output truncated before terminating nul copying 4 bytes from a string of the same length [-Wstringop-truncation]
   95 |   return __builtin___strncpy_chk (__dest, __src, __len,
      |          ^~~~~~~~~~~~~~~~~~~~~~~~~~~~~~~~~~~~~~~~~~~~~~
   96 |                                   __glibc_objsize (__dest));
      |                                   ~~~~~~~~~~~~~~~~~~~~~~~~~
In function 'strncpy',
    inlined from 'ksCut' at /tmp/B.crNwZC/BUILD/elektra-0.8.23/src/libs/elektra/keyset.c:1105:5:
/usr/include/bits/string_fortified.h:95:10: warning: '__builtin_strncpy' output truncated before terminating nul copying 3 bytes from a string of the same length [-Wstringop-truncation]
   95 |   return __builtin___strncpy_chk (__dest, __src, __len,
      |          ^~~~~~~~~~~~~~~~~~~~~~~~~~~~~~~~~~~~~~~~~~~~~~
   96 |                                   __glibc_objsize (__dest));
      |                                   ~~~~~~~~~~~~~~~~~~~~~~~~~
In function 'strncpy',
    inlined from 'ksCut' at /tmp/B.crNwZC/BUILD/elektra-0.8.23/src/libs/elektra/keyset.c:1113:5:
/usr/include/bits/string_fortified.h:95:10: warning: '__builtin_strncpy' output truncated before terminating nul copying 4 bytes from a string of the same length [-Wstringop-truncation]
   95 |   return __builtin___strncpy_chk (__dest, __src, __len,
      |          ^~~~~~~~~~~~~~~~~~~~~~~~~~~~~~~~~~~~~~~~~~~~~~
   96 |                                   __glibc_objsize (__dest));
      |                                   ~~~~~~~~~~~~~~~~~~~~~~~~~
In function 'strncpy',
    inlined from 'ksCut' at /tmp/B.crNwZC/BUILD/elektra-0.8.23/src/libs/elektra/keyset.c:1121:5:
/usr/include/bits/string_fortified.h:95:10: warning: '__builtin_strncpy' output truncated before terminating nul copying 6 bytes from a string of the same length [-Wstringop-truncation]
   95 |   return __builtin___strncpy_chk (__dest, __src, __len,
      |          ^~~~~~~~~~~~~~~~~~~~~~~~~~~~~~~~~~~~~~~~~~~~~~
   96 |                                   __glibc_objsize (__dest));
      |                                   ~~~~~~~~~~~~~~~~~~~~~~~~~
make[2]: Leaving directory '/tmp/B.crNwZC/BUILD/elektra-0.8.23/build'
make[2]: Entering directory '/tmp/B.crNwZC/BUILD/elektra-0.8.23/build'
[ 12%] Building C object src/libs/elektra/CMakeFiles/elektra.dir/__/loader/dl.c.o
cd /tmp/B.crNwZC/BUILD/elektra-0.8.23/build/src/libs/elektra && /usr/bin/x86_64-pld-linux-gnux32-gcc -DHAVE_KDBCONFIG_H -Delektra_EXPORTS -I/tmp/B.crNwZC/BUILD/elektra-0.8.23/build/src/include -I/tmp/B.crNwZC/BUILD/elektra-0.8.23/src/include -I/tmp/B.crNwZC/BUILD/elektra-0.8.23/build/src/libs/elektra  -std=gnu99  -Wno-deprecated-declarations  -Wstrict-prototypes  -Wno-long-long -pedantic -Wno-variadic-macros -Wall -Wextra -Wno-overlength-strings -Wsign-compare -Wfloat-equal -Wformat -Wformat-security -Wshadow -Wcomments -Wtrigraphs -Wundef -Wuninitialized -Winit-self -Wmaybe-uninitialized -Wsign-compare -Wfloat-equal -O2 -fwrapv -pipe -Wformat -Werror=format-security -gdwarf-4 -fno-debug-types-section -fvar-tracking-assignments -g2 -Wp,-D_FORTIFY_SOURCE=2 -fstack-protector-strong --param=ssp-buffer-size=4 -Werror=trampolines -fPIC -mtune=generic -march=x86-64 -gdwarf-4 -fno-debug-types-section -fvar-tracking-assignments -g2  -DNDEBUG -DQT_NO_DEBUG -fPIC   -o CMakeFiles/elektra.dir/__/loader/dl.c.o   -c /tmp/B.crNwZC/BUILD/elektra-0.8.23/src/libs/loader/dl.c
make[2]: Leaving directory '/tmp/B.crNwZC/BUILD/elektra-0.8.23/build'
make[2]: Entering directory '/tmp/B.crNwZC/BUILD/elektra-0.8.23/build'
[ 12%] Linking C shared library ../../../lib/libelektra.so
cd /tmp/B.crNwZC/BUILD/elektra-0.8.23/build/src/libs/elektra && /usr/bin/cmake -E cmake_link_script CMakeFiles/elektra.dir/link.txt --verbose=1
/usr/bin/x86_64-pld-linux-gnux32-gcc -fPIC  -std=gnu99  -Wno-deprecated-declarations  -Wstrict-prototypes  -Wno-long-long -pedantic -Wno-variadic-macros -Wall -Wextra -Wno-overlength-strings -Wsign-compare -Wfloat-equal -Wformat -Wformat-security -Wshadow -Wcomments -Wtrigraphs -Wundef -Wuninitialized -Winit-self -Wmaybe-uninitialized -Wsign-compare -Wfloat-equal -O2 -fwrapv -pipe -Wformat -Werror=format-security -gdwarf-4 -fno-debug-types-section -fvar-tracking-assignments -g2 -Wp,-D_FORTIFY_SOURCE=2 -fstack-protector-strong --param=ssp-buffer-size=4 -Werror=trampolines -fPIC -mtune=generic -march=x86-64 -gdwarf-4 -fno-debug-types-section -fvar-tracking-assignments -g2  -DNDEBUG -DQT_NO_DEBUG -Wl,--version-script=/tmp/B.crNwZC/BUILD/elektra-0.8.23/src/libs/elektra/libelektra-symbols.map -Wl,--as-needed -Wl,--no-copy-dt-needed-entries -Wl,-z,relro -Wl,-z,combreloc -shared -Wl,-soname,libelektra.so.4 -o ../../../lib/libelektra.so.0.8.23 CMakeFiles/elektra.dir/backend.c.o CMakeFiles/elektra.dir/kdb.c.o CMakeFiles/elektra.dir/mount.c.o CMakeFiles/elektra.dir/plugin.c.o CMakeFiles/elektra.dir/split.c.o CMakeFiles/elektra.dir/trie.c.o CMakeFiles/elektra.dir/global.c.o CMakeFiles/elektra.dir/internal.c.o CMakeFiles/elektra.dir/kdbenum.c.o CMakeFiles/elektra.dir/key.c.o CMakeFiles/elektra.dir/keyhelpers.c.o CMakeFiles/elektra.dir/keymeta.c.o CMakeFiles/elektra.dir/keyname.c.o CMakeFiles/elektra.dir/keyset.c.o CMakeFiles/elektra.dir/keytest.c.o CMakeFiles/elektra.dir/keyvalue.c.o CMakeFiles/elektra.dir/nolog.c.o CMakeFiles/elektra.dir/opmphm.c.o CMakeFiles/elektra.dir/owner.c.o CMakeFiles/elektra.dir/proposal.c.o CMakeFiles/elektra.dir/rand.c.o CMakeFiles/elektra.dir/__/loader/dl.c.o  -Wl,-rpath,::::::::::::::::::: -ldl 
cd /tmp/B.crNwZC/BUILD/elektra-0.8.23/build/src/libs/elektra && /usr/bin/cmake -E cmake_symlink_library ../../../lib/libelektra.so.0.8.23 ../../../lib/libelektra.so.4 ../../../lib/libelektra.so
make[2]: Leaving directory '/tmp/B.crNwZC/BUILD/elektra-0.8.23/build'
make[1]: Entering directory '/tmp/B.crNwZC/BUILD/elektra-0.8.23/build'
[ 12%] Built target elektra
make[1]: Leaving directory '/tmp/B.crNwZC/BUILD/elektra-0.8.23/build'
make[2]: Entering directory '/tmp/B.crNwZC/BUILD/elektra-0.8.23/build'
[  7%] Generating html/index.html, man/man3elektra/kdb.3elektra
/usr/bin/doxygen /tmp/B.crNwZC/BUILD/elektra-0.8.23/build/doc/Doxyfile
warning: Tag `CLANG_ASSISTED_PARSING' at line 1046 of file `/tmp/B.crNwZC/BUILD/elektra-0.8.23/build/doc/Doxyfile' belongs to an option that was not enabled at compile time.
         To avoid this warning please remove this line from your configuration file or upgrade it using "doxygen -u", or recompile doxygen with this feature enabled.
warning: Tag `CLANG_OPTIONS' at line 1054 of file `/tmp/B.crNwZC/BUILD/elektra-0.8.23/build/doc/Doxyfile' belongs to an option that was not enabled at compile time.
         To avoid this warning please remove this line from your configuration file or upgrade it using "doxygen -u", or recompile doxygen with this feature enabled.
ASSERT: "0" in /tmp/B.Zt_gRQ/BUILD/doxygen-1.8.10/src/docparser.cpp (5676)
make[2]: Leaving directory '/tmp/B.crNwZC/BUILD/elektra-0.8.23/build'
make[1]: Entering directory '/tmp/B.crNwZC/BUILD/elektra-0.8.23/build'
[ 12%] Built target html
make[1]: Leaving directory '/tmp/B.crNwZC/BUILD/elektra-0.8.23/build'
make[2]: Entering directory '/tmp/B.crNwZC/BUILD/elektra-0.8.23/build'
[  6%] Building CXX object gtest/CMakeFiles/gtest.dir/src/gtest-all.cc.o
cd /tmp/B.crNwZC/BUILD/elektra-0.8.23/build/gtest && /usr/bin/x86_64-pld-linux-gnux32-g++  -DGTEST_HAS_PTHREAD=1 -I/tmp/B.crNwZC/BUILD/elektra-0.8.23/tests/gtest-1.7.0/include -I/tmp/B.crNwZC/BUILD/elektra-0.8.23/tests/gtest-1.7.0  -std=c++11  -Wno-deprecated-declarations  -Wold-style-cast -Wstrict-null-sentinel -D_GLIBCXX_USE_NANOSLEEP -Wno-missing-field-initializers -Woverloaded-virtual  -Wsign-promo  -Wno-long-long -pedantic -Wno-variadic-macros -Wall -Wextra -Wno-overlength-strings -Wsign-compare -Wfloat-equal -Wformat -Wformat-security -Wshadow -Wcomments -Wtrigraphs -Wundef -Wuninitialized -Winit-self -Wmaybe-uninitialized -O2 -fwrapv -pipe -Wformat -Werror=format-security -gdwarf-4 -fno-debug-types-section -fvar-tracking-assignments -g2 -Wp,-D_FORTIFY_SOURCE=2 -fstack-protector-strong --param=ssp-buffer-size=4 -Werror=trampolines -fPIC -mtune=generic -march=x86-64 -gdwarf-4 -fno-debug-types-section -fvar-tracking-assignments -g2  -DNDEBUG -DQT_NO_DEBUG   -w -o CMakeFiles/gtest.dir/src/gtest-all.cc.o -c /tmp/B.crNwZC/BUILD/elektra-0.8.23/tests/gtest-1.7.0/src/gtest-all.cc
make[2]: Leaving directory '/tmp/B.crNwZC/BUILD/elektra-0.8.23/build'
make[2]: Entering directory '/tmp/B.crNwZC/BUILD/elektra-0.8.23/build'
[ 12%] Linking CXX static library ../lib/libgtest.a
cd /tmp/B.crNwZC/BUILD/elektra-0.8.23/build/gtest && /usr/bin/cmake -P CMakeFiles/gtest.dir/cmake_clean_target.cmake
cd /tmp/B.crNwZC/BUILD/elektra-0.8.23/build/gtest && /usr/bin/cmake -E cmake_link_script CMakeFiles/gtest.dir/link.txt --verbose=1
/usr/bin/ar qc ../lib/libgtest.a  CMakeFiles/gtest.dir/src/gtest-all.cc.o
/usr/bin/ranlib ../lib/libgtest.a
make[2]: Leaving directory '/tmp/B.crNwZC/BUILD/elektra-0.8.23/build'
make[1]: Entering directory '/tmp/B.crNwZC/BUILD/elektra-0.8.23/build'
[ 12%] Built target gtest
make[1]: Leaving directory '/tmp/B.crNwZC/BUILD/elektra-0.8.23/build'
make: *** [Makefile:186: all] Error 2
error: Bad exit status from /tmp/B.crNwZC/BUILD/tmp/rpm-tmp.Q1IEZo (%build)


RPM build errors:
    line 103: It's not recommended to have unversioned Obsoletes: Obsoletes:	registry
    Macro expanded in comment on line 626: %{_libdir}/elektra/libelektra-crypto_botan.so

    Could not canonicalize hostname: naiad
    Bad exit status from /tmp/B.crNwZC/BUILD/tmp/rpm-tmp.Q1IEZo (%build)
ended at: Thu May 27 17:41:11 2021, done in 0:00:32.779736
error: No files produced.
+ chmod -R u+rwX /tmp/B.crNwZC/BUILD
+ rm -rf /tmp/B.crNwZC/tmp /tmp/B.crNwZC/BUILD
+ rm -rf /tmp/B.crNwZC
Begin-PLD-Builder-Info
Build-Time: user:121.33s sys:22.98s real:35.86s (faults io:317 non-io:2379786)

End-PLD-Builder-Info
[Back to list of logs] [View rpm -qa of builder]