FailedOk

th/SRPMS[OK]
th/x32[OK]
th/i686[OK]
th/x86_64[OK]

ac/SRPMS[OK]
ac/i386[OK]
ac/i586[OK]
ac/i686[OK]
ac/alpha[OK]
ac/amd64[OK]
ac/athlon[OK]
ac/ppc[OK]
ac/sparc[OK]
ac/sparc64[OK]

Advanced Search
main()
Powered by PLD Linux
(c) 2002-2024 PLD Team
$Revision: 1.37 $
Powered by NASA.
Your IP: 3.236.112.70

fakeroot 91d0eb09-0f6f-4556-8706-4f190361378e

Status:Failed
Source URL:https://buildlogs.pld-linux.org/pld/th/x32/FAIL/fakeroot,91d0eb09-0f6f-4556-8706-4f190361378e.bz2
text/plain URL:View!
rpm -qa of builder:View!
Date:2024/06/08 20:56:37
Runtime:0:00:19.114448

Toc:

  • prep
  • Executing(%prep): /bin/sh -e /tmp/B.to6ffn2m/BUILD/tmp/rpm-tmp.ZDRgIk
  • build
  • Executing(%build): /bin/sh -e /tmp/B.to6ffn2m/BUILD/tmp/rpm-tmp.8D7fSf
  • error 1
  • wrapped.h:235:40: error: expected '=', ',', ';', 'asm' or '__attribute__' before 'LSTAT64_TIME64_ARG'
  • error 2
  • wrapped.h:236:39: error: expected '=', ',', ';', 'asm' or '__attribute__' before 'STAT64_TIME64_ARG'
  • error 3
  • wrapped.h:237:40: error: expected '=', ',', ';', 'asm' or '__attribute__' before 'FSTAT64_TIME64_ARG'
  • error 4
  • wrapped.h:238:42: error: expected '=', ',', ';', 'asm' or '__attribute__' before 'FSTATAT64_TIME64_ARG'
  • error 5
  • libfakeroot_time64.c:184:25: error: expected '=', ',', ';', 'asm' or '__attribute__' before 'LSTAT64_TIME64_ARG'
  • error 6
  • libfakeroot_time64.c:203:24: error: expected '=', ',', ';', 'asm' or '__attribute__' before 'STAT64_TIME64_ARG'
  • error 7
  • libfakeroot_time64.c:221:25: error: expected '=', ',', ';', 'asm' or '__attribute__' before 'FSTAT64_TIME64_ARG'
  • error 8
  • libfakeroot_time64.c:239:27: error: expected '=', ',', ';', 'asm' or '__attribute__' before 'FSTATAT64_TIME64_ARG'
  • error 9
  • make[2]: *** [Makefile:689: libfakeroot_time64_la-libfakeroot_time64.lo] Error 1
  • error 10
  • wrapped.h:235:40: error: expected '=', ',', ';', 'asm' or '__attribute__' before 'LSTAT64_TIME64_ARG'
  • error 11
  • wrapped.h:236:39: error: expected '=', ',', ';', 'asm' or '__attribute__' before 'STAT64_TIME64_ARG'
  • error 12
  • wrapped.h:237:40: error: expected '=', ',', ';', 'asm' or '__attribute__' before 'FSTAT64_TIME64_ARG'
  • error 13
  • wrapped.h:238:42: error: expected '=', ',', ';', 'asm' or '__attribute__' before 'FSTATAT64_TIME64_ARG'
  • error 14
  • wraptmpf.h:635:24: error: expected '=', ',', ';', 'asm' or '__attribute__' before 'LSTAT64_TIME64_ARG'
  • error 15
  • wraptmpf.h:640:23: error: expected '=', ',', ';', 'asm' or '__attribute__' before 'STAT64_TIME64_ARG'
  • error 16
  • wraptmpf.h:645:24: error: expected '=', ',', ';', 'asm' or '__attribute__' before 'FSTAT64_TIME64_ARG'
  • error 17
  • wraptmpf.h:650:26: error: expected '=', ',', ';', 'asm' or '__attribute__' before 'FSTATAT64_TIME64_ARG'
  • error 18
  • wrapdef.h:235:33: error: expected '=', ',', ';', 'asm' or '__attribute__' before 'LSTAT64_TIME64_ARG'
  • error 19
  • wrapdef.h:236:32: error: expected '=', ',', ';', 'asm' or '__attribute__' before 'STAT64_TIME64_ARG'
  • error 20
  • wrapdef.h:237:33: error: expected '=', ',', ';', 'asm' or '__attribute__' before 'FSTAT64_TIME64_ARG'
  • error 21
  • wrapdef.h:238:35: error: expected '=', ',', ';', 'asm' or '__attribute__' before 'FSTATAT64_TIME64_ARG'
  • error 22
  • config.h:383:36: error: 'next___astat64_time64' undeclared here (not in a function)
  • error 23
  • config.h:379:36: error: '__astat64_time64' undeclared here (not in a function)
  • error 24
  • config.h:391:38: error: '__astatat64_time64' undeclared here (not in a function)
  • error 25
  • make[2]: *** [Makefile:682: libfakeroot.lo] Error 1
  • error 26
  • make[1]: *** [Makefile:711: all-recursive] Error 1
  • error 27
  • error: Bad exit status from /tmp/B.to6ffn2m/BUILD/tmp/rpm-tmp.8D7fSf (%build)
  • error 28
  • RPM build errors:
  • error 29
  • error: No files produced.

Content:

request from: qboosh
checking if we should skip the build
started at: Sat Jun  8 20:56:15 2024
killing old processes on a builder
sending signal 9 to pid -1
cleaning up /tmp
fetching https://srcbuilder.pld-linux.org/th//srpms/91d0eb09-0f6f-4556-8706-4f190361378e/fakeroot-1.35-1.src.rpm
fetched 583207 bytes, 1864.7 K/s
installing srpm: fakeroot-1.35-1.src.rpm
+ install -d /tmp/B.to6ffn2m/BUILD /tmp/B.to6ffn2m/RPMS
+ LC_ALL=en_US.UTF-8
+ rpm -qp --changelog fakeroot-1.35-1.src.rpm
* Sat Jun 08 2024 PLD Linux Team <feedback@pld-linux.org>
- For complete changelog see: http://git.pld-linux.org/?p=packages/fakeroot.git;a=log;h=master
* Sat Jun 08 2024 Jakub Bogusz <qboosh@pld-linux.org> 61f7eb0
- updated to 1.35 * Mon Sep 13 2021 Arkadiusz Miśkiewicz <arekm@maven.pl> e6def71
- Up to 1.26; dlsym patch obsolete (according to debian changelog for fakeroot) * Mon Jul 23 2018 Jakub Bogusz <qboosh@pld-linux.org> 0466826
- don't abuse _libexecdir macro, use pkglibdir name (automake convention) libfakeroot is private preloadable module/library, not a library to dynamically link with - URL is dead (alioth has been closed) * Wed Jul 11 2018 Arkadiusz Miśkiewicz <arekm@maven.pl> fbc1636
- up to 1.23 * Mon Oct 10 2016 Elan Ruusamäe <glen@delfi.ee> 6bc5834
- hide debug errors with glibc 2.24 * Mon Oct 10 2016 Elan Ruusamäe <glen@delfi.ee> 9ad5849
- do not redefine %{_libdir} * Sun Jul 31 2016 Jakub Bogusz <qboosh@pld-linux.org> 94c3bd5
- updated to 1.21 * Wed May 06 2015 Jakub Bogusz <qboosh@pld-linux.org> 35215a6
- updated to 1.20.2 * Wed Feb 25 2015 Elan Ruusamäe <glen@delfi.ee> 0848e23
- x32 rebuild - release 2 (by relup.sh) * Sun Jul 13 2014 Jakub Bogusz <qboosh@pld-linux.org> 50d47e4
- updated to 1.20.1 * Sat Nov 09 2013 Jakub Bogusz <qboosh@pld-linux.org> 73e5988
- updated to 1.20 * Sun May 19 2013 Jakub Bogusz <qboosh@pld-linux.org> 96b7085
- updated to 1.19 - removed obsolete man patch * Wed Sep 21 2011 Jakub Bogusz <qboosh@pld-linux.org> 7335778
- updated to 1.18 - added man patch (restores internationalized mans) * Sat Aug 20 2011 Jakub Bogusz <qboosh@pld-linux.org> 0f0ec73
- updated to 1.17 * Thu Jun 30 2011 marti <marti@pld-linux.org> d8a75ae
- up to 1.16 * Fri Jun 04 2010 arvenil <arvenil@pld-linux.org> 4163c3d
- up to 1.12.4 * Fri Jun 04 2010 Elan Ruusamäe <glen@pld-linux.org> c40c81b
- adapter * Sun Dec 07 2008 Arkadiusz Miśkiewicz <arekm@maven.pl> dcc5364
- up to 1.11 * Fri Aug 29 2008 Jakub Bogusz <qboosh@pld-linux.org> dd8e057
- updated to 1.9.6 * Sun Jul 20 2008 Jakub Bogusz <qboosh@pld-linux.org> e264c59
- updated to 1.9.5 + rpm -Uhv --nodeps --define '_topdir /tmp/B.to6ffn2m' --define '_specdir %{_topdir}' --define '_sourcedir %{_specdir}' --define '_rpmdir %{_topdir}/RPMS' --define '_builddir %{_topdir}/BUILD' fakeroot-1.35-1.src.rpm Updating / installing... fakeroot-1.35-1 ######################################## + rm -f fakeroot-1.35-1.src.rpm + install -m 700 -d /tmp/B.to6ffn2m/BUILD/tmp + TMPDIR=/tmp/B.to6ffn2m/BUILD/tmp + exec nice -n 0 rpmbuild -bp --short-circuit --nodeps --define '_topdir /tmp/B.to6ffn2m' --define '_specdir %{_topdir}' --define '_sourcedir %{_specdir}' --define '_rpmdir %{_topdir}/RPMS' --define '_builddir %{_topdir}/BUILD' --target x32-pld-linux --define 'prep exit 0' /tmp/B.to6ffn2m/fakeroot.spec Building target platforms: x32-pld-linux Building for target x32-pld-linux checking BuildConflict-ing packages rpm: Building target platforms: x32-pld-linux rpm: Building for target x32-pld-linux no BuildConflicts found checking BR rpm: Building target platforms: x32-pld-linux rpm: Building for target x32-pld-linux no BR needed building RPM using: set -ex; : build-id: 91d0eb09-0f6f-4556-8706-4f190361378e; TMPDIR=/tmp/B.to6ffn2m/BUILD/tmp exec nice -n 0 rpmbuild -bb --define '__jobs 28' --define '_smp_mflags -j28' --define '_make_opts -Otarget' --define '_pld_builder 1' --define '_topdir /tmp/B.to6ffn2m' --define '_specdir %{_topdir}' --define '_sourcedir %{_specdir}' --define '_rpmdir %{_topdir}/RPMS' --define '_builddir %{_topdir}/BUILD' --target x32-pld-linux /tmp/B.to6ffn2m/fakeroot.spec + : build-id: 91d0eb09-0f6f-4556-8706-4f190361378e + TMPDIR=/tmp/B.to6ffn2m/BUILD/tmp + exec nice -n 0 rpmbuild -bb --define '__jobs 28' --define '_smp_mflags -j28' --define '_make_opts -Otarget' --define '_pld_builder 1' --define '_topdir /tmp/B.to6ffn2m' --define '_specdir %{_topdir}' --define '_sourcedir %{_specdir}' --define '_rpmdir %{_topdir}/RPMS' --define '_builddir %{_topdir}/BUILD' --target x32-pld-linux /tmp/B.to6ffn2m/fakeroot.spec Building target platforms: x32-pld-linux Building for target x32-pld-linux Executing(%prep): /bin/sh -e /tmp/B.to6ffn2m/BUILD/tmp/rpm-tmp.ZDRgIk + umask 022 + cd /tmp/B.to6ffn2m/BUILD + cd /tmp/B.to6ffn2m/BUILD + rm -rf fakeroot-1.35 + /bin/gzip -dc /tmp/B.to6ffn2m/fakeroot_1.35.orig.tar.gz + /bin/tar -xof - + STATUS=0 + '[' 0 -ne 0 ']' + cd fakeroot-1.35 + /bin/chmod -Rf a+rX,u+w,g-w,o-w . + RPM_EC=0 + jobs -p + exit 0 Executing(%build): /bin/sh -e /tmp/B.to6ffn2m/BUILD/tmp/rpm-tmp.8D7fSf HOME=/home/users/builder PATH=/home/users/builder/GNUstep/Tools:/bin:/usr/bin:/usr/local/bin TMPDIR=/tmp/B.to6ffn2m/BUILD/tmp + umask 022 + cd /tmp/B.to6ffn2m/BUILD + cd fakeroot-1.35 + libtoolize --copy --force --install libtoolize: putting auxiliary files in '.'. libtoolize: copying file './config.guess' libtoolize: copying file './config.sub' libtoolize: copying file './install-sh' libtoolize: copying file './ltmain.sh' libtoolize: putting macros in AC_CONFIG_MACRO_DIRS, 'build-aux'. libtoolize: copying file 'build-aux/libtool.m4' libtoolize: copying file 'build-aux/ltoptions.m4' libtoolize: copying file 'build-aux/ltsugar.m4' libtoolize: copying file 'build-aux/ltversion.m4' libtoolize: copying file 'build-aux/lt~obsolete.m4' + aclocal + autoconf configure.ac:428: warning: AC_CHECK_FUNCS($WRAPPED): you should use literals ./lib/autoconf/functions.m4:117: AC_CHECK_FUNCS is expanded from... configure.ac:428: the top level configure.ac:497: warning: AC_CHECK_FUNCS($WRAPPED): you should use literals ./lib/autoconf/functions.m4:117: AC_CHECK_FUNCS is expanded from... configure.ac:497: the top level + autoheader + automake -a -c -f --foreign configure.ac:10: installing './compile' configure.ac:7: installing './missing' Makefile.am: installing './depcomp' + ./configure 'LDFLAGS=-Wl,--as-needed -Wl,--no-copy-dt-needed-entries -Wl,-z,relro -Wl,-z,combreloc ' 'CFLAGS=-O2 -fwrapv -pipe -Wformat -Werror=format-security -gdwarf-4 -fno-debug-types-section -fvar-tracking-assignments -g2 -Wp,-D_FORTIFY_SOURCE=2 -fstack-protector-strong --param=ssp-buffer-size=4 -Werror=trampolines -fPIC -mtune=generic -march=x86-64 -gdwarf-4 -fno-debug-types-section -fvar-tracking-assignments -g2 ' 'CXXFLAGS=-O2 -fwrapv -pipe -Wformat -Werror=format-security -gdwarf-4 -fno-debug-types-section -fvar-tracking-assignments -g2 -Wp,-D_FORTIFY_SOURCE=2 -fstack-protector-strong --param=ssp-buffer-size=4 -Werror=trampolines -fPIC -mtune=generic -march=x86-64 -gdwarf-4 -fno-debug-types-section -fvar-tracking-assignments -g2 ' 'FFLAGS=-O2 -fwrapv -pipe -Wformat -Werror=format-security -gdwarf-4 -fno-debug-types-section -fvar-tracking-assignments -g2 -Wp,-D_FORTIFY_SOURCE=2 -fstack-protector-strong --param=ssp-buffer-size=4 -Werror=trampolines -fPIC -mtune=generic -march=x86-64 -gdwarf-4 -fno-debug-types-section -fvar-tracking-assignments -g2 ' 'FCFLAGS=-O2 -fwrapv -pipe -Wformat -Werror=format-security -gdwarf-4 -fno-debug-types-section -fvar-tracking-assignments -g2 -Wp,-D_FORTIFY_SOURCE=2 -fstack-protector-strong --param=ssp-buffer-size=4 -Werror=trampolines -fPIC -mtune=generic -march=x86-64 -gdwarf-4 -fno-debug-types-section -fvar-tracking-assignments -g2 ' 'CPPFLAGS=' 'CC=x86_64-pld-linux-gnux32-gcc' 'CXX=x86_64-pld-linux-gnux32-g++' '--host=x86_64-pld-linux-gnux32' '--build=x86_64-pld-linux-gnux32' '--prefix=/usr' '--exec-prefix=/usr' '--bindir=/usr/bin' '--sbindir=/usr/sbin' '--sysconfdir=/etc' '--datadir=/usr/share' '--includedir=/usr/include' '--libdir=/usr/libx32' '--libexecdir=/usr/libexec' '--localstatedir=/var' '--sharedstatedir=/var/lib' '--mandir=/usr/share/man' '--infodir=/usr/share/info' '--x-libraries=/usr/libx32' '--libdir=/usr/libx32/libfakeroot' --disable-static checking build system type... x86_64-pld-linux-gnux32 checking host system type... x86_64-pld-linux-gnux32 checking target system type... x86_64-pld-linux-gnux32 checking for a BSD-compatible install... /usr/bin/install -c checking whether build environment is sane... yes checking for a race-free mkdir -p... /bin/mkdir -p checking for mawk... mawk checking whether make sets $(MAKE)... yes checking whether make supports nested variables... yes checking whether to enable maintainer-specific portions of Makefiles... no checking whether make supports the include directive... yes (GNU style) checking for x86_64-pld-linux-gnux32-gcc... x86_64-pld-linux-gnux32-gcc checking whether the C compiler works... yes checking for C compiler default output file name... a.out checking for suffix of executables... checking whether we are cross compiling... no checking for suffix of object files... o checking whether the compiler supports GNU C... yes checking whether x86_64-pld-linux-gnux32-gcc accepts -g... yes checking for x86_64-pld-linux-gnux32-gcc option to enable C11 features... none needed checking whether x86_64-pld-linux-gnux32-gcc understands -c and -o together... yes checking dependency style of x86_64-pld-linux-gnux32-gcc... gcc3 checking how to run the C preprocessor... x86_64-pld-linux-gnux32-gcc -E checking whether make sets $(MAKE)... (cached) yes checking how to print strings... print -r checking for a sed that does not truncate output... /bin/sed checking for grep that handles long lines and -e... /bin/grep checking for egrep... /bin/grep -E checking for fgrep... /bin/grep -F checking for ld used by x86_64-pld-linux-gnux32-gcc... /usr/bin/ld checking if the linker (/usr/bin/ld) is GNU ld... yes checking for BSD- or MS-compatible name lister (nm)... /usr/bin/nm -B checking the name lister (/usr/bin/nm -B) interface... BSD nm checking whether ln -s works... yes checking the maximum length of command line arguments... 1572864 checking how to convert x86_64-pld-linux-gnux32 file names to x86_64-pld-linux-gnux32 format... func_convert_file_noop checking how to convert x86_64-pld-linux-gnux32 file names to toolchain format... func_convert_file_noop checking for /usr/bin/ld option to reload object files... -r checking for x86_64-pld-linux-gnux32-file... no checking for file... file checking for x86_64-pld-linux-gnux32-objdump... no checking for objdump... objdump checking how to recognize dependent libraries... pass_all checking for x86_64-pld-linux-gnux32-dlltool... no checking for dlltool... no checking how to associate runtime and link libraries... print -r -- checking for x86_64-pld-linux-gnux32-ar... no checking for ar... ar checking for archiver @FILE support... @ checking for x86_64-pld-linux-gnux32-strip... no checking for strip... strip checking for x86_64-pld-linux-gnux32-ranlib... no checking for ranlib... ranlib checking command to parse /usr/bin/nm -B output from x86_64-pld-linux-gnux32-gcc object... ok checking for sysroot... no checking for a working dd... /bin/dd checking how to truncate binary pipes... /bin/dd bs=4096 count=1 checking for x86_64-pld-linux-gnux32-mt... no checking for mt... no checking if : is a manifest tool... no checking for stdio.h... yes checking for stdlib.h... yes checking for string.h... yes checking for inttypes.h... yes checking for stdint.h... yes checking for strings.h... yes checking for sys/stat.h... yes checking for sys/types.h... yes checking for unistd.h... yes checking for dlfcn.h... yes checking for objdir... .libs checking if x86_64-pld-linux-gnux32-gcc supports -fno-rtti -fno-exceptions... no checking for x86_64-pld-linux-gnux32-gcc option to produce PIC... -fPIC -DPIC checking if x86_64-pld-linux-gnux32-gcc PIC flag -fPIC -DPIC works... yes checking if x86_64-pld-linux-gnux32-gcc static flag -static works... yes checking if x86_64-pld-linux-gnux32-gcc supports -c -o file.o... yes checking if x86_64-pld-linux-gnux32-gcc supports -c -o file.o... (cached) yes checking whether the x86_64-pld-linux-gnux32-gcc linker (/usr/bin/ld -m elf32_x86_64) supports shared libraries... yes checking whether -lc should be explicitly linked in... no checking dynamic linker characteristics... GNU/Linux ld.so checking how to hardcode library paths into programs... immediate checking whether stripping libraries is possible... yes checking if libtool supports shared libraries... yes checking whether to build shared libraries... yes checking whether to build static libraries... no checking which IPC method to use... (cached) sysv checking whether SysV IPC message queues are actually working on the host... Yes checking which database format to use... (cached) inode checking for dlopen in -ldl... yes checking for dirent.h that defines DIR... yes checking for library containing opendir... none required checking for fcntl.h... yes checking for unistd.h... (cached) yes checking for features.h... yes checking for sys/feature_tests.h... no checking for pthread.h... yes checking for stdint.h... (cached) yes checking for inttypes.h... (cached) yes checking for grp.h... yes checking for endian.h... yes checking for sys/sysmacros.h... yes checking for sys/socket.h... yes checking for sys/acl.h... yes checking for sys/capability.h... yes checking for sys/xattr.h... yes checking for fts.h... yes checking for an ANSI C-conforming const... yes checking for mode_t... yes checking for off_t... yes checking for size_t... yes checking for return value and second and third argument of readlink... int, char, size_t checking for first argument of setgroups... size_t checking for union semun... no checking for __xmknod... yes checking for type of arg of __xmknod... needs * checking for __xmknodat... yes checking for type of arg of __xmknodat... needs * checking for type of arg of initgroups... gid_t checking for type of arg of setreuid... gid_t checking for type of arg of setregid... gid_t checking for type of second arg to stat... struct stat * checking for d_off in struct dirent... yes checking for d_type in struct dirent... yes checking for acl_t struct... yes checking for fchmodat... yes checking for fchownat... yes checking for fstatat... yes checking for mkdirat... yes checking for mknodat... yes checking for openat... yes checking for renameat... yes checking for renameat2... yes checking for unlinkat... yes checking for lchmod... yes checking for fgetattrlist... no checking for library containing acl_get_fd... -lacl checking for acl_get_fd... yes checking for library containing acl_trivial... no checking for acl_trivial... no checking for capset... yes checking for listxattr... yes checking for llistxattr... yes checking for flistxattr... yes checking for getxattr... yes checking for lgetxattr... yes checking for fgetxattr... yes checking for setxattr... yes checking for lsetxattr... yes checking for fsetxattr... yes checking for removexattr... yes checking for lremovexattr... yes checking for fremovexattr... yes checking for statx... yes checking if we need to cope with time64... checking for egrep -e... (cached) /bin/grep -E yes checking for __xstat... yes Extra wrapper for stat is required because of __xstat checking for __fxstat... yes Extra wrapper for fstat is required because of __fxstat checking for __lxstat... yes Extra wrapper for lstat is required because of __lxstat checking for __fxstatat... yes Extra wrapper for fstatat is required because of __fxstatat checking for __xstat64... yes Extra wrapper for stat64 is required because of __xstat64 checking for __fxstat64... yes Extra wrapper for fstat64 is required because of __fxstat64 checking for __lxstat64... yes Extra wrapper for lstat64 is required because of __lxstat64 checking for __fxstatat64... yes Extra wrapper for fstatat64 is required because of __fxstatat64 checking for __xmknod... (cached) yes Extra wrapper for mknod is required because of __xmknod checking for __xmknodat... (cached) yes Extra wrapper for mknodat is required because of __xmknodat checking for __stat64_time64... no checking for stat64_time64... no checking for __fstat64_time64... no checking for fstat64_time64... no checking for __lstat64_time64... no checking for lstat64_time64... no checking for __fstatat64_time64... no checking for fstatat64_time64... no created fakerootconfig.h checking for strdup... yes checking for strstr... yes checking for getresuid... yes checking for setresuid... yes checking for getresgid... yes checking for setresgid... yes checking for setfsuid... yes checking for setfsgid... yes checking for fts_read... yes checking for fts_children... yes checking for close_range... yes checking for x86_64-pld-linux-gnux32-gcc options needed to detect all undeclared functions... none needed checking whether setenv is declared... yes checking whether unsetenv is declared... yes checking for setenv... yes checking for macOS/Darwin... no checking that generated files are newer than configure... done configure: creating ./config.status config.status: creating Makefile config.status: creating scripts/Makefile config.status: creating doc/Makefile config.status: creating doc/de/Makefile config.status: creating doc/es/Makefile config.status: creating doc/fr/Makefile config.status: creating doc/nl/Makefile config.status: creating doc/pt/Makefile config.status: creating doc/ro/Makefile config.status: creating doc/sv/Makefile config.status: creating test/Makefile config.status: creating test/defs config.status: creating config.h config.status: executing depfiles commands config.status: executing libtool commands + cd doc + po4a -k 0 --rm-backups --variable 'srcdir=../doc/' po4a/po4a.cfg + cd .. + /usr/bin/make -Otarget -j28 /usr/bin/make all-recursive Making all in doc Making all in de make[3]: Nothing to be done for 'all'. Making all in es make[3]: Nothing to be done for 'all'. Making all in fr make[3]: Nothing to be done for 'all'. Making all in nl make[3]: Nothing to be done for 'all'. Making all in pt make[3]: Nothing to be done for 'all'. Making all in ro make[3]: Nothing to be done for 'all'. Making all in sv make[3]: Nothing to be done for 'all'. make[3]: Nothing to be done for 'all-am'. Making all in scripts make[2]: Entering directory '/tmp/B.to6ffn2m/BUILD/fakeroot-1.35/scripts' sed -e 's,[@]prefix[@],/usr,g' -e 's,[@]bindir[@],/usr/bin,g' -e 's,[@]libdir[@],/usr/libx32/libfakeroot,g' -e 's,[@]fakeroot_transformed[@],'`echo fakeroot | sed -e 's,x,x,'`',g' -e 's,[@]faked_transformed[@],'`echo faked | sed -e 's,x,x,'`',g' -e 's,[@]signal[@],TERM,g' -e 's,[@]SHELL[@],/bin/sh,g' -e 's,[@]VERSION[@],1.35,g' -e 's,[@]DLSUFFIX[@],.so,g' -e 's,[@]LDLIBPATHVAR[@],LD_LIBRARY_PATH,g' -e 's,[@]LDPRELOADVAR[@],LD_PRELOAD,g' -e 's,[@]LDPRELOADABS[@],0,g' -e 's,[@]LDEXTRAVAR[@],,g' -e 's,[@]MACOSX_FALSE[@],,g' -e 's,[@]MACOSX_TRUE[@],#,g' < ./fakeroot.in > fakeroot chmod +x fakeroot make[2]: Leaving directory '/tmp/B.to6ffn2m/BUILD/fakeroot-1.35/scripts' Making all in test make[2]: Nothing to be done for 'all'. make[2]: Entering directory '/tmp/B.to6ffn2m/BUILD/fakeroot-1.35' awk -f ./wrapawk < ./wrapfunc.inp make[2]: Leaving directory '/tmp/B.to6ffn2m/BUILD/fakeroot-1.35' make[2]: Entering directory '/tmp/B.to6ffn2m/BUILD/fakeroot-1.35' awk -f ./wrapawk < ./wrapfunc.inp make[2]: Leaving directory '/tmp/B.to6ffn2m/BUILD/fakeroot-1.35' make[2]: Entering directory '/tmp/B.to6ffn2m/BUILD/fakeroot-1.35' x86_64-pld-linux-gnux32-gcc -DHAVE_CONFIG_H -I. -O2 -fwrapv -pipe -Wformat -Werror=format-security -gdwarf-4 -fno-debug-types-section -fvar-tracking-assignments -g2 -Wp,-D_FORTIFY_SOURCE=2 -fstack-protector-strong --param=ssp-buffer-size=4 -Werror=trampolines -fPIC -mtune=generic -march=x86-64 -gdwarf-4 -fno-debug-types-section -fvar-tracking-assignments -g2 -MT simple.o -MD -MP -MF .deps/simple.Tpo -c -o simple.o simple.c mv -f .deps/simple.Tpo .deps/simple.Po make[2]: Leaving directory '/tmp/B.to6ffn2m/BUILD/fakeroot-1.35' make[2]: Entering directory '/tmp/B.to6ffn2m/BUILD/fakeroot-1.35' /bin/sh ./libtool --tag=CC --mode=compile x86_64-pld-linux-gnux32-gcc -DHAVE_CONFIG_H -I. -O2 -fwrapv -pipe -Wformat -Werror=format-security -gdwarf-4 -fno-debug-types-section -fvar-tracking-assignments -g2 -Wp,-D_FORTIFY_SOURCE=2 -fstack-protector-strong --param=ssp-buffer-size=4 -Werror=trampolines -fPIC -mtune=generic -march=x86-64 -gdwarf-4 -fno-debug-types-section -fvar-tracking-assignments -g2 -MT libfakeroot_unix2003.lo -MD -MP -MF .deps/libfakeroot_unix2003.Tpo -c -o libfakeroot_unix2003.lo libfakeroot_unix2003.c libtool: compile: x86_64-pld-linux-gnux32-gcc -DHAVE_CONFIG_H -I. -O2 -fwrapv -pipe -Wformat -Werror=format-security -gdwarf-4 -fno-debug-types-section -fvar-tracking-assignments -g2 -Wp,-D_FORTIFY_SOURCE=2 -fstack-protector-strong --param=ssp-buffer-size=4 -Werror=trampolines -fPIC -mtune=generic -march=x86-64 -gdwarf-4 -fno-debug-types-section -fvar-tracking-assignments -g2 -MT libfakeroot_unix2003.lo -MD -MP -MF .deps/libfakeroot_unix2003.Tpo -c libfakeroot_unix2003.c -fPIC -DPIC -o .libs/libfakeroot_unix2003.o mv -f .deps/libfakeroot_unix2003.Tpo .deps/libfakeroot_unix2003.Plo make[2]: Leaving directory '/tmp/B.to6ffn2m/BUILD/fakeroot-1.35' make[2]: Entering directory '/tmp/B.to6ffn2m/BUILD/fakeroot-1.35' /bin/sh ./libtool --tag=CC --mode=compile x86_64-pld-linux-gnux32-gcc -DHAVE_CONFIG_H -I. -O2 -fwrapv -pipe -Wformat -Werror=format-security -gdwarf-4 -fno-debug-types-section -fvar-tracking-assignments -g2 -Wp,-D_FORTIFY_SOURCE=2 -fstack-protector-strong --param=ssp-buffer-size=4 -Werror=trampolines -fPIC -mtune=generic -march=x86-64 -gdwarf-4 -fno-debug-types-section -fvar-tracking-assignments -g2 -MT libfakeroot_inode64.lo -MD -MP -MF .deps/libfakeroot_inode64.Tpo -c -o libfakeroot_inode64.lo libfakeroot_inode64.c libtool: compile: x86_64-pld-linux-gnux32-gcc -DHAVE_CONFIG_H -I. -O2 -fwrapv -pipe -Wformat -Werror=format-security -gdwarf-4 -fno-debug-types-section -fvar-tracking-assignments -g2 -Wp,-D_FORTIFY_SOURCE=2 -fstack-protector-strong --param=ssp-buffer-size=4 -Werror=trampolines -fPIC -mtune=generic -march=x86-64 -gdwarf-4 -fno-debug-types-section -fvar-tracking-assignments -g2 -MT libfakeroot_inode64.lo -MD -MP -MF .deps/libfakeroot_inode64.Tpo -c libfakeroot_inode64.c -fPIC -DPIC -o .libs/libfakeroot_inode64.o mv -f .deps/libfakeroot_inode64.Tpo .deps/libfakeroot_inode64.Plo make[2]: Leaving directory '/tmp/B.to6ffn2m/BUILD/fakeroot-1.35' make[2]: Entering directory '/tmp/B.to6ffn2m/BUILD/fakeroot-1.35' /bin/sh ./libtool --tag=CC --mode=compile x86_64-pld-linux-gnux32-gcc -DHAVE_CONFIG_H -I. -D_FILE_OFFSET_BITS=64 -D_TIME_BITS=64 -O2 -fwrapv -pipe -Wformat -Werror=format-security -gdwarf-4 -fno-debug-types-section -fvar-tracking-assignments -g2 -Wp,-D_FORTIFY_SOURCE=2 -fstack-protector-strong --param=ssp-buffer-size=4 -Werror=trampolines -fPIC -mtune=generic -march=x86-64 -gdwarf-4 -fno-debug-types-section -fvar-tracking-assignments -g2 -MT libfakeroot_time64_la-libfakeroot_time64.lo -MD -MP -MF .deps/libfakeroot_time64_la-libfakeroot_time64.Tpo -c -o libfakeroot_time64_la-libfakeroot_time64.lo `test -f 'libfakeroot_time64.c' || echo './'`libfakeroot_time64.c libtool: compile: x86_64-pld-linux-gnux32-gcc -DHAVE_CONFIG_H -I. -D_FILE_OFFSET_BITS=64 -D_TIME_BITS=64 -O2 -fwrapv -pipe -Wformat -Werror=format-security -gdwarf-4 -fno-debug-types-section -fvar-tracking-assignments -g2 -Wp,-D_FORTIFY_SOURCE=2 -fstack-protector-strong --param=ssp-buffer-size=4 -Werror=trampolines -fPIC -mtune=generic -march=x86-64 -gdwarf-4 -fno-debug-types-section -fvar-tracking-assignments -g2 -MT libfakeroot_time64_la-libfakeroot_time64.lo -MD -MP -MF .deps/libfakeroot_time64_la-libfakeroot_time64.Tpo -c libfakeroot_time64.c -fPIC -DPIC -o .libs/libfakeroot_time64_la-libfakeroot_time64.o In file included from libfakeroot_time64.c:19: wrapped.h:227:97: warning: 'struct statx' declared inside parameter list will not be visible outside of this definition or declaration 227 | extern int (*next_statx)(int dir_fd, const char *pathname, int flags, unsigned int mask, struct statx *buf); | ^~~~~ wrapped.h:235:40: error: expected '=', ',', ';', 'asm' or '__attribute__' before 'LSTAT64_TIME64_ARG' 235 | extern int (*NEXT_LSTAT64_TIME64_NOARG)LSTAT64_TIME64_ARG(int ver, const char *file_name, struct stat64 *buf); | ^~~~~~~~~~~~~~~~~~ wrapped.h:236:39: error: expected '=', ',', ';', 'asm' or '__attribute__' before 'STAT64_TIME64_ARG' 236 | extern int (*NEXT_STAT64_TIME64_NOARG)STAT64_TIME64_ARG(int ver, const char *file_name, struct stat64 *buf); | ^~~~~~~~~~~~~~~~~ wrapped.h:237:40: error: expected '=', ',', ';', 'asm' or '__attribute__' before 'FSTAT64_TIME64_ARG' 237 | extern int (*NEXT_FSTAT64_TIME64_NOARG)FSTAT64_TIME64_ARG(int ver, int fd, struct stat64 *buf); | ^~~~~~~~~~~~~~~~~~ wrapped.h:238:42: error: expected '=', ',', ';', 'asm' or '__attribute__' before 'FSTATAT64_TIME64_ARG' 238 | extern int (*NEXT_FSTATAT64_TIME64_NOARG)FSTATAT64_TIME64_ARG(int ver, int dir_fd, const char *path, struct stat64 *buf, int flags); | ^~~~~~~~~~~~~~~~~~~~ libfakeroot_time64.c:184:25: error: expected '=', ',', ';', 'asm' or '__attribute__' before 'LSTAT64_TIME64_ARG' 184 | int WRAP_LSTAT64_TIME64 LSTAT64_TIME64_ARG(int ver, | ^~~~~~~~~~~~~~~~~~ libfakeroot_time64.c:203:24: error: expected '=', ',', ';', 'asm' or '__attribute__' before 'STAT64_TIME64_ARG' 203 | int WRAP_STAT64_TIME64 STAT64_TIME64_ARG(int ver, | ^~~~~~~~~~~~~~~~~ libfakeroot_time64.c:221:25: error: expected '=', ',', ';', 'asm' or '__attribute__' before 'FSTAT64_TIME64_ARG' 221 | int WRAP_FSTAT64_TIME64 FSTAT64_TIME64_ARG(int ver, | ^~~~~~~~~~~~~~~~~~ libfakeroot_time64.c:239:27: error: expected '=', ',', ';', 'asm' or '__attribute__' before 'FSTATAT64_TIME64_ARG' 239 | int WRAP_FSTATAT64_TIME64 FSTATAT64_TIME64_ARG(int ver, | ^~~~~~~~~~~~~~~~~~~~ make[2]: *** [Makefile:689: libfakeroot_time64_la-libfakeroot_time64.lo] Error 1 make[2]: Leaving directory '/tmp/B.to6ffn2m/BUILD/fakeroot-1.35' make[2]: *** Waiting for unfinished jobs.... make[2]: Entering directory '/tmp/B.to6ffn2m/BUILD/fakeroot-1.35' /bin/sh ./libtool --tag=CC --mode=compile x86_64-pld-linux-gnux32-gcc -DHAVE_CONFIG_H -I. -O2 -fwrapv -pipe -Wformat -Werror=format-security -gdwarf-4 -fno-debug-types-section -fvar-tracking-assignments -g2 -Wp,-D_FORTIFY_SOURCE=2 -fstack-protector-strong --param=ssp-buffer-size=4 -Werror=trampolines -fPIC -mtune=generic -march=x86-64 -gdwarf-4 -fno-debug-types-section -fvar-tracking-assignments -g2 -MT libfakeroot.lo -MD -MP -MF .deps/libfakeroot.Tpo -c -o libfakeroot.lo libfakeroot.c libtool: compile: x86_64-pld-linux-gnux32-gcc -DHAVE_CONFIG_H -I. -O2 -fwrapv -pipe -Wformat -Werror=format-security -gdwarf-4 -fno-debug-types-section -fvar-tracking-assignments -g2 -Wp,-D_FORTIFY_SOURCE=2 -fstack-protector-strong --param=ssp-buffer-size=4 -Werror=trampolines -fPIC -mtune=generic -march=x86-64 -gdwarf-4 -fno-debug-types-section -fvar-tracking-assignments -g2 -MT libfakeroot.lo -MD -MP -MF .deps/libfakeroot.Tpo -c libfakeroot.c -fPIC -DPIC -o .libs/libfakeroot.o In file included from libfakeroot.c:271: wrapped.h:235:40: error: expected '=', ',', ';', 'asm' or '__attribute__' before 'LSTAT64_TIME64_ARG' 235 | extern int (*NEXT_LSTAT64_TIME64_NOARG)LSTAT64_TIME64_ARG(int ver, const char *file_name, struct stat64 *buf); | ^~~~~~~~~~~~~~~~~~ wrapped.h:236:39: error: expected '=', ',', ';', 'asm' or '__attribute__' before 'STAT64_TIME64_ARG' 236 | extern int (*NEXT_STAT64_TIME64_NOARG)STAT64_TIME64_ARG(int ver, const char *file_name, struct stat64 *buf); | ^~~~~~~~~~~~~~~~~ wrapped.h:237:40: error: expected '=', ',', ';', 'asm' or '__attribute__' before 'FSTAT64_TIME64_ARG' 237 | extern int (*NEXT_FSTAT64_TIME64_NOARG)FSTAT64_TIME64_ARG(int ver, int fd, struct stat64 *buf); | ^~~~~~~~~~~~~~~~~~ wrapped.h:238:42: error: expected '=', ',', ';', 'asm' or '__attribute__' before 'FSTATAT64_TIME64_ARG' 238 | extern int (*NEXT_FSTATAT64_TIME64_NOARG)FSTATAT64_TIME64_ARG(int ver, int dir_fd, const char *path, struct stat64 *buf, int flags); | ^~~~~~~~~~~~~~~~~~~~ In file included from libfakeroot.c:272: wraptmpf.h:635:24: error: expected '=', ',', ';', 'asm' or '__attribute__' before 'LSTAT64_TIME64_ARG' 635 | int TMP_LSTAT64_TIME64 LSTAT64_TIME64_ARG(int ver, const char *file_name, struct stat64 *buf){ | ^~~~~~~~~~~~~~~~~~ wraptmpf.h:640:23: error: expected '=', ',', ';', 'asm' or '__attribute__' before 'STAT64_TIME64_ARG' 640 | int TMP_STAT64_TIME64 STAT64_TIME64_ARG(int ver, const char *file_name, struct stat64 *buf){ | ^~~~~~~~~~~~~~~~~ wraptmpf.h:645:24: error: expected '=', ',', ';', 'asm' or '__attribute__' before 'FSTAT64_TIME64_ARG' 645 | int TMP_FSTAT64_TIME64 FSTAT64_TIME64_ARG(int ver, int fd, struct stat64 *buf){ | ^~~~~~~~~~~~~~~~~~ wraptmpf.h:650:26: error: expected '=', ',', ';', 'asm' or '__attribute__' before 'FSTATAT64_TIME64_ARG' 650 | int TMP_FSTATAT64_TIME64 FSTATAT64_TIME64_ARG(int ver, int dir_fd, const char *path, struct stat64 *buf, int flags){ | ^~~~~~~~~~~~~~~~~~~~ In file included from libfakeroot.c:273: wrapdef.h:235:33: error: expected '=', ',', ';', 'asm' or '__attribute__' before 'LSTAT64_TIME64_ARG' 235 | int (*NEXT_LSTAT64_TIME64_NOARG)LSTAT64_TIME64_ARG(int ver, const char *file_name, struct stat64 *buf)=TMP_LSTAT64_TIME64; | ^~~~~~~~~~~~~~~~~~ wrapdef.h:236:32: error: expected '=', ',', ';', 'asm' or '__attribute__' before 'STAT64_TIME64_ARG' 236 | int (*NEXT_STAT64_TIME64_NOARG)STAT64_TIME64_ARG(int ver, const char *file_name, struct stat64 *buf)=TMP_STAT64_TIME64; | ^~~~~~~~~~~~~~~~~ wrapdef.h:237:33: error: expected '=', ',', ';', 'asm' or '__attribute__' before 'FSTAT64_TIME64_ARG' 237 | int (*NEXT_FSTAT64_TIME64_NOARG)FSTAT64_TIME64_ARG(int ver, int fd, struct stat64 *buf)=TMP_FSTAT64_TIME64; | ^~~~~~~~~~~~~~~~~~ wrapdef.h:238:35: error: expected '=', ',', ';', 'asm' or '__attribute__' before 'FSTATAT64_TIME64_ARG' 238 | int (*NEXT_FSTATAT64_TIME64_NOARG)FSTATAT64_TIME64_ARG(int ver, int dir_fd, const char *path, struct stat64 *buf, int flags)=TMP_FSTATAT64_TIME64; | ^~~~~~~~~~~~~~~~~~~~ In file included from communicate.h:19, from libfakeroot.c:65: config.h:383:36: error: 'next___astat64_time64' undeclared here (not in a function) 383 | #define NEXT_LSTAT64_TIME64_NOARG next___astat64_time64 | ^~~~~~~~~~~~~~~~~~~~~ wrapstruct.h:236:14: note: in expansion of macro 'NEXT_LSTAT64_TIME64_NOARG' 236 | {(void(*))&NEXT_LSTAT64_TIME64_NOARG, WRAP_LSTAT64_TIME64_QUOTE}, | ^~~~~~~~~~~~~~~~~~~~~~~~~ config.h:379:36: error: '__astat64_time64' undeclared here (not in a function) 379 | #define WRAP_LSTAT64_TIME64_QUOTE __astat64_time64 | ^~~~~~~~~~~~~~~~ wrapstruct.h:236:41: note: in expansion of macro 'WRAP_LSTAT64_TIME64_QUOTE' 236 | {(void(*))&NEXT_LSTAT64_TIME64_NOARG, WRAP_LSTAT64_TIME64_QUOTE}, | ^~~~~~~~~~~~~~~~~~~~~~~~~ config.h:391:38: error: '__astatat64_time64' undeclared here (not in a function) 391 | #define WRAP_FSTATAT64_TIME64_QUOTE __astatat64_time64 | ^~~~~~~~~~~~~~~~~~ wrapstruct.h:239:43: note: in expansion of macro 'WRAP_FSTATAT64_TIME64_QUOTE' 239 | {(void(*))&NEXT_FSTATAT64_TIME64_NOARG, WRAP_FSTATAT64_TIME64_QUOTE}, | ^~~~~~~~~~~~~~~~~~~~~~~~~~~ make[2]: *** [Makefile:682: libfakeroot.lo] Error 1 make[2]: Leaving directory '/tmp/B.to6ffn2m/BUILD/fakeroot-1.35' make[2]: Entering directory '/tmp/B.to6ffn2m/BUILD/fakeroot-1.35' /bin/sh ./libtool --tag=CC --mode=link x86_64-pld-linux-gnux32-gcc -O2 -fwrapv -pipe -Wformat -Werror=format-security -gdwarf-4 -fno-debug-types-section -fvar-tracking-assignments -g2 -Wp,-D_FORTIFY_SOURCE=2 -fstack-protector-strong --param=ssp-buffer-size=4 -Werror=trampolines -fPIC -mtune=generic -march=x86-64 -gdwarf-4 -fno-debug-types-section -fvar-tracking-assignments -g2 -Wl,--as-needed -Wl,--no-copy-dt-needed-entries -Wl,-z,relro -Wl,-z,combreloc -o simple simple.o -ldl libtool: link: x86_64-pld-linux-gnux32-gcc -O2 -fwrapv -pipe -Wformat -Werror=format-security -gdwarf-4 -fno-debug-types-section -fvar-tracking-assignments -g2 -Wp,-D_FORTIFY_SOURCE=2 -fstack-protector-strong --param=ssp-buffer-size=4 -Werror=trampolines -fPIC -mtune=generic -march=x86-64 -gdwarf-4 -fno-debug-types-section -fvar-tracking-assignments -g2 -Wl,--as-needed -Wl,--no-copy-dt-needed-entries -Wl,-z -Wl,relro -Wl,-z -Wl,combreloc -o simple simple.o -ldl make[2]: Leaving directory '/tmp/B.to6ffn2m/BUILD/fakeroot-1.35' make[2]: Entering directory '/tmp/B.to6ffn2m/BUILD/fakeroot-1.35' /bin/sh ./libtool --tag=CC --mode=compile x86_64-pld-linux-gnux32-gcc -DHAVE_CONFIG_H -I. -O2 -fwrapv -pipe -Wformat -Werror=format-security -gdwarf-4 -fno-debug-types-section -fvar-tracking-assignments -g2 -Wp,-D_FORTIFY_SOURCE=2 -fstack-protector-strong --param=ssp-buffer-size=4 -Werror=trampolines -fPIC -mtune=generic -march=x86-64 -gdwarf-4 -fno-debug-types-section -fvar-tracking-assignments -g2 -MT communicate.lo -MD -MP -MF .deps/communicate.Tpo -c -o communicate.lo communicate.c libtool: compile: x86_64-pld-linux-gnux32-gcc -DHAVE_CONFIG_H -I. -O2 -fwrapv -pipe -Wformat -Werror=format-security -gdwarf-4 -fno-debug-types-section -fvar-tracking-assignments -g2 -Wp,-D_FORTIFY_SOURCE=2 -fstack-protector-strong --param=ssp-buffer-size=4 -Werror=trampolines -fPIC -mtune=generic -march=x86-64 -gdwarf-4 -fno-debug-types-section -fvar-tracking-assignments -g2 -MT communicate.lo -MD -MP -MF .deps/communicate.Tpo -c communicate.c -fPIC -DPIC -o .libs/communicate.o mv -f .deps/communicate.Tpo .deps/communicate.Plo make[2]: Leaving directory '/tmp/B.to6ffn2m/BUILD/fakeroot-1.35' make[2]: Entering directory '/tmp/B.to6ffn2m/BUILD/fakeroot-1.35' /bin/sh ./libtool --tag=CC --mode=link x86_64-pld-linux-gnux32-gcc -O2 -fwrapv -pipe -Wformat -Werror=format-security -gdwarf-4 -fno-debug-types-section -fvar-tracking-assignments -g2 -Wp,-D_FORTIFY_SOURCE=2 -fstack-protector-strong --param=ssp-buffer-size=4 -Werror=trampolines -fPIC -mtune=generic -march=x86-64 -gdwarf-4 -fno-debug-types-section -fvar-tracking-assignments -g2 -Wl,--as-needed -Wl,--no-copy-dt-needed-entries -Wl,-z,relro -Wl,-z,combreloc -o libmacosx.la libfakeroot_inode64.lo libfakeroot_unix2003.lo -ldl libtool: link: ar cr .libs/libmacosx.a .libs/libfakeroot_inode64.o .libs/libfakeroot_unix2003.o libtool: link: ranlib .libs/libmacosx.a libtool: link: ( cd ".libs" && rm -f "libmacosx.la" && ln -s "../libmacosx.la" "libmacosx.la" ) make[2]: Leaving directory '/tmp/B.to6ffn2m/BUILD/fakeroot-1.35' make[2]: Entering directory '/tmp/B.to6ffn2m/BUILD/fakeroot-1.35' x86_64-pld-linux-gnux32-gcc -DHAVE_CONFIG_H -I. -O2 -fwrapv -pipe -Wformat -Werror=format-security -gdwarf-4 -fno-debug-types-section -fvar-tracking-assignments -g2 -Wp,-D_FORTIFY_SOURCE=2 -fstack-protector-strong --param=ssp-buffer-size=4 -Werror=trampolines -fPIC -mtune=generic -march=x86-64 -gdwarf-4 -fno-debug-types-section -fvar-tracking-assignments -g2 -MT faked.o -MD -MP -MF .deps/faked.Tpo -c -o faked.o faked.c mv -f .deps/faked.Tpo .deps/faked.Po make[2]: Leaving directory '/tmp/B.to6ffn2m/BUILD/fakeroot-1.35' make[1]: *** [Makefile:711: all-recursive] Error 1 make: *** [Makefile:469: all] Error 2 error: Bad exit status from /tmp/B.to6ffn2m/BUILD/tmp/rpm-tmp.8D7fSf (%build) RPM build errors: Bad exit status from /tmp/B.to6ffn2m/BUILD/tmp/rpm-tmp.8D7fSf (%build) ended at: Sat Jun 8 20:56:36 2024, done in 0:00:19.114448 error: No files produced. + chmod -R u+rwX /tmp/B.to6ffn2m/BUILD + rm -rf /tmp/B.to6ffn2m/tmp /tmp/B.to6ffn2m/BUILD + rm -rf /tmp/B.to6ffn2m Begin-PLD-Builder-Info Build-Time: user:18.31s sys:6.97s real:21.28s (faults io:5 non-io:1196697) End-PLD-Builder-Info
[Back to list of logs] [View rpm -qa of builder]