FailedOk

th/SRPMS[OK]
th/x32[OK]
th/i686[OK]
th/x86_64[OK]

ac/SRPMS[OK]
ac/i386[OK]
ac/i586[OK]
ac/i686[OK]
ac/alpha[OK]
ac/amd64[OK]
ac/athlon[OK]
ac/ppc[OK]
ac/sparc[OK]
ac/sparc64[OK]

Advanced Search
main()
Powered by PLD Linux
(c) 2002-2024 PLD Team
$Revision: 1.37 $
Powered by quantum bogodynamics.
Your IP: 35.172.230.21

fakeroot 91d0eb09-0f6f-4556-8706-4f190361378e

Status:Failed
Source URL:https://buildlogs.pld-linux.org/pld/th/x32/FAIL/fakeroot,91d0eb09-0f6f-4556-8706-4f190361378e.bz2
text/plain URL:View!
full text:View!
rpm -qa of builder:View!
Date:2024/06/08 20:56:37
Runtime:0:00:19.114448

Toc:

  • error 1
  • wrapped.h:235:40: error: expected '=', ',', ';', 'asm' or '__attribute__' before 'LSTAT64_TIME64_ARG'
  • error 2
  • wrapped.h:236:39: error: expected '=', ',', ';', 'asm' or '__attribute__' before 'STAT64_TIME64_ARG'
  • error 3
  • wrapped.h:237:40: error: expected '=', ',', ';', 'asm' or '__attribute__' before 'FSTAT64_TIME64_ARG'
  • error 4
  • wrapped.h:238:42: error: expected '=', ',', ';', 'asm' or '__attribute__' before 'FSTATAT64_TIME64_ARG'
  • error 5
  • libfakeroot_time64.c:184:25: error: expected '=', ',', ';', 'asm' or '__attribute__' before 'LSTAT64_TIME64_ARG'
  • error 6
  • libfakeroot_time64.c:203:24: error: expected '=', ',', ';', 'asm' or '__attribute__' before 'STAT64_TIME64_ARG'
  • error 7
  • libfakeroot_time64.c:221:25: error: expected '=', ',', ';', 'asm' or '__attribute__' before 'FSTAT64_TIME64_ARG'
  • error 8
  • libfakeroot_time64.c:239:27: error: expected '=', ',', ';', 'asm' or '__attribute__' before 'FSTATAT64_TIME64_ARG'
  • error 9
  • make[2]: *** [Makefile:689: libfakeroot_time64_la-libfakeroot_time64.lo] Error 1
  • error 10
  • wrapped.h:235:40: error: expected '=', ',', ';', 'asm' or '__attribute__' before 'LSTAT64_TIME64_ARG'
  • error 11
  • wrapped.h:236:39: error: expected '=', ',', ';', 'asm' or '__attribute__' before 'STAT64_TIME64_ARG'
  • error 12
  • wrapped.h:237:40: error: expected '=', ',', ';', 'asm' or '__attribute__' before 'FSTAT64_TIME64_ARG'
  • error 13
  • wrapped.h:238:42: error: expected '=', ',', ';', 'asm' or '__attribute__' before 'FSTATAT64_TIME64_ARG'
  • error 14
  • wraptmpf.h:635:24: error: expected '=', ',', ';', 'asm' or '__attribute__' before 'LSTAT64_TIME64_ARG'
  • error 15
  • wraptmpf.h:640:23: error: expected '=', ',', ';', 'asm' or '__attribute__' before 'STAT64_TIME64_ARG'
  • error 16
  • wraptmpf.h:645:24: error: expected '=', ',', ';', 'asm' or '__attribute__' before 'FSTAT64_TIME64_ARG'
  • error 17
  • wraptmpf.h:650:26: error: expected '=', ',', ';', 'asm' or '__attribute__' before 'FSTATAT64_TIME64_ARG'
  • error 18
  • wrapdef.h:235:33: error: expected '=', ',', ';', 'asm' or '__attribute__' before 'LSTAT64_TIME64_ARG'
  • error 19
  • wrapdef.h:236:32: error: expected '=', ',', ';', 'asm' or '__attribute__' before 'STAT64_TIME64_ARG'
  • error 20
  • wrapdef.h:237:33: error: expected '=', ',', ';', 'asm' or '__attribute__' before 'FSTAT64_TIME64_ARG'
  • error 21
  • wrapdef.h:238:35: error: expected '=', ',', ';', 'asm' or '__attribute__' before 'FSTATAT64_TIME64_ARG'
  • error 22
  • config.h:383:36: error: 'next___astat64_time64' undeclared here (not in a function)
  • error 23
  • config.h:379:36: error: '__astat64_time64' undeclared here (not in a function)
  • error 24
  • config.h:391:38: error: '__astatat64_time64' undeclared here (not in a function)
  • error 25
  • make[2]: *** [Makefile:682: libfakeroot.lo] Error 1
  • error 26
  • make[1]: *** [Makefile:711: all-recursive] Error 1
  • error 27
  • error: Bad exit status from /tmp/B.to6ffn2m/BUILD/tmp/rpm-tmp.8D7fSf (%build)
  • error 28
  • RPM build errors:
  • error 29
  • error: No files produced.

Content:

checking for __xmknodat... (cached) yes
Extra wrapper for mknodat is required because of __xmknodat
checking for __stat64_time64... no
checking for stat64_time64... no
checking for __fstat64_time64... no
checking for fstat64_time64... no
checking for __lstat64_time64... no
checking for lstat64_time64... no
checking for __fstatat64_time64... no
checking for fstatat64_time64... no
created fakerootconfig.h
checking for strdup... yes
checking for strstr... yes
checking for getresuid... yes
checking for setresuid... yes
checking for getresgid... yes
checking for setresgid... yes
checking for setfsuid... yes
checking for setfsgid... yes
checking for fts_read... yes
checking for fts_children... yes
checking for close_range... yes
checking for x86_64-pld-linux-gnux32-gcc options needed to detect all undeclared functions... none needed
checking whether setenv is declared... yes
checking whether unsetenv is declared... yes
checking for setenv... yes
checking for macOS/Darwin... no
checking that generated files are newer than configure... done
configure: creating ./config.status
config.status: creating Makefile
config.status: creating scripts/Makefile
config.status: creating doc/Makefile
config.status: creating doc/de/Makefile
config.status: creating doc/es/Makefile
config.status: creating doc/fr/Makefile
config.status: creating doc/nl/Makefile
config.status: creating doc/pt/Makefile
config.status: creating doc/ro/Makefile
config.status: creating doc/sv/Makefile
config.status: creating test/Makefile
config.status: creating test/defs
config.status: creating config.h
config.status: executing depfiles commands
config.status: executing libtool commands
+ cd doc
+ po4a -k 0 --rm-backups --variable 'srcdir=../doc/' po4a/po4a.cfg
+ cd ..
+ /usr/bin/make -Otarget -j28
/usr/bin/make  all-recursive
Making all in doc
Making all in de
make[3]: Nothing to be done for 'all'.
Making all in es
make[3]: Nothing to be done for 'all'.
Making all in fr
make[3]: Nothing to be done for 'all'.
Making all in nl
make[3]: Nothing to be done for 'all'.
Making all in pt
make[3]: Nothing to be done for 'all'.
Making all in ro
make[3]: Nothing to be done for 'all'.
Making all in sv
make[3]: Nothing to be done for 'all'.
make[3]: Nothing to be done for 'all-am'.
Making all in scripts
make[2]: Entering directory '/tmp/B.to6ffn2m/BUILD/fakeroot-1.35/scripts'
sed -e 's,[@]prefix[@],/usr,g' -e 's,[@]bindir[@],/usr/bin,g' -e 's,[@]libdir[@],/usr/libx32/libfakeroot,g' -e 's,[@]fakeroot_transformed[@],'`echo fakeroot | sed -e 's,x,x,'`',g' -e 's,[@]faked_transformed[@],'`echo faked | sed -e 's,x,x,'`',g' -e 's,[@]signal[@],TERM,g' -e 's,[@]SHELL[@],/bin/sh,g' -e 's,[@]VERSION[@],1.35,g' -e 's,[@]DLSUFFIX[@],.so,g' -e 's,[@]LDLIBPATHVAR[@],LD_LIBRARY_PATH,g' -e 's,[@]LDPRELOADVAR[@],LD_PRELOAD,g' -e 's,[@]LDPRELOADABS[@],0,g' -e 's,[@]LDEXTRAVAR[@],,g' -e 's,[@]MACOSX_FALSE[@],,g' -e 's,[@]MACOSX_TRUE[@],#,g' < ./fakeroot.in > fakeroot
chmod +x fakeroot
make[2]: Leaving directory '/tmp/B.to6ffn2m/BUILD/fakeroot-1.35/scripts'
Making all in test
make[2]: Nothing to be done for 'all'.
make[2]: Entering directory '/tmp/B.to6ffn2m/BUILD/fakeroot-1.35'
awk -f ./wrapawk < ./wrapfunc.inp
make[2]: Leaving directory '/tmp/B.to6ffn2m/BUILD/fakeroot-1.35'
make[2]: Entering directory '/tmp/B.to6ffn2m/BUILD/fakeroot-1.35'
awk -f ./wrapawk < ./wrapfunc.inp
make[2]: Leaving directory '/tmp/B.to6ffn2m/BUILD/fakeroot-1.35'
make[2]: Entering directory '/tmp/B.to6ffn2m/BUILD/fakeroot-1.35'
x86_64-pld-linux-gnux32-gcc -DHAVE_CONFIG_H -I.     -O2 -fwrapv -pipe -Wformat -Werror=format-security -gdwarf-4 -fno-debug-types-section -fvar-tracking-assignments -g2 -Wp,-D_FORTIFY_SOURCE=2 -fstack-protector-strong --param=ssp-buffer-size=4 -Werror=trampolines -fPIC -mtune=generic -march=x86-64 -gdwarf-4 -fno-debug-types-section -fvar-tracking-assignments -g2  -MT simple.o -MD -MP -MF .deps/simple.Tpo -c -o simple.o simple.c
mv -f .deps/simple.Tpo .deps/simple.Po
make[2]: Leaving directory '/tmp/B.to6ffn2m/BUILD/fakeroot-1.35'
make[2]: Entering directory '/tmp/B.to6ffn2m/BUILD/fakeroot-1.35'
/bin/sh ./libtool  --tag=CC   --mode=compile x86_64-pld-linux-gnux32-gcc -DHAVE_CONFIG_H -I.     -O2 -fwrapv -pipe -Wformat -Werror=format-security -gdwarf-4 -fno-debug-types-section -fvar-tracking-assignments -g2 -Wp,-D_FORTIFY_SOURCE=2 -fstack-protector-strong --param=ssp-buffer-size=4 -Werror=trampolines -fPIC -mtune=generic -march=x86-64 -gdwarf-4 -fno-debug-types-section -fvar-tracking-assignments -g2  -MT libfakeroot_unix2003.lo -MD -MP -MF .deps/libfakeroot_unix2003.Tpo -c -o libfakeroot_unix2003.lo libfakeroot_unix2003.c
libtool: compile:  x86_64-pld-linux-gnux32-gcc -DHAVE_CONFIG_H -I. -O2 -fwrapv -pipe -Wformat -Werror=format-security -gdwarf-4 -fno-debug-types-section -fvar-tracking-assignments -g2 -Wp,-D_FORTIFY_SOURCE=2 -fstack-protector-strong --param=ssp-buffer-size=4 -Werror=trampolines -fPIC -mtune=generic -march=x86-64 -gdwarf-4 -fno-debug-types-section -fvar-tracking-assignments -g2 -MT libfakeroot_unix2003.lo -MD -MP -MF .deps/libfakeroot_unix2003.Tpo -c libfakeroot_unix2003.c  -fPIC -DPIC -o .libs/libfakeroot_unix2003.o
mv -f .deps/libfakeroot_unix2003.Tpo .deps/libfakeroot_unix2003.Plo
make[2]: Leaving directory '/tmp/B.to6ffn2m/BUILD/fakeroot-1.35'
make[2]: Entering directory '/tmp/B.to6ffn2m/BUILD/fakeroot-1.35'
/bin/sh ./libtool  --tag=CC   --mode=compile x86_64-pld-linux-gnux32-gcc -DHAVE_CONFIG_H -I.     -O2 -fwrapv -pipe -Wformat -Werror=format-security -gdwarf-4 -fno-debug-types-section -fvar-tracking-assignments -g2 -Wp,-D_FORTIFY_SOURCE=2 -fstack-protector-strong --param=ssp-buffer-size=4 -Werror=trampolines -fPIC -mtune=generic -march=x86-64 -gdwarf-4 -fno-debug-types-section -fvar-tracking-assignments -g2  -MT libfakeroot_inode64.lo -MD -MP -MF .deps/libfakeroot_inode64.Tpo -c -o libfakeroot_inode64.lo libfakeroot_inode64.c
libtool: compile:  x86_64-pld-linux-gnux32-gcc -DHAVE_CONFIG_H -I. -O2 -fwrapv -pipe -Wformat -Werror=format-security -gdwarf-4 -fno-debug-types-section -fvar-tracking-assignments -g2 -Wp,-D_FORTIFY_SOURCE=2 -fstack-protector-strong --param=ssp-buffer-size=4 -Werror=trampolines -fPIC -mtune=generic -march=x86-64 -gdwarf-4 -fno-debug-types-section -fvar-tracking-assignments -g2 -MT libfakeroot_inode64.lo -MD -MP -MF .deps/libfakeroot_inode64.Tpo -c libfakeroot_inode64.c  -fPIC -DPIC -o .libs/libfakeroot_inode64.o
mv -f .deps/libfakeroot_inode64.Tpo .deps/libfakeroot_inode64.Plo
make[2]: Leaving directory '/tmp/B.to6ffn2m/BUILD/fakeroot-1.35'
make[2]: Entering directory '/tmp/B.to6ffn2m/BUILD/fakeroot-1.35'
/bin/sh ./libtool  --tag=CC   --mode=compile x86_64-pld-linux-gnux32-gcc -DHAVE_CONFIG_H -I.  -D_FILE_OFFSET_BITS=64 -D_TIME_BITS=64   -O2 -fwrapv -pipe -Wformat -Werror=format-security -gdwarf-4 -fno-debug-types-section -fvar-tracking-assignments -g2 -Wp,-D_FORTIFY_SOURCE=2 -fstack-protector-strong --param=ssp-buffer-size=4 -Werror=trampolines -fPIC -mtune=generic -march=x86-64 -gdwarf-4 -fno-debug-types-section -fvar-tracking-assignments -g2  -MT libfakeroot_time64_la-libfakeroot_time64.lo -MD -MP -MF .deps/libfakeroot_time64_la-libfakeroot_time64.Tpo -c -o libfakeroot_time64_la-libfakeroot_time64.lo `test -f 'libfakeroot_time64.c' || echo './'`libfakeroot_time64.c
libtool: compile:  x86_64-pld-linux-gnux32-gcc -DHAVE_CONFIG_H -I. -D_FILE_OFFSET_BITS=64 -D_TIME_BITS=64 -O2 -fwrapv -pipe -Wformat -Werror=format-security -gdwarf-4 -fno-debug-types-section -fvar-tracking-assignments -g2 -Wp,-D_FORTIFY_SOURCE=2 -fstack-protector-strong --param=ssp-buffer-size=4 -Werror=trampolines -fPIC -mtune=generic -march=x86-64 -gdwarf-4 -fno-debug-types-section -fvar-tracking-assignments -g2 -MT libfakeroot_time64_la-libfakeroot_time64.lo -MD -MP -MF .deps/libfakeroot_time64_la-libfakeroot_time64.Tpo -c libfakeroot_time64.c  -fPIC -DPIC -o .libs/libfakeroot_time64_la-libfakeroot_time64.o
In file included from libfakeroot_time64.c:19:
wrapped.h:227:97: warning: 'struct statx' declared inside parameter list will not be visible outside of this definition or declaration
  227 | extern int (*next_statx)(int dir_fd, const char *pathname, int flags, unsigned int mask, struct statx *buf);
      |                                                                                                 ^~~~~
wrapped.h:235:40: error: expected '=', ',', ';', 'asm' or '__attribute__' before 'LSTAT64_TIME64_ARG'
  235 | extern int (*NEXT_LSTAT64_TIME64_NOARG)LSTAT64_TIME64_ARG(int ver, const char *file_name, struct stat64 *buf);
      |                                        ^~~~~~~~~~~~~~~~~~
wrapped.h:236:39: error: expected '=', ',', ';', 'asm' or '__attribute__' before 'STAT64_TIME64_ARG'
  236 | extern int (*NEXT_STAT64_TIME64_NOARG)STAT64_TIME64_ARG(int ver, const char *file_name, struct stat64 *buf);
      |                                       ^~~~~~~~~~~~~~~~~
wrapped.h:237:40: error: expected '=', ',', ';', 'asm' or '__attribute__' before 'FSTAT64_TIME64_ARG'
  237 | extern int (*NEXT_FSTAT64_TIME64_NOARG)FSTAT64_TIME64_ARG(int ver, int fd, struct stat64 *buf);
      |                                        ^~~~~~~~~~~~~~~~~~
wrapped.h:238:42: error: expected '=', ',', ';', 'asm' or '__attribute__' before 'FSTATAT64_TIME64_ARG'
  238 | extern int (*NEXT_FSTATAT64_TIME64_NOARG)FSTATAT64_TIME64_ARG(int ver, int dir_fd, const char *path, struct stat64 *buf, int flags);
      |                                          ^~~~~~~~~~~~~~~~~~~~
libfakeroot_time64.c:184:25: error: expected '=', ',', ';', 'asm' or '__attribute__' before 'LSTAT64_TIME64_ARG'
  184 | int WRAP_LSTAT64_TIME64 LSTAT64_TIME64_ARG(int ver,
      |                         ^~~~~~~~~~~~~~~~~~
libfakeroot_time64.c:203:24: error: expected '=', ',', ';', 'asm' or '__attribute__' before 'STAT64_TIME64_ARG'
  203 | int WRAP_STAT64_TIME64 STAT64_TIME64_ARG(int ver,
      |                        ^~~~~~~~~~~~~~~~~
libfakeroot_time64.c:221:25: error: expected '=', ',', ';', 'asm' or '__attribute__' before 'FSTAT64_TIME64_ARG'
  221 | int WRAP_FSTAT64_TIME64 FSTAT64_TIME64_ARG(int ver,
      |                         ^~~~~~~~~~~~~~~~~~
libfakeroot_time64.c:239:27: error: expected '=', ',', ';', 'asm' or '__attribute__' before 'FSTATAT64_TIME64_ARG'
  239 | int WRAP_FSTATAT64_TIME64 FSTATAT64_TIME64_ARG(int ver,
      |                           ^~~~~~~~~~~~~~~~~~~~
make[2]: *** [Makefile:689: libfakeroot_time64_la-libfakeroot_time64.lo] Error 1
make[2]: Leaving directory '/tmp/B.to6ffn2m/BUILD/fakeroot-1.35'
make[2]: *** Waiting for unfinished jobs....
make[2]: Entering directory '/tmp/B.to6ffn2m/BUILD/fakeroot-1.35'
/bin/sh ./libtool  --tag=CC   --mode=compile x86_64-pld-linux-gnux32-gcc -DHAVE_CONFIG_H -I.     -O2 -fwrapv -pipe -Wformat -Werror=format-security -gdwarf-4 -fno-debug-types-section -fvar-tracking-assignments -g2 -Wp,-D_FORTIFY_SOURCE=2 -fstack-protector-strong --param=ssp-buffer-size=4 -Werror=trampolines -fPIC -mtune=generic -march=x86-64 -gdwarf-4 -fno-debug-types-section -fvar-tracking-assignments -g2  -MT libfakeroot.lo -MD -MP -MF .deps/libfakeroot.Tpo -c -o libfakeroot.lo libfakeroot.c
libtool: compile:  x86_64-pld-linux-gnux32-gcc -DHAVE_CONFIG_H -I. -O2 -fwrapv -pipe -Wformat -Werror=format-security -gdwarf-4 -fno-debug-types-section -fvar-tracking-assignments -g2 -Wp,-D_FORTIFY_SOURCE=2 -fstack-protector-strong --param=ssp-buffer-size=4 -Werror=trampolines -fPIC -mtune=generic -march=x86-64 -gdwarf-4 -fno-debug-types-section -fvar-tracking-assignments -g2 -MT libfakeroot.lo -MD -MP -MF .deps/libfakeroot.Tpo -c libfakeroot.c  -fPIC -DPIC -o .libs/libfakeroot.o
In file included from libfakeroot.c:271:
wrapped.h:235:40: error: expected '=', ',', ';', 'asm' or '__attribute__' before 'LSTAT64_TIME64_ARG'
  235 | extern int (*NEXT_LSTAT64_TIME64_NOARG)LSTAT64_TIME64_ARG(int ver, const char *file_name, struct stat64 *buf);
      |                                        ^~~~~~~~~~~~~~~~~~
wrapped.h:236:39: error: expected '=', ',', ';', 'asm' or '__attribute__' before 'STAT64_TIME64_ARG'
  236 | extern int (*NEXT_STAT64_TIME64_NOARG)STAT64_TIME64_ARG(int ver, const char *file_name, struct stat64 *buf);
      |                                       ^~~~~~~~~~~~~~~~~
wrapped.h:237:40: error: expected '=', ',', ';', 'asm' or '__attribute__' before 'FSTAT64_TIME64_ARG'
  237 | extern int (*NEXT_FSTAT64_TIME64_NOARG)FSTAT64_TIME64_ARG(int ver, int fd, struct stat64 *buf);
      |                                        ^~~~~~~~~~~~~~~~~~
wrapped.h:238:42: error: expected '=', ',', ';', 'asm' or '__attribute__' before 'FSTATAT64_TIME64_ARG'
  238 | extern int (*NEXT_FSTATAT64_TIME64_NOARG)FSTATAT64_TIME64_ARG(int ver, int dir_fd, const char *path, struct stat64 *buf, int flags);
      |                                          ^~~~~~~~~~~~~~~~~~~~
In file included from libfakeroot.c:272:
wraptmpf.h:635:24: error: expected '=', ',', ';', 'asm' or '__attribute__' before 'LSTAT64_TIME64_ARG'
  635 | int TMP_LSTAT64_TIME64 LSTAT64_TIME64_ARG(int ver, const char *file_name, struct stat64 *buf){
      |                        ^~~~~~~~~~~~~~~~~~
wraptmpf.h:640:23: error: expected '=', ',', ';', 'asm' or '__attribute__' before 'STAT64_TIME64_ARG'
  640 | int TMP_STAT64_TIME64 STAT64_TIME64_ARG(int ver, const char *file_name, struct stat64 *buf){
      |                       ^~~~~~~~~~~~~~~~~
wraptmpf.h:645:24: error: expected '=', ',', ';', 'asm' or '__attribute__' before 'FSTAT64_TIME64_ARG'
  645 | int TMP_FSTAT64_TIME64 FSTAT64_TIME64_ARG(int ver, int fd, struct stat64 *buf){
      |                        ^~~~~~~~~~~~~~~~~~
wraptmpf.h:650:26: error: expected '=', ',', ';', 'asm' or '__attribute__' before 'FSTATAT64_TIME64_ARG'
  650 | int TMP_FSTATAT64_TIME64 FSTATAT64_TIME64_ARG(int ver, int dir_fd, const char *path, struct stat64 *buf, int flags){
      |                          ^~~~~~~~~~~~~~~~~~~~
In file included from libfakeroot.c:273:
wrapdef.h:235:33: error: expected '=', ',', ';', 'asm' or '__attribute__' before 'LSTAT64_TIME64_ARG'
  235 | int (*NEXT_LSTAT64_TIME64_NOARG)LSTAT64_TIME64_ARG(int ver, const char *file_name, struct stat64 *buf)=TMP_LSTAT64_TIME64;
      |                                 ^~~~~~~~~~~~~~~~~~
wrapdef.h:236:32: error: expected '=', ',', ';', 'asm' or '__attribute__' before 'STAT64_TIME64_ARG'
  236 | int (*NEXT_STAT64_TIME64_NOARG)STAT64_TIME64_ARG(int ver, const char *file_name, struct stat64 *buf)=TMP_STAT64_TIME64;
      |                                ^~~~~~~~~~~~~~~~~
wrapdef.h:237:33: error: expected '=', ',', ';', 'asm' or '__attribute__' before 'FSTAT64_TIME64_ARG'
  237 | int (*NEXT_FSTAT64_TIME64_NOARG)FSTAT64_TIME64_ARG(int ver, int fd, struct stat64 *buf)=TMP_FSTAT64_TIME64;
      |                                 ^~~~~~~~~~~~~~~~~~
wrapdef.h:238:35: error: expected '=', ',', ';', 'asm' or '__attribute__' before 'FSTATAT64_TIME64_ARG'
  238 | int (*NEXT_FSTATAT64_TIME64_NOARG)FSTATAT64_TIME64_ARG(int ver, int dir_fd, const char *path, struct stat64 *buf, int flags)=TMP_FSTATAT64_TIME64;
      |                                   ^~~~~~~~~~~~~~~~~~~~
In file included from communicate.h:19,
                 from libfakeroot.c:65:
config.h:383:36: error: 'next___astat64_time64' undeclared here (not in a function)
  383 | #define NEXT_LSTAT64_TIME64_NOARG  next___astat64_time64
      |                                    ^~~~~~~~~~~~~~~~~~~~~
wrapstruct.h:236:14: note: in expansion of macro 'NEXT_LSTAT64_TIME64_NOARG'
  236 |   {(void(*))&NEXT_LSTAT64_TIME64_NOARG, WRAP_LSTAT64_TIME64_QUOTE},
      |              ^~~~~~~~~~~~~~~~~~~~~~~~~
config.h:379:36: error: '__astat64_time64' undeclared here (not in a function)
  379 | #define WRAP_LSTAT64_TIME64_QUOTE  __astat64_time64
      |                                    ^~~~~~~~~~~~~~~~
wrapstruct.h:236:41: note: in expansion of macro 'WRAP_LSTAT64_TIME64_QUOTE'
  236 |   {(void(*))&NEXT_LSTAT64_TIME64_NOARG, WRAP_LSTAT64_TIME64_QUOTE},
      |                                         ^~~~~~~~~~~~~~~~~~~~~~~~~
config.h:391:38: error: '__astatat64_time64' undeclared here (not in a function)
  391 | #define WRAP_FSTATAT64_TIME64_QUOTE  __astatat64_time64
      |                                      ^~~~~~~~~~~~~~~~~~
wrapstruct.h:239:43: note: in expansion of macro 'WRAP_FSTATAT64_TIME64_QUOTE'
  239 |   {(void(*))&NEXT_FSTATAT64_TIME64_NOARG, WRAP_FSTATAT64_TIME64_QUOTE},
      |                                           ^~~~~~~~~~~~~~~~~~~~~~~~~~~
make[2]: *** [Makefile:682: libfakeroot.lo] Error 1
make[2]: Leaving directory '/tmp/B.to6ffn2m/BUILD/fakeroot-1.35'
make[2]: Entering directory '/tmp/B.to6ffn2m/BUILD/fakeroot-1.35'
/bin/sh ./libtool  --tag=CC   --mode=link x86_64-pld-linux-gnux32-gcc  -O2 -fwrapv -pipe -Wformat -Werror=format-security -gdwarf-4 -fno-debug-types-section -fvar-tracking-assignments -g2 -Wp,-D_FORTIFY_SOURCE=2 -fstack-protector-strong --param=ssp-buffer-size=4 -Werror=trampolines -fPIC -mtune=generic -march=x86-64 -gdwarf-4 -fno-debug-types-section -fvar-tracking-assignments -g2   -Wl,--as-needed -Wl,--no-copy-dt-needed-entries -Wl,-z,relro -Wl,-z,combreloc  -o simple simple.o  -ldl 
libtool: link: x86_64-pld-linux-gnux32-gcc -O2 -fwrapv -pipe -Wformat -Werror=format-security -gdwarf-4 -fno-debug-types-section -fvar-tracking-assignments -g2 -Wp,-D_FORTIFY_SOURCE=2 -fstack-protector-strong --param=ssp-buffer-size=4 -Werror=trampolines -fPIC -mtune=generic -march=x86-64 -gdwarf-4 -fno-debug-types-section -fvar-tracking-assignments -g2 -Wl,--as-needed -Wl,--no-copy-dt-needed-entries -Wl,-z -Wl,relro -Wl,-z -Wl,combreloc -o simple simple.o  -ldl
make[2]: Leaving directory '/tmp/B.to6ffn2m/BUILD/fakeroot-1.35'
make[2]: Entering directory '/tmp/B.to6ffn2m/BUILD/fakeroot-1.35'
/bin/sh ./libtool  --tag=CC   --mode=compile x86_64-pld-linux-gnux32-gcc -DHAVE_CONFIG_H -I.     -O2 -fwrapv -pipe -Wformat -Werror=format-security -gdwarf-4 -fno-debug-types-section -fvar-tracking-assignments -g2 -Wp,-D_FORTIFY_SOURCE=2 -fstack-protector-strong --param=ssp-buffer-size=4 -Werror=trampolines -fPIC -mtune=generic -march=x86-64 -gdwarf-4 -fno-debug-types-section -fvar-tracking-assignments -g2  -MT communicate.lo -MD -MP -MF .deps/communicate.Tpo -c -o communicate.lo communicate.c
libtool: compile:  x86_64-pld-linux-gnux32-gcc -DHAVE_CONFIG_H -I. -O2 -fwrapv -pipe -Wformat -Werror=format-security -gdwarf-4 -fno-debug-types-section -fvar-tracking-assignments -g2 -Wp,-D_FORTIFY_SOURCE=2 -fstack-protector-strong --param=ssp-buffer-size=4 -Werror=trampolines -fPIC -mtune=generic -march=x86-64 -gdwarf-4 -fno-debug-types-section -fvar-tracking-assignments -g2 -MT communicate.lo -MD -MP -MF .deps/communicate.Tpo -c communicate.c  -fPIC -DPIC -o .libs/communicate.o
mv -f .deps/communicate.Tpo .deps/communicate.Plo
make[2]: Leaving directory '/tmp/B.to6ffn2m/BUILD/fakeroot-1.35'
make[2]: Entering directory '/tmp/B.to6ffn2m/BUILD/fakeroot-1.35'
/bin/sh ./libtool  --tag=CC   --mode=link x86_64-pld-linux-gnux32-gcc  -O2 -fwrapv -pipe -Wformat -Werror=format-security -gdwarf-4 -fno-debug-types-section -fvar-tracking-assignments -g2 -Wp,-D_FORTIFY_SOURCE=2 -fstack-protector-strong --param=ssp-buffer-size=4 -Werror=trampolines -fPIC -mtune=generic -march=x86-64 -gdwarf-4 -fno-debug-types-section -fvar-tracking-assignments -g2   -Wl,--as-needed -Wl,--no-copy-dt-needed-entries -Wl,-z,relro -Wl,-z,combreloc  -o libmacosx.la  libfakeroot_inode64.lo libfakeroot_unix2003.lo  -ldl 
libtool: link: ar cr .libs/libmacosx.a .libs/libfakeroot_inode64.o .libs/libfakeroot_unix2003.o 
libtool: link: ranlib .libs/libmacosx.a
libtool: link: ( cd ".libs" && rm -f "libmacosx.la" && ln -s "../libmacosx.la" "libmacosx.la" )
make[2]: Leaving directory '/tmp/B.to6ffn2m/BUILD/fakeroot-1.35'
make[2]: Entering directory '/tmp/B.to6ffn2m/BUILD/fakeroot-1.35'
x86_64-pld-linux-gnux32-gcc -DHAVE_CONFIG_H -I.     -O2 -fwrapv -pipe -Wformat -Werror=format-security -gdwarf-4 -fno-debug-types-section -fvar-tracking-assignments -g2 -Wp,-D_FORTIFY_SOURCE=2 -fstack-protector-strong --param=ssp-buffer-size=4 -Werror=trampolines -fPIC -mtune=generic -march=x86-64 -gdwarf-4 -fno-debug-types-section -fvar-tracking-assignments -g2  -MT faked.o -MD -MP -MF .deps/faked.Tpo -c -o faked.o faked.c
mv -f .deps/faked.Tpo .deps/faked.Po
make[2]: Leaving directory '/tmp/B.to6ffn2m/BUILD/fakeroot-1.35'
make[1]: *** [Makefile:711: all-recursive] Error 1
make: *** [Makefile:469: all] Error 2
error: Bad exit status from /tmp/B.to6ffn2m/BUILD/tmp/rpm-tmp.8D7fSf (%build)

RPM build errors:
    Bad exit status from /tmp/B.to6ffn2m/BUILD/tmp/rpm-tmp.8D7fSf (%build)
ended at: Sat Jun  8 20:56:36 2024, done in 0:00:19.114448
error: No files produced.
+ chmod -R u+rwX /tmp/B.to6ffn2m/BUILD
+ rm -rf /tmp/B.to6ffn2m/tmp /tmp/B.to6ffn2m/BUILD
+ rm -rf /tmp/B.to6ffn2m
Begin-PLD-Builder-Info
Build-Time: user:18.31s sys:6.97s real:21.28s (faults io:5 non-io:1196697)

End-PLD-Builder-Info
[Back to list of logs] [View rpm -qa of builder]