FailedOk

th/SRPMS[OK]
th/x32[OK]
th/i686[OK]
th/x86_64[OK]

ac/SRPMS[OK]
ac/i386[OK]
ac/i586[OK]
ac/i686[OK]
ac/alpha[OK]
ac/amd64[OK]
ac/athlon[OK]
ac/ppc[OK]
ac/sparc[OK]
ac/sparc64[OK]

Advanced Search
main()
Powered by PLD Linux
(c) 2002-2024 PLD Team
$Revision: 1.37 $
Powered by PDP-7.
Your IP: 44.213.60.33

gnucash 3c014a37-c8ff-4889-adcf-4a370ce723fe

Status:Failed
Source URL:https://buildlogs.pld-linux.org/pld/th/x32/FAIL/gnucash,3c014a37-c8ff-4889-adcf-4a370ce723fe.bz2
text/plain URL:View!
rpm -qa of builder:View!
Date:2024/06/30 21:33:53
Runtime:0:00:24.008301

Toc:

  • prep
  • Executing(%prep): /bin/sh -e /tmp/B.v8o6rdi5/BUILD/tmp/rpm-tmp.s1rjQq
  • build
  • Executing(%build): /bin/sh -e /tmp/B.v8o6rdi5/BUILD/tmp/rpm-tmp.D7Md9Z
  • error 1
  • make[2]: *** [bindings/python/CMakeFiles/sw-app-utils-py.dir/build.make:78: bindings/python/swig-app-utils-python.c] Error 1
  • error 2
  • make[1]: *** [CMakeFiles/Makefile2:11189: bindings/python/CMakeFiles/sw-app-utils-py.dir/all] Error 2
  • error 3
  • make[2]: *** [bindings/python/CMakeFiles/swig-app-utils-python.dir/build.make:80: bindings/python/swig-app-utils-python.c] Error 1
  • error 4
  • make[1]: *** [CMakeFiles/Makefile2:10949: bindings/python/CMakeFiles/swig-app-utils-python.dir/all] Error 2
  • error 5
  • make[2]: *** [bindings/python/CMakeFiles/gnucash-core-c-py.dir/build.make:109: bindings/python/gnucash_core.c] Error 1
  • error 6
  • make[1]: *** [CMakeFiles/Makefile2:11031: bindings/python/CMakeFiles/gnucash-core-c-py.dir/all] Error 2
  • error 7
  • make[2]: *** [bindings/python/CMakeFiles/swig-gnucash-core.dir/build.make:142: bindings/python/gnucash_core.c] Error 1
  • error 8
  • make[1]: *** [CMakeFiles/Makefile2:10897: bindings/python/CMakeFiles/swig-gnucash-core.dir/all] Error 2
  • error 9
  • error: Bad exit status from /tmp/B.v8o6rdi5/BUILD/tmp/rpm-tmp.D7Md9Z (%build)
  • error 10
  • RPM build errors:
  • error 11
  • error: No files produced.

Content:

request from: mrozowik
checking if we should skip the build
started at: Sun Jun 30 21:33:25 2024
killing old processes on a builder
sending signal 9 to pid -1
cleaning up /tmp
fetching https://srcbuilder.pld-linux.org/th//srpms/3c014a37-c8ff-4889-adcf-4a370ce723fe/gnucash-5.7-1.src.rpm
fetched 15001050 bytes, 14595.2 K/s
installing srpm: gnucash-5.7-1.src.rpm
+ install -d /tmp/B.v8o6rdi5/BUILD /tmp/B.v8o6rdi5/RPMS
+ LC_ALL=en_US.UTF-8
+ rpm -qp --changelog gnucash-5.7-1.src.rpm
* Sun Jun 30 2024 PLD Linux Team <feedback@pld-linux.org>
- For complete changelog see: http://git.pld-linux.org/?p=packages/gnucash.git;a=log;h=master
* Sun Jun 30 2024 Krzysztof Mrozowicz <mrozowik@pld-linux.org> 499a400
- up to 5.7 * Fri Apr 05 2024 Krzysztof Mrozowicz <mrozowik@pld-linux.org> 3b4bcfb
- actually adding the patch * Fri Apr 05 2024 Krzysztof Mrozowicz <mrozowik@pld-linux.org> 4e7ea70
- added use_correct_literal_suffix_for_size_type.patch * Fri Apr 05 2024 Krzysztof Mrozowicz <mrozowik@pld-linux.org> 15e04e5
- up to 5.6 * Mon Dec 18 2023 Krzysztof Mrozowicz <mrozowik@pld-linux.org> e61fbed
- up to 5.5 * Thu Oct 26 2023 Jaroslaw Kruk <kruk.jaroslaw@gmail.com> aabf6ba
- up to 5.4 * Sun Jul 02 2023 Jan Palus <atler@pld-linux.org> 0e8fa4f
- icu+boost rebuild * Tue Jun 27 2023 Krzysztof Mrozowicz <mrozowik@pld-linux.org> 17c9812
- up to 5.3 * Mon Jun 26 2023 Krzysztof Mrozowicz <mrozowik@pld-linux.org> 5a4c6cc
- up to 5.2 * Mon May 01 2023 Krzysztof Mrozowicz <mrozowik@pld-linux.org> 5aae24e
- up to 5.1 * Sun Apr 02 2023 Krzysztof Mrozowicz <mrozowik@pld-linux.org> 895eddb
- up to 5.0 * Sun Feb 19 2023 Jan Palus <atler@pld-linux.org> b1cced0
- boost+icu rebuild * Tue Dec 20 2022 Krzysztof Mrozowicz <mrozowik@pld-linux.org> 3e67c6a
- up to 4.13 * Tue Sep 27 2022 Krzysztof Mrozowicz <mrozowik@pld-linux.org> c11699c
- up to 4.12 * Mon Jun 27 2022 Krzysztof Mrozowicz <mrozowik@pld-linux.org> 4304caa
- up to 4.11 * Mon Jun 06 2022 Jan Palus <atler@pld-linux.org> 3c51efa
- icu+boost rebuild * Thu May 26 2022 Krzysztof Mrozowicz <mrozowik@pld-linux.org> 73f3b61
- BR: swig-python, relup * Tue May 24 2022 Bartek Szady <bszx@bszx.eu> a184a28
- updated to 4.10 * Sat Mar 26 2022 Jan Rękorajski <baggins@pld-linux.org> c98d70d
- rebuild with python 3.10 * Sat Mar 12 2022 Jan Rękorajski <baggins@pld-linux.org> 4d0d223
- rebuild with guile 3.0, rel 3 + rpm -Uhv --nodeps --define '_topdir /tmp/B.v8o6rdi5' --define '_specdir %{_topdir}' --define '_sourcedir %{_specdir}' --define '_rpmdir %{_topdir}/RPMS' --define '_builddir %{_topdir}/BUILD' gnucash-5.7-1.src.rpm Updating / installing... gnucash-5.7-1 ######################################## + rm -f gnucash-5.7-1.src.rpm + install -m 700 -d /tmp/B.v8o6rdi5/BUILD/tmp + TMPDIR=/tmp/B.v8o6rdi5/BUILD/tmp + exec nice -n 0 rpmbuild -bp --short-circuit --nodeps --define '_topdir /tmp/B.v8o6rdi5' --define '_specdir %{_topdir}' --define '_sourcedir %{_specdir}' --define '_rpmdir %{_topdir}/RPMS' --define '_builddir %{_topdir}/BUILD' --target x32-pld-linux --define 'prep exit 0' /tmp/B.v8o6rdi5/gnucash.spec Building target platforms: x32-pld-linux Building for target x32-pld-linux checking BuildConflict-ing packages rpm: Building target platforms: x32-pld-linux rpm: Building for target x32-pld-linux no BuildConflicts found checking BR rpm: Building target platforms: x32-pld-linux rpm: Building for target x32-pld-linux no BR needed building RPM using: set -ex; : build-id: 3c014a37-c8ff-4889-adcf-4a370ce723fe; TMPDIR=/tmp/B.v8o6rdi5/BUILD/tmp exec nice -n 0 rpmbuild -bb --define '__jobs 28' --define '_smp_mflags -j28' --define '_make_opts -Otarget' --define '_pld_builder 1' --define '_topdir /tmp/B.v8o6rdi5' --define '_specdir %{_topdir}' --define '_sourcedir %{_specdir}' --define '_rpmdir %{_topdir}/RPMS' --define '_builddir %{_topdir}/BUILD' --target x32-pld-linux /tmp/B.v8o6rdi5/gnucash.spec + : build-id: 3c014a37-c8ff-4889-adcf-4a370ce723fe + TMPDIR=/tmp/B.v8o6rdi5/BUILD/tmp + exec nice -n 0 rpmbuild -bb --define '__jobs 28' --define '_smp_mflags -j28' --define '_make_opts -Otarget' --define '_pld_builder 1' --define '_topdir /tmp/B.v8o6rdi5' --define '_specdir %{_topdir}' --define '_sourcedir %{_specdir}' --define '_rpmdir %{_topdir}/RPMS' --define '_builddir %{_topdir}/BUILD' --target x32-pld-linux /tmp/B.v8o6rdi5/gnucash.spec Building target platforms: x32-pld-linux Building for target x32-pld-linux Executing(%prep): /bin/sh -e /tmp/B.v8o6rdi5/BUILD/tmp/rpm-tmp.s1rjQq + umask 022 + cd /tmp/B.v8o6rdi5/BUILD + cd /tmp/B.v8o6rdi5/BUILD + rm -rf gnucash-5.7 + /usr/bin/bzip2 -dc /tmp/B.v8o6rdi5/gnucash-5.7.tar.bz2 + /bin/tar -xof - + STATUS=0 + '[' 0 -ne 0 ']' + cd gnucash-5.7 + /bin/chmod -Rf a+rX,u+w,g-w,o-w . + RPM_EC=0 + jobs -p + exit 0 Executing(%build): /bin/sh -e /tmp/B.v8o6rdi5/BUILD/tmp/rpm-tmp.D7Md9Z HOME=/home/users/builder PATH=/home/users/builder/GNUstep/Tools:/bin:/usr/bin:/usr/local/bin TMPDIR=/tmp/B.v8o6rdi5/BUILD/tmp + umask 022 + cd /tmp/B.v8o6rdi5/BUILD + cd gnucash-5.7 + install -d build + cd build + CC=x86_64-pld-linux-gnux32-gcc CXX=x86_64-pld-linux-gnux32-g++ CPPFLAGS='' /usr/bin/cmake '-DCMAKE_VERBOSE_MAKEFILE:BOOL=ON' '-DCMAKE_BUILD_TYPE=PLD' '-DCMAKE_SYSTEM_NAME=Linux' '-DCMAKE_SYSTEM_VERSION=6.8.6-1' '-DCMAKE_CROSSCOMPILING:BOOL=FALSE' '-DCMAKE_SYSTEM_PROCESSOR=x86_64' '-DCMAKE_INSTALL_BINDIR:PATH=/usr/bin' '-DCMAKE_INSTALL_SBINDIR:PATH=/usr/sbin' '-DCMAKE_INSTALL_LIBEXECDIR:PATH=/usr/libexec' '-DCMAKE_INSTALL_SYSCONFDIR:PATH=/etc' '-DCMAKE_INSTALL_SHAREDSTATEDIRPATH:PATH=/var/lib' '-DCMAKE_INSTALL_LOCALSTATEDIRPATH:PATH=/var' '-DCMAKE_INSTALL_LIBDIR:PATH=/usr/libx32' '-DCMAKE_INSTALL_INCLUDEDIR:PATH=/usr/include' '-DCMAKE_INSTALL_OLDINCLUDEDIR:PATH=/usr/include' '-DCMAKE_INSTALL_DATAROOTDIR:PATH=/usr/share' '-DCMAKE_INSTALL_DATADIR:PATH=/usr/share' '-DCMAKE_INSTALL_INFODIR:PATH=/usr/share/info' '-DCMAKE_INSTALL_LOCALEDIR:PATH=/usr/share/locale' '-DCMAKE_INSTALL_MANDIR:PATH=/usr/share/man' '-DCMAKE_INSTALL_DOCDIR:PATH=/usr/share/doc' '-DCMAKE_INSTALL_PREFIX:PATH=/usr' '-DSYSCONF_INSTALL_DIR:PATH=/etc' '-DCMAKE_CXX_FLAGS_PLD=-O2 -fwrapv -pipe -Wformat -Werror=format-security -gdwarf-4 -fno-debug-types-section -fvar-tracking-assignments -g2 -Wp,-D_FORTIFY_SOURCE=2 -fstack-protector-strong --param=ssp-buffer-size=4 -Werror=trampolines -fPIC -mtune=generic -march=x86-64 -gdwarf-4 -fno-debug-types-section -fvar-tracking-assignments -g2 -DNDEBUG -DQT_NO_DEBUG' '-DCMAKE_C_FLAGS_PLD=-O2 -fwrapv -pipe -Wformat -Werror=format-security -gdwarf-4 -fno-debug-types-section -fvar-tracking-assignments -g2 -Wp,-D_FORTIFY_SOURCE=2 -fstack-protector-strong --param=ssp-buffer-size=4 -Werror=trampolines -fPIC -mtune=generic -march=x86-64 -gdwarf-4 -fno-debug-types-section -fvar-tracking-assignments -g2 -DNDEBUG -DQT_NO_DEBUG' '-DCMAKE_Fortran_FLAGS_PLD=-O2 -fwrapv -pipe -Wformat -Werror=format-security -gdwarf-4 -fno-debug-types-section -fvar-tracking-assignments -g2 -Wp,-D_FORTIFY_SOURCE=2 -fstack-protector-strong --param=ssp-buffer-size=4 -Werror=trampolines -fPIC -mtune=generic -march=x86-64 -gdwarf-4 -fno-debug-types-section -fvar-tracking-assignments -g2 -DNDEBUG -DQT_NO_DEBUG' '-DCMAKE_EXE_LINKER_FLAGS_PLD=-Wl,--as-needed -Wl,--no-copy-dt-needed-entries -Wl,-z,relro -Wl,-z,combreloc ' '-DCMAKE_SHARED_LINKER_FLAGS_PLD=-Wl,--as-needed -Wl,--no-copy-dt-needed-entries -Wl,-z,relro -Wl,-z,combreloc ' '-DCMAKE_MODULE_LINKER_FLAGS_PLD=-Wl,--as-needed -Wl,--no-copy-dt-needed-entries -Wl,-z,relro -Wl,-z,combreloc ' '-DLIB_SUFFIX=x32' '-DBUILD_SHARED_LIBS:BOOL=ON' '-DCMAKE_INSTALL_DOCDIR:PATH=/usr/share/doc/gnucash' '-DWITH_PYTHON=ON' ../ -- The C compiler identification is GNU 13.3.0 -- The CXX compiler identification is GNU 13.3.0 -- Detecting C compiler ABI info -- Detecting C compiler ABI info - done -- Check for working C compiler: /usr/bin/x86_64-pld-linux-gnux32-gcc - skipped -- Detecting C compile features -- Detecting C compile features - done -- Detecting CXX compiler ABI info -- Detecting CXX compiler ABI info - done -- Check for working CXX compiler: /usr/bin/x86_64-pld-linux-gnux32-g++ - skipped -- Detecting CXX compile features -- Detecting CXX compile features - done CMake Warning at CMakeLists.txt:88 (message): /etc is set outside of the installation prefix /usr. That will break relocation so ENABLE_BINRELOC is set to off. With relocation disabled GnuCash will run only in its configured install location. You must set GNC_UNINSTALLED=1 and GNC_BUILDDIR=/path/to/builddir to run from the build directory. GnuCash will not run from a DESTDIR. -- Found UnixCommands: /bin/bash -- Performing Test CMAKE_HAVE_LIBC_PTHREAD -- Performing Test CMAKE_HAVE_LIBC_PTHREAD - Success -- Found Threads: TRUE -- Found PkgConfig: /usr/bin/pkg-config (found version "0.29.2") -- Checking for module 'glib-2.0>=2.56.1' -- Found glib-2.0, version 2.80.3 -- Checking for module 'gio-2.0' -- Found gio-2.0, version 2.80.3 -- Checking for module 'gobject-2.0' -- Found gobject-2.0, version 2.80.3 -- Checking for module 'gmodule-2.0' -- Found gmodule-2.0, version 2.80.3 -- Checking for module 'gthread-2.0' -- Found gthread-2.0, version 2.80.3 -- Checking for module 'libxml-2.0>=2.9.4' -- Found libxml-2.0, version 2.12.8 -- Checking for module 'libxslt' -- Found libxslt, version 1.1.41 -- Checking for module 'webkit2gtk-4.0>=2.14.0' -- Found webkit2gtk-4.0, version 2.44.1 -- Checking for module 'gtk+-3.0>=3.22.30' -- Found gtk+-3.0, version 3.24.42 -- Checking for module 'zlib' -- Found zlib, version 1.3.1 -- Found Gettext: /usr/bin/msgmerge (found suitable version "0.22.5", minimum required is "0.19.6") -- Found SWIG: /usr/bin/swig (found suitable version "4.1.1", minimum required is "3.0.12") -- Using guile-3.0.x -- Using guile SRFI-64 -- Using guile textual-ports -- Checking for module 'gwenhywfar>=5.6.0' -- Found gwenhywfar, version 5.10.2 -- Checking for module 'aqbanking>=6.2.0' -- Found aqbanking, version 6.3.2 -- Looking for AB_Banking_RuntimeConfig_SetCharValue -- Looking for AB_Banking_RuntimeConfig_SetCharValue - not found -- Checking for module 'gwengui-gtk3' -- Found gwengui-gtk3, version 5.10.2 -- Checking for module 'libofx' -- Found libofx, version 0.9.10 -- Performing Test HAVE_OFX_BUG_39 -- Performing Test HAVE_OFX_BUG_39 - Failed -- Found LibXslt: xslt;xml2 (found version "1.1.41") -- Found Python3: /usr/bin/python3 (found suitable version "3.10.14", minimum required is "3.8.0") found components: Interpreter Development Development.Module Development.Embed -- Found Perl: /usr/bin/perl (found version "5.40.0") -- Checking for module 'icu-uc' -- Found icu-uc, version 73.2 -- Checking for module 'icu-i18n' -- Found icu-i18n, version 73.2 -- Checking for module 'libsecret-1>=0.18' -- Found libsecret-1, version 0.20.5 -- Performing Test have_stringop_truncation -- Performing Test have_stringop_truncation - Success -- Checking for GTEST -- Checking for GMOCK -- Looking for include file dirent.h -- Looking for include file dirent.h - found -- Looking for include file dlfcn.h -- Looking for include file dlfcn.h - found -- Looking for include file glob.h -- Looking for include file glob.h - found -- Looking for include file inttypes.h -- Looking for include file inttypes.h - found -- Looking for include file limits.h -- Looking for include file limits.h - found -- Looking for include file locale.h -- Looking for include file locale.h - found -- Looking for include file memory.h -- Looking for include file memory.h - found -- Looking for include file stdint.h -- Looking for include file stdint.h - found -- Looking for include file stdlib.h -- Looking for include file stdlib.h - found -- Looking for include file string.h -- Looking for include file string.h - found -- Looking for include file strings.h -- Looking for include file strings.h - found -- Looking for include file sys/stat.h -- Looking for include file sys/stat.h - found -- Looking for include file sys/time.h -- Looking for include file sys/time.h - found -- Looking for include file sys/times.h -- Looking for include file sys/times.h - found -- Looking for include file sys/types.h -- Looking for include file sys/types.h - found -- Looking for include file sys/wait.h -- Looking for include file sys/wait.h - found -- Looking for include file unistd.h -- Looking for include file unistd.h - found -- Looking for include file utmp.h -- Looking for include file utmp.h - found -- Looking for include file wctype.h -- Looking for include file wctype.h - found -- Performing Test standard_math_library_linked_to_automatically -- Performing Test standard_math_library_linked_to_automatically - Success -- Configuring done (7.9s) -- Generating done (1.2s) CMake Warning: Manually-specified variables were not used by the project: CMAKE_Fortran_FLAGS_PLD CMAKE_INSTALL_LOCALSTATEDIRPATH CMAKE_INSTALL_SHAREDSTATEDIRPATH LIB_SUFFIX SYSCONF_INSTALL_DIR -- Build files have been written to: /tmp/B.v8o6rdi5/BUILD/gnucash-5.7/build + /usr/bin/make -Otarget -j28 /usr/bin/cmake -S/tmp/B.v8o6rdi5/BUILD/gnucash-5.7 -B/tmp/B.v8o6rdi5/BUILD/gnucash-5.7/build --check-build-system CMakeFiles/Makefile.cmake 0 /usr/bin/cmake -E cmake_progress_start /tmp/B.v8o6rdi5/BUILD/gnucash-5.7/build/CMakeFiles /tmp/B.v8o6rdi5/BUILD/gnucash-5.7/build//CMakeFiles/progress.marks /usr/bin/make -f CMakeFiles/Makefile2 all /usr/bin/make -f borrowed/guile-json/CMakeFiles/guile-json-details-links.dir/build.make borrowed/guile-json/CMakeFiles/guile-json-details-links.dir/depend /usr/bin/make -f doc/CMakeFiles/totd.dir/build.make doc/CMakeFiles/totd.dir/depend /usr/bin/make -f libgnucash/core-utils/CMakeFiles/gnc-vcs-info.dir/build.make libgnucash/core-utils/CMakeFiles/gnc-vcs-info.dir/depend /usr/bin/make -f po/CMakeFiles/po-gmo.dir/build.make po/CMakeFiles/po-gmo.dir/depend /usr/bin/make -f libgnucash/engine/CMakeFiles/iso-4217-c.dir/build.make libgnucash/engine/CMakeFiles/iso-4217-c.dir/depend /usr/bin/make -f common/test-core/CMakeFiles/swig-unittest-support-python.dir/build.make common/test-core/CMakeFiles/swig-unittest-support-python.dir/depend /usr/bin/make -f common/test-core/CMakeFiles/swig-unittest-support-guile-c.dir/build.make common/test-core/CMakeFiles/swig-unittest-support-guile-c.dir/depend /usr/bin/make -f common/test-core/CMakeFiles/jenny.dir/build.make common/test-core/CMakeFiles/jenny.dir/depend /usr/bin/make -f bindings/guile/CMakeFiles/swig-apputils-guile-cpp.dir/build.make bindings/guile/CMakeFiles/swig-apputils-guile-cpp.dir/depend /usr/bin/make -f common/CMakeFiles/swig-runtime-h.dir/build.make common/CMakeFiles/swig-runtime-h.dir/depend /usr/bin/make -f bindings/guile/CMakeFiles/swig-core-utils-guile-c.dir/build.make bindings/guile/CMakeFiles/swig-core-utils-guile-c.dir/depend /usr/bin/make -f bindings/guile/CMakeFiles/swig-engine-cpp.dir/build.make bindings/guile/CMakeFiles/swig-engine-cpp.dir/depend /usr/bin/make -f libgnucash/engine/test-core/CMakeFiles/gnc-test-engine.dir/build.make libgnucash/engine/test-core/CMakeFiles/gnc-test-engine.dir/depend /usr/bin/make -f libgnucash/gnc-module/CMakeFiles/gnc-module.dir/build.make libgnucash/gnc-module/CMakeFiles/gnc-module.dir/depend /usr/bin/make -f libgnucash/quotes/CMakeFiles/quotes-man.dir/build.make libgnucash/quotes/CMakeFiles/quotes-man.dir/depend /usr/bin/make -f libgnucash/quotes/CMakeFiles/quotes-bin.dir/build.make libgnucash/quotes/CMakeFiles/quotes-bin.dir/depend /usr/bin/make -f libgnucash/tax/CMakeFiles/scm-tax-us-1-links.dir/build.make libgnucash/tax/CMakeFiles/scm-tax-us-1-links.dir/depend /usr/bin/make -f bindings/guile/CMakeFiles/scm-app-utils-2-links.dir/build.make bindings/guile/CMakeFiles/scm-app-utils-2-links.dir/depend /usr/bin/make -f bindings/guile/CMakeFiles/scm-app-utils-1-links.dir/build.make bindings/guile/CMakeFiles/scm-app-utils-1-links.dir/depend /usr/bin/make -f bindings/guile/CMakeFiles/scm-core-utils-links.dir/build.make bindings/guile/CMakeFiles/scm-core-utils-links.dir/depend /usr/bin/make -f bindings/guile/CMakeFiles/scm-engine-2-links.dir/build.make bindings/guile/CMakeFiles/scm-engine-2-links.dir/depend /usr/bin/make -f bindings/guile/CMakeFiles/scm-engine-1-links.dir/build.make bindings/guile/CMakeFiles/scm-engine-1-links.dir/depend /usr/bin/make -f bindings/guile/CMakeFiles/scm-engine-0-links.dir/build.make bindings/guile/CMakeFiles/scm-engine-0-links.dir/depend /usr/bin/make -f libgnucash/tax/CMakeFiles/scm-tax-us-2-links.dir/build.make libgnucash/tax/CMakeFiles/scm-tax-us-2-links.dir/depend /usr/bin/make -f libgnucash/tax/CMakeFiles/scm-tax-us-3-links.dir/build.make libgnucash/tax/CMakeFiles/scm-tax-us-3-links.dir/depend /usr/bin/make -f libgnucash/tax/CMakeFiles/scm-tax-de_DE-1-links.dir/build.make libgnucash/tax/CMakeFiles/scm-tax-de_DE-1-links.dir/depend /usr/bin/make -f libgnucash/tax/CMakeFiles/scm-tax-de_DE-2-links.dir/build.make libgnucash/tax/CMakeFiles/scm-tax-de_DE-2-links.dir/depend /usr/bin/make -f bindings/guile/CMakeFiles/swig-expressions-guile-c.dir/build.make bindings/guile/CMakeFiles/swig-expressions-guile-c.dir/depend make[2]: Entering directory '/tmp/B.v8o6rdi5/BUILD/gnucash-5.7/build' cd /tmp/B.v8o6rdi5/BUILD/gnucash-5.7/build && /usr/bin/cmake -E cmake_depends "Unix Makefiles" /tmp/B.v8o6rdi5/BUILD/gnucash-5.7 /tmp/B.v8o6rdi5/BUILD/gnucash-5.7/doc /tmp/B.v8o6rdi5/BUILD/gnucash-5.7/build /tmp/B.v8o6rdi5/BUILD/gnucash-5.7/build/doc /tmp/B.v8o6rdi5/BUILD/gnucash-5.7/build/doc/CMakeFiles/totd.dir/DependInfo.cmake "--color=" make[2]: Leaving directory '/tmp/B.v8o6rdi5/BUILD/gnucash-5.7/build' make[2]: Entering directory '/tmp/B.v8o6rdi5/BUILD/gnucash-5.7/build' cd /tmp/B.v8o6rdi5/BUILD/gnucash-5.7/build && /usr/bin/cmake -E cmake_depends "Unix Makefiles" /tmp/B.v8o6rdi5/BUILD/gnucash-5.7 /tmp/B.v8o6rdi5/BUILD/gnucash-5.7/libgnucash/core-utils /tmp/B.v8o6rdi5/BUILD/gnucash-5.7/build /tmp/B.v8o6rdi5/BUILD/gnucash-5.7/build/libgnucash/core-utils /tmp/B.v8o6rdi5/BUILD/gnucash-5.7/build/libgnucash/core-utils/CMakeFiles/gnc-vcs-info.dir/DependInfo.cmake "--color=" make[2]: Leaving directory '/tmp/B.v8o6rdi5/BUILD/gnucash-5.7/build' make[2]: Entering directory '/tmp/B.v8o6rdi5/BUILD/gnucash-5.7/build' cd /tmp/B.v8o6rdi5/BUILD/gnucash-5.7/build && /usr/bin/cmake -E cmake_depends "Unix Makefiles" /tmp/B.v8o6rdi5/BUILD/gnucash-5.7 /tmp/B.v8o6rdi5/BUILD/gnucash-5.7/borrowed/guile-json /tmp/B.v8o6rdi5/BUILD/gnucash-5.7/build /tmp/B.v8o6rdi5/BUILD/gnucash-5.7/build/borrowed/guile-json /tmp/B.v8o6rdi5/BUILD/gnucash-5.7/build/borrowed/guile-json/CMakeFiles/guile-json-details-links.dir/DependInfo.cmake "--color=" make[2]: Leaving directory '/tmp/B.v8o6rdi5/BUILD/gnucash-5.7/build' make[2]: Entering directory '/tmp/B.v8o6rdi5/BUILD/gnucash-5.7/build' cd /tmp/B.v8o6rdi5/BUILD/gnucash-5.7/build && /usr/bin/cmake -E cmake_depends "Unix Makefiles" /tmp/B.v8o6rdi5/BUILD/gnucash-5.7 /tmp/B.v8o6rdi5/BUILD/gnucash-5.7/libgnucash/engine /tmp/B.v8o6rdi5/BUILD/gnucash-5.7/build /tmp/B.v8o6rdi5/BUILD/gnucash-5.7/build/libgnucash/engine /tmp/B.v8o6rdi5/BUILD/gnucash-5.7/build/libgnucash/engine/CMakeFiles/iso-4217-c.dir/DependInfo.cmake "--color=" make[2]: Leaving directory '/tmp/B.v8o6rdi5/BUILD/gnucash-5.7/build' make[2]: Entering directory '/tmp/B.v8o6rdi5/BUILD/gnucash-5.7/build' cd /tmp/B.v8o6rdi5/BUILD/gnucash-5.7/build && /usr/bin/cmake -E cmake_depends "Unix Makefiles" /tmp/B.v8o6rdi5/BUILD/gnucash-5.7 /tmp/B.v8o6rdi5/BUILD/gnucash-5.7/libgnucash/engine/test-core /tmp/B.v8o6rdi5/BUILD/gnucash-5.7/build /tmp/B.v8o6rdi5/BUILD/gnucash-5.7/build/libgnucash/engine/test-core /tmp/B.v8o6rdi5/BUILD/gnucash-5.7/build/libgnucash/engine/test-core/CMakeFiles/gnc-test-engine.dir/DependInfo.cmake "--color=" make[2]: Leaving directory '/tmp/B.v8o6rdi5/BUILD/gnucash-5.7/build' make[2]: Entering directory '/tmp/B.v8o6rdi5/BUILD/gnucash-5.7/build' cd /tmp/B.v8o6rdi5/BUILD/gnucash-5.7/build && /usr/bin/cmake -E cmake_depends "Unix Makefiles" /tmp/B.v8o6rdi5/BUILD/gnucash-5.7 /tmp/B.v8o6rdi5/BUILD/gnucash-5.7/bindings/guile /tmp/B.v8o6rdi5/BUILD/gnucash-5.7/build /tmp/B.v8o6rdi5/BUILD/gnucash-5.7/build/bindings/guile /tmp/B.v8o6rdi5/BUILD/gnucash-5.7/build/bindings/guile/CMakeFiles/scm-app-utils-2-links.dir/DependInfo.cmake "--color=" make[2]: Leaving directory '/tmp/B.v8o6rdi5/BUILD/gnucash-5.7/build' make[2]: Entering directory '/tmp/B.v8o6rdi5/BUILD/gnucash-5.7/build' cd /tmp/B.v8o6rdi5/BUILD/gnucash-5.7/build && /usr/bin/cmake -E cmake_depends "Unix Makefiles" /tmp/B.v8o6rdi5/BUILD/gnucash-5.7 /tmp/B.v8o6rdi5/BUILD/gnucash-5.7/common /tmp/B.v8o6rdi5/BUILD/gnucash-5.7/build /tmp/B.v8o6rdi5/BUILD/gnucash-5.7/build/common /tmp/B.v8o6rdi5/BUILD/gnucash-5.7/build/common/CMakeFiles/swig-runtime-h.dir/DependInfo.cmake "--color=" make[2]: Leaving directory '/tmp/B.v8o6rdi5/BUILD/gnucash-5.7/build' make[2]: Entering directory '/tmp/B.v8o6rdi5/BUILD/gnucash-5.7/build' cd /tmp/B.v8o6rdi5/BUILD/gnucash-5.7/build && /usr/bin/cmake -E cmake_depends "Unix Makefiles" /tmp/B.v8o6rdi5/BUILD/gnucash-5.7 /tmp/B.v8o6rdi5/BUILD/gnucash-5.7/bindings/guile /tmp/B.v8o6rdi5/BUILD/gnucash-5.7/build /tmp/B.v8o6rdi5/BUILD/gnucash-5.7/build/bindings/guile /tmp/B.v8o6rdi5/BUILD/gnucash-5.7/build/bindings/guile/CMakeFiles/swig-engine-cpp.dir/DependInfo.cmake "--color=" make[2]: Leaving directory '/tmp/B.v8o6rdi5/BUILD/gnucash-5.7/build' /usr/bin/make -f borrowed/guile-json/CMakeFiles/guile-json-details-links.dir/build.make borrowed/guile-json/CMakeFiles/guile-json-details-links.dir/build make[2]: Entering directory '/tmp/B.v8o6rdi5/BUILD/gnucash-5.7/build' cd /tmp/B.v8o6rdi5/BUILD/gnucash-5.7/build && /usr/bin/cmake -E cmake_depends "Unix Makefiles" /tmp/B.v8o6rdi5/BUILD/gnucash-5.7 /tmp/B.v8o6rdi5/BUILD/gnucash-5.7/bindings/guile /tmp/B.v8o6rdi5/BUILD/gnucash-5.7/build /tmp/B.v8o6rdi5/BUILD/gnucash-5.7/build/bindings/guile /tmp/B.v8o6rdi5/BUILD/gnucash-5.7/build/bindings/guile/CMakeFiles/swig-core-utils-guile-c.dir/DependInfo.cmake "--color=" make[2]: Leaving directory '/tmp/B.v8o6rdi5/BUILD/gnucash-5.7/build' /usr/bin/make -f doc/CMakeFiles/totd.dir/build.make doc/CMakeFiles/totd.dir/build make[2]: Entering directory '/tmp/B.v8o6rdi5/BUILD/gnucash-5.7/build' /usr/bin/make -f libgnucash/core-utils/CMakeFiles/gnc-vcs-info.dir/build.make libgnucash/core-utils/CMakeFiles/gnc-vcs-info.dir/build cd /tmp/B.v8o6rdi5/BUILD/gnucash-5.7/build && /usr/bin/cmake -E cmake_depends "Unix Makefiles" /tmp/B.v8o6rdi5/BUILD/gnucash-5.7 /tmp/B.v8o6rdi5/BUILD/gnucash-5.7/po /tmp/B.v8o6rdi5/BUILD/gnucash-5.7/build /tmp/B.v8o6rdi5/BUILD/gnucash-5.7/build/po /tmp/B.v8o6rdi5/BUILD/gnucash-5.7/build/po/CMakeFiles/po-gmo.dir/DependInfo.cmake "--color=" make[2]: Leaving directory '/tmp/B.v8o6rdi5/BUILD/gnucash-5.7/build' make[2]: Entering directory '/tmp/B.v8o6rdi5/BUILD/gnucash-5.7/build' cd /tmp/B.v8o6rdi5/BUILD/gnucash-5.7/build && /usr/bin/cmake -E cmake_depends "Unix Makefiles" /tmp/B.v8o6rdi5/BUILD/gnucash-5.7 /tmp/B.v8o6rdi5/BUILD/gnucash-5.7/bindings/guile /tmp/B.v8o6rdi5/BUILD/gnucash-5.7/build /tmp/B.v8o6rdi5/BUILD/gnucash-5.7/build/bindings/guile /tmp/B.v8o6rdi5/BUILD/gnucash-5.7/build/bindings/guile/CMakeFiles/scm-app-utils-1-links.dir/DependInfo.cmake "--color=" make[2]: Leaving directory '/tmp/B.v8o6rdi5/BUILD/gnucash-5.7/build' make[2]: Entering directory '/tmp/B.v8o6rdi5/BUILD/gnucash-5.7/build' cd /tmp/B.v8o6rdi5/BUILD/gnucash-5.7/build && /usr/bin/cmake -E cmake_depends "Unix Makefiles" /tmp/B.v8o6rdi5/BUILD/gnucash-5.7 /tmp/B.v8o6rdi5/BUILD/gnucash-5.7/bindings/guile /tmp/B.v8o6rdi5/BUILD/gnucash-5.7/build /tmp/B.v8o6rdi5/BUILD/gnucash-5.7/build/bindings/guile /tmp/B.v8o6rdi5/BUILD/gnucash-5.7/build/bindings/guile/CMakeFiles/swig-apputils-guile-cpp.dir/DependInfo.cmake "--color=" make[2]: Leaving directory '/tmp/B.v8o6rdi5/BUILD/gnucash-5.7/build' /usr/bin/make -f libgnucash/engine/CMakeFiles/iso-4217-c.dir/build.make libgnucash/engine/CMakeFiles/iso-4217-c.dir/build make[2]: Entering directory '/tmp/B.v8o6rdi5/BUILD/gnucash-5.7/build' cd /tmp/B.v8o6rdi5/BUILD/gnucash-5.7/build && /usr/bin/cmake -E cmake_depends "Unix Makefiles" /tmp/B.v8o6rdi5/BUILD/gnucash-5.7 /tmp/B.v8o6rdi5/BUILD/gnucash-5.7/common/test-core /tmp/B.v8o6rdi5/BUILD/gnucash-5.7/build /tmp/B.v8o6rdi5/BUILD/gnucash-5.7/build/common/test-core /tmp/B.v8o6rdi5/BUILD/gnucash-5.7/build/common/test-core/CMakeFiles/jenny.dir/DependInfo.cmake "--color=" make[2]: Leaving directory '/tmp/B.v8o6rdi5/BUILD/gnucash-5.7/build' make[2]: Entering directory '/tmp/B.v8o6rdi5/BUILD/gnucash-5.7/build' cd /tmp/B.v8o6rdi5/BUILD/gnucash-5.7/build && /usr/bin/cmake -E cmake_depends "Unix Makefiles" /tmp/B.v8o6rdi5/BUILD/gnucash-5.7 /tmp/B.v8o6rdi5/BUILD/gnucash-5.7/libgnucash/quotes /tmp/B.v8o6rdi5/BUILD/gnucash-5.7/build /tmp/B.v8o6rdi5/BUILD/gnucash-5.7/build/libgnucash/quotes /tmp/B.v8o6rdi5/BUILD/gnucash-5.7/build/libgnucash/quotes/CMakeFiles/quotes-man.dir/DependInfo.cmake "--color=" make[2]: Leaving directory '/tmp/B.v8o6rdi5/BUILD/gnucash-5.7/build' make[2]: Entering directory '/tmp/B.v8o6rdi5/BUILD/gnucash-5.7/build' cd /tmp/B.v8o6rdi5/BUILD/gnucash-5.7/build && /usr/bin/cmake -E cmake_depends "Unix Makefiles" /tmp/B.v8o6rdi5/BUILD/gnucash-5.7 /tmp/B.v8o6rdi5/BUILD/gnucash-5.7/bindings/guile /tmp/B.v8o6rdi5/BUILD/gnucash-5.7/build /tmp/B.v8o6rdi5/BUILD/gnucash-5.7/build/bindings/guile /tmp/B.v8o6rdi5/BUILD/gnucash-5.7/build/bindings/guile/CMakeFiles/scm-core-utils-links.dir/DependInfo.cmake "--color=" make[2]: Leaving directory '/tmp/B.v8o6rdi5/BUILD/gnucash-5.7/build' make[2]: Entering directory '/tmp/B.v8o6rdi5/BUILD/gnucash-5.7/build' cd /tmp/B.v8o6rdi5/BUILD/gnucash-5.7/build && /usr/bin/cmake -E cmake_depends "Unix Makefiles" /tmp/B.v8o6rdi5/BUILD/gnucash-5.7 /tmp/B.v8o6rdi5/BUILD/gnucash-5.7/common/test-core /tmp/B.v8o6rdi5/BUILD/gnucash-5.7/build /tmp/B.v8o6rdi5/BUILD/gnucash-5.7/build/common/test-core /tmp/B.v8o6rdi5/BUILD/gnucash-5.7/build/common/test-core/CMakeFiles/swig-unittest-support-guile-c.dir/DependInfo.cmake "--color=" make[2]: Leaving directory '/tmp/B.v8o6rdi5/BUILD/gnucash-5.7/build' make[2]: Entering directory '/tmp/B.v8o6rdi5/BUILD/gnucash-5.7/build' cd /tmp/B.v8o6rdi5/BUILD/gnucash-5.7/build && /usr/bin/cmake -E cmake_depends "Unix Makefiles" /tmp/B.v8o6rdi5/BUILD/gnucash-5.7 /tmp/B.v8o6rdi5/BUILD/gnucash-5.7/bindings/guile /tmp/B.v8o6rdi5/BUILD/gnucash-5.7/build /tmp/B.v8o6rdi5/BUILD/gnucash-5.7/build/bindings/guile /tmp/B.v8o6rdi5/BUILD/gnucash-5.7/build/bindings/guile/CMakeFiles/scm-engine-2-links.dir/DependInfo.cmake "--color=" make[2]: Leaving directory '/tmp/B.v8o6rdi5/BUILD/gnucash-5.7/build' make[2]: Entering directory '/tmp/B.v8o6rdi5/BUILD/gnucash-5.7/build' cd /tmp/B.v8o6rdi5/BUILD/gnucash-5.7/build && /usr/bin/cmake -E cmake_depends "Unix Makefiles" /tmp/B.v8o6rdi5/BUILD/gnucash-5.7 /tmp/B.v8o6rdi5/BUILD/gnucash-5.7/libgnucash/quotes /tmp/B.v8o6rdi5/BUILD/gnucash-5.7/build /tmp/B.v8o6rdi5/BUILD/gnucash-5.7/build/libgnucash/quotes /tmp/B.v8o6rdi5/BUILD/gnucash-5.7/build/libgnucash/quotes/CMakeFiles/quotes-bin.dir/DependInfo.cmake "--color=" make[2]: Leaving directory '/tmp/B.v8o6rdi5/BUILD/gnucash-5.7/build' make[2]: Entering directory '/tmp/B.v8o6rdi5/BUILD/gnucash-5.7/build' cd /tmp/B.v8o6rdi5/BUILD/gnucash-5.7/build && /usr/bin/cmake -E cmake_depends "Unix Makefiles" /tmp/B.v8o6rdi5/BUILD/gnucash-5.7 /tmp/B.v8o6rdi5/BUILD/gnucash-5.7/libgnucash/gnc-module /tmp/B.v8o6rdi5/BUILD/gnucash-5.7/build /tmp/B.v8o6rdi5/BUILD/gnucash-5.7/build/libgnucash/gnc-module /tmp/B.v8o6rdi5/BUILD/gnucash-5.7/build/libgnucash/gnc-module/CMakeFiles/gnc-module.dir/DependInfo.cmake "--color=" make[2]: Leaving directory '/tmp/B.v8o6rdi5/BUILD/gnucash-5.7/build' /usr/bin/make -f libgnucash/engine/test-core/CMakeFiles/gnc-test-engine.dir/build.make libgnucash/engine/test-core/CMakeFiles/gnc-test-engine.dir/build make[2]: Entering directory '/tmp/B.v8o6rdi5/BUILD/gnucash-5.7/build' cd /tmp/B.v8o6rdi5/BUILD/gnucash-5.7/build && /usr/bin/cmake -E cmake_depends "Unix Makefiles" /tmp/B.v8o6rdi5/BUILD/gnucash-5.7 /tmp/B.v8o6rdi5/BUILD/gnucash-5.7/bindings/guile /tmp/B.v8o6rdi5/BUILD/gnucash-5.7/build /tmp/B.v8o6rdi5/BUILD/gnucash-5.7/build/bindings/guile /tmp/B.v8o6rdi5/BUILD/gnucash-5.7/build/bindings/guile/CMakeFiles/scm-engine-1-links.dir/DependInfo.cmake "--color=" make[2]: Leaving directory '/tmp/B.v8o6rdi5/BUILD/gnucash-5.7/build' make[2]: Entering directory '/tmp/B.v8o6rdi5/BUILD/gnucash-5.7/build' cd /tmp/B.v8o6rdi5/BUILD/gnucash-5.7/build && /usr/bin/cmake -E cmake_depends "Unix Makefiles" /tmp/B.v8o6rdi5/BUILD/gnucash-5.7 /tmp/B.v8o6rdi5/BUILD/gnucash-5.7/libgnucash/tax /tmp/B.v8o6rdi5/BUILD/gnucash-5.7/build /tmp/B.v8o6rdi5/BUILD/gnucash-5.7/build/libgnucash/tax /tmp/B.v8o6rdi5/BUILD/gnucash-5.7/build/libgnucash/tax/CMakeFiles/scm-tax-us-1-links.dir/DependInfo.cmake "--color=" make[2]: Leaving directory '/tmp/B.v8o6rdi5/BUILD/gnucash-5.7/build' make[2]: Entering directory '/tmp/B.v8o6rdi5/BUILD/gnucash-5.7/build' cd /tmp/B.v8o6rdi5/BUILD/gnucash-5.7/build && /usr/bin/cmake -E cmake_depends "Unix Makefiles" /tmp/B.v8o6rdi5/BUILD/gnucash-5.7 /tmp/B.v8o6rdi5/BUILD/gnucash-5.7/bindings/guile /tmp/B.v8o6rdi5/BUILD/gnucash-5.7/build /tmp/B.v8o6rdi5/BUILD/gnucash-5.7/build/bindings/guile /tmp/B.v8o6rdi5/BUILD/gnucash-5.7/build/bindings/guile/CMakeFiles/scm-engine-0-links.dir/DependInfo.cmake "--color=" make[2]: Leaving directory '/tmp/B.v8o6rdi5/BUILD/gnucash-5.7/build' make[2]: Entering directory '/tmp/B.v8o6rdi5/BUILD/gnucash-5.7/build' cd /tmp/B.v8o6rdi5/BUILD/gnucash-5.7/build && /usr/bin/cmake -E cmake_depends "Unix Makefiles" /tmp/B.v8o6rdi5/BUILD/gnucash-5.7 /tmp/B.v8o6rdi5/BUILD/gnucash-5.7/common/test-core /tmp/B.v8o6rdi5/BUILD/gnucash-5.7/build /tmp/B.v8o6rdi5/BUILD/gnucash-5.7/build/common/test-core /tmp/B.v8o6rdi5/BUILD/gnucash-5.7/build/common/test-core/CMakeFiles/swig-unittest-support-python.dir/DependInfo.cmake "--color=" make[2]: Leaving directory '/tmp/B.v8o6rdi5/BUILD/gnucash-5.7/build' make[2]: Entering directory '/tmp/B.v8o6rdi5/BUILD/gnucash-5.7/build' cd /tmp/B.v8o6rdi5/BUILD/gnucash-5.7/build && /usr/bin/cmake -E cmake_depends "Unix Makefiles" /tmp/B.v8o6rdi5/BUILD/gnucash-5.7 /tmp/B.v8o6rdi5/BUILD/gnucash-5.7/libgnucash/tax /tmp/B.v8o6rdi5/BUILD/gnucash-5.7/build /tmp/B.v8o6rdi5/BUILD/gnucash-5.7/build/libgnucash/tax /tmp/B.v8o6rdi5/BUILD/gnucash-5.7/build/libgnucash/tax/CMakeFiles/scm-tax-us-3-links.dir/DependInfo.cmake "--color=" make[2]: Leaving directory '/tmp/B.v8o6rdi5/BUILD/gnucash-5.7/build' make[2]: Entering directory '/tmp/B.v8o6rdi5/BUILD/gnucash-5.7/build' cd /tmp/B.v8o6rdi5/BUILD/gnucash-5.7/build && /usr/bin/cmake -E cmake_depends "Unix Makefiles" /tmp/B.v8o6rdi5/BUILD/gnucash-5.7 /tmp/B.v8o6rdi5/BUILD/gnucash-5.7/libgnucash/tax /tmp/B.v8o6rdi5/BUILD/gnucash-5.7/build /tmp/B.v8o6rdi5/BUILD/gnucash-5.7/build/libgnucash/tax /tmp/B.v8o6rdi5/BUILD/gnucash-5.7/build/libgnucash/tax/CMakeFiles/scm-tax-us-2-links.dir/DependInfo.cmake "--color=" make[2]: Leaving directory '/tmp/B.v8o6rdi5/BUILD/gnucash-5.7/build' /usr/bin/make -f bindings/guile/CMakeFiles/swig-engine-cpp.dir/build.make bindings/guile/CMakeFiles/swig-engine-cpp.dir/build /usr/bin/make -f po/CMakeFiles/po-gmo.dir/build.make po/CMakeFiles/po-gmo.dir/build /usr/bin/make -f common/test-core/CMakeFiles/swig-unittest-support-guile-c.dir/build.make common/test-core/CMakeFiles/swig-unittest-support-guile-c.dir/build /usr/bin/make -f bindings/guile/CMakeFiles/swig-apputils-guile-cpp.dir/build.make bindings/guile/CMakeFiles/swig-apputils-guile-cpp.dir/build /usr/bin/make -f common/test-core/CMakeFiles/swig-unittest-support-python.dir/build.make common/test-core/CMakeFiles/swig-unittest-support-python.dir/build /usr/bin/make -f common/test-core/CMakeFiles/jenny.dir/build.make common/test-core/CMakeFiles/jenny.dir/build /usr/bin/make -f common/CMakeFiles/swig-runtime-h.dir/build.make common/CMakeFiles/swig-runtime-h.dir/build make[2]: Entering directory '/tmp/B.v8o6rdi5/BUILD/gnucash-5.7/build' cd /tmp/B.v8o6rdi5/BUILD/gnucash-5.7/build && /usr/bin/cmake -E cmake_depends "Unix Makefiles" /tmp/B.v8o6rdi5/BUILD/gnucash-5.7 /tmp/B.v8o6rdi5/BUILD/gnucash-5.7/bindings/guile /tmp/B.v8o6rdi5/BUILD/gnucash-5.7/build /tmp/B.v8o6rdi5/BUILD/gnucash-5.7/build/bindings/guile /tmp/B.v8o6rdi5/BUILD/gnucash-5.7/build/bindings/guile/CMakeFiles/swig-expressions-guile-c.dir/DependInfo.cmake "--color=" make[2]: Leaving directory '/tmp/B.v8o6rdi5/BUILD/gnucash-5.7/build' /usr/bin/make -f bindings/guile/CMakeFiles/swig-core-utils-guile-c.dir/build.make bindings/guile/CMakeFiles/swig-core-utils-guile-c.dir/build /usr/bin/make -f libgnucash/gnc-module/CMakeFiles/gnc-module.dir/build.make libgnucash/gnc-module/CMakeFiles/gnc-module.dir/build /usr/bin/make -f libgnucash/quotes/CMakeFiles/quotes-man.dir/build.make libgnucash/quotes/CMakeFiles/quotes-man.dir/build /usr/bin/make -f libgnucash/quotes/CMakeFiles/quotes-bin.dir/build.make libgnucash/quotes/CMakeFiles/quotes-bin.dir/build make[2]: Entering directory '/tmp/B.v8o6rdi5/BUILD/gnucash-5.7/build' cd /tmp/B.v8o6rdi5/BUILD/gnucash-5.7/build && /usr/bin/cmake -E cmake_depends "Unix Makefiles" /tmp/B.v8o6rdi5/BUILD/gnucash-5.7 /tmp/B.v8o6rdi5/BUILD/gnucash-5.7/libgnucash/tax /tmp/B.v8o6rdi5/BUILD/gnucash-5.7/build /tmp/B.v8o6rdi5/BUILD/gnucash-5.7/build/libgnucash/tax /tmp/B.v8o6rdi5/BUILD/gnucash-5.7/build/libgnucash/tax/CMakeFiles/scm-tax-de_DE-1-links.dir/DependInfo.cmake "--color=" make[2]: Leaving directory '/tmp/B.v8o6rdi5/BUILD/gnucash-5.7/build' /usr/bin/make -f libgnucash/tax/CMakeFiles/scm-tax-us-1-links.dir/build.make libgnucash/tax/CMakeFiles/scm-tax-us-1-links.dir/build /usr/bin/make -f bindings/guile/CMakeFiles/scm-app-utils-2-links.dir/build.make bindings/guile/CMakeFiles/scm-app-utils-2-links.dir/build /usr/bin/make -f bindings/guile/CMakeFiles/scm-app-utils-1-links.dir/build.make bindings/guile/CMakeFiles/scm-app-utils-1-links.dir/build /usr/bin/make -f bindings/guile/CMakeFiles/scm-core-utils-links.dir/build.make bindings/guile/CMakeFiles/scm-core-utils-links.dir/build /usr/bin/make -f bindings/guile/CMakeFiles/scm-engine-2-links.dir/build.make bindings/guile/CMakeFiles/scm-engine-2-links.dir/build make[2]: Entering directory '/tmp/B.v8o6rdi5/BUILD/gnucash-5.7/build' cd /tmp/B.v8o6rdi5/BUILD/gnucash-5.7/build && /usr/bin/cmake -E cmake_depends "Unix Makefiles" /tmp/B.v8o6rdi5/BUILD/gnucash-5.7 /tmp/B.v8o6rdi5/BUILD/gnucash-5.7/libgnucash/tax /tmp/B.v8o6rdi5/BUILD/gnucash-5.7/build /tmp/B.v8o6rdi5/BUILD/gnucash-5.7/build/libgnucash/tax /tmp/B.v8o6rdi5/BUILD/gnucash-5.7/build/libgnucash/tax/CMakeFiles/scm-tax-de_DE-2-links.dir/DependInfo.cmake "--color=" make[2]: Leaving directory '/tmp/B.v8o6rdi5/BUILD/gnucash-5.7/build' /usr/bin/make -f bindings/guile/CMakeFiles/scm-engine-1-links.dir/build.make bindings/guile/CMakeFiles/scm-engine-1-links.dir/build /usr/bin/make -f bindings/guile/CMakeFiles/scm-engine-0-links.dir/build.make bindings/guile/CMakeFiles/scm-engine-0-links.dir/build make[2]: Nothing to be done for 'libgnucash/quotes/CMakeFiles/quotes-bin.dir/build'. /usr/bin/make -f libgnucash/tax/CMakeFiles/scm-tax-us-2-links.dir/build.make libgnucash/tax/CMakeFiles/scm-tax-us-2-links.dir/build /usr/bin/make -f libgnucash/tax/CMakeFiles/scm-tax-us-3-links.dir/build.make libgnucash/tax/CMakeFiles/scm-tax-us-3-links.dir/build /usr/bin/make -f libgnucash/tax/CMakeFiles/scm-tax-de_DE-1-links.dir/build.make libgnucash/tax/CMakeFiles/scm-tax-de_DE-1-links.dir/build /usr/bin/make -f libgnucash/tax/CMakeFiles/scm-tax-de_DE-2-links.dir/build.make libgnucash/tax/CMakeFiles/scm-tax-de_DE-2-links.dir/build /usr/bin/make -f bindings/guile/CMakeFiles/swig-expressions-guile-c.dir/build.make bindings/guile/CMakeFiles/swig-expressions-guile-c.dir/build make[2]: Entering directory '/tmp/B.v8o6rdi5/BUILD/gnucash-5.7/build' [ 0%] Generating iso-4217-currencies.c cd /tmp/B.v8o6rdi5/BUILD/gnucash-5.7/build/libgnucash/engine && /usr/bin/xsltproc -o /tmp/B.v8o6rdi5/BUILD/gnucash-5.7/build/libgnucash/engine/iso-4217-currencies.c /tmp/B.v8o6rdi5/BUILD/gnucash-5.7/libgnucash/engine/iso-currencies-to-c.xsl /tmp/B.v8o6rdi5/BUILD/gnucash-5.7/libgnucash/engine/iso-4217-currencies.xml make[2]: Leaving directory '/tmp/B.v8o6rdi5/BUILD/gnucash-5.7/build' make[2]: Entering directory '/tmp/B.v8o6rdi5/BUILD/gnucash-5.7/build' cd /tmp/B.v8o6rdi5/BUILD/gnucash-5.7/build/libgnucash/core-utils && /usr/bin/cmake -D SRC=/tmp/B.v8o6rdi5/BUILD/gnucash-5.7/build/libgnucash/core-utils/gnc-vcs-info.h.in -D DST=/tmp/B.v8o6rdi5/BUILD/gnucash-5.7/build/libgnucash/core-utils/gnc-vcs-info.h -D PROJECT_VERSION=5.7 -P /tmp/B.v8o6rdi5/BUILD/gnucash-5.7/cmake/no-vcs2version-info.cmake make[2]: Leaving directory '/tmp/B.v8o6rdi5/BUILD/gnucash-5.7/build' make[2]: Entering directory '/tmp/B.v8o6rdi5/BUILD/gnucash-5.7/build' [ 1%] Generating swig-runtime.h cd /tmp/B.v8o6rdi5/BUILD/gnucash-5.7/build/common && /usr/bin/swig -guile -external-runtime /tmp/B.v8o6rdi5/BUILD/gnucash-5.7/build/common/swig-runtime.h make[2]: Leaving directory '/tmp/B.v8o6rdi5/BUILD/gnucash-5.7/build' make[1]: Entering directory '/tmp/B.v8o6rdi5/BUILD/gnucash-5.7/build' [ 2%] Built target quotes-bin make[1]: Leaving directory '/tmp/B.v8o6rdi5/BUILD/gnucash-5.7/build' make[2]: Entering directory '/tmp/B.v8o6rdi5/BUILD/gnucash-5.7/build' [ 0%] Generating ../../share/guile/site/3.0/gnucash/json/builder.scm cd /tmp/B.v8o6rdi5/BUILD/gnucash-5.7/build/borrowed/guile-json && /usr/bin/cmake -E create_symlink /tmp/B.v8o6rdi5/BUILD/gnucash-5.7/borrowed/guile-json/json/builder.scm /tmp/B.v8o6rdi5/BUILD/gnucash-5.7/build/share/guile/site/3.0/gnucash/json/builder.scm make[2]: Leaving directory '/tmp/B.v8o6rdi5/BUILD/gnucash-5.7/build' /usr/bin/make -f gnucash/gnome/CMakeFiles/swig-gnome-c.dir/build.make gnucash/gnome/CMakeFiles/swig-gnome-c.dir/depend make[2]: Entering directory '/tmp/B.v8o6rdi5/BUILD/gnucash-5.7/build' [ 2%] Generating ../../share/guile/site/3.0/gnucash/app-utils.scm cd /tmp/B.v8o6rdi5/BUILD/gnucash-5.7/build/bindings/guile && /usr/bin/cmake -E create_symlink /tmp/B.v8o6rdi5/BUILD/gnucash-5.7/bindings/guile/app-utils.scm /tmp/B.v8o6rdi5/BUILD/gnucash-5.7/build/share/guile/site/3.0/gnucash/app-utils.scm make[2]: Leaving directory '/tmp/B.v8o6rdi5/BUILD/gnucash-5.7/build' make[2]: Entering directory '/tmp/B.v8o6rdi5/BUILD/gnucash-5.7/build' [ 2%] Generating ../../share/guile/site/3.0/gnucash/app-utils/c-interface.scm cd /tmp/B.v8o6rdi5/BUILD/gnucash-5.7/build/bindings/guile && /usr/bin/cmake -E create_symlink /tmp/B.v8o6rdi5/BUILD/gnucash-5.7/bindings/guile/c-interface.scm /tmp/B.v8o6rdi5/BUILD/gnucash-5.7/build/share/guile/site/3.0/gnucash/app-utils/c-interface.scm make[2]: Leaving directory '/tmp/B.v8o6rdi5/BUILD/gnucash-5.7/build' make[2]: Entering directory '/tmp/B.v8o6rdi5/BUILD/gnucash-5.7/build' [ 2%] Generating ../../share/guile/site/3.0/gnucash/utilities.scm cd /tmp/B.v8o6rdi5/BUILD/gnucash-5.7/build/bindings/guile && /usr/bin/cmake -E create_symlink /tmp/B.v8o6rdi5/BUILD/gnucash-5.7/bindings/guile/utilities.scm /tmp/B.v8o6rdi5/BUILD/gnucash-5.7/build/share/guile/site/3.0/gnucash/utilities.scm make[2]: Leaving directory '/tmp/B.v8o6rdi5/BUILD/gnucash-5.7/build' make[1]: Entering directory '/tmp/B.v8o6rdi5/BUILD/gnucash-5.7/build' [ 2%] Built target swig-runtime-h make[1]: Leaving directory '/tmp/B.v8o6rdi5/BUILD/gnucash-5.7/build' make[2]: Entering directory '/tmp/B.v8o6rdi5/BUILD/gnucash-5.7/build' [ 2%] Generating ../../share/guile/site/3.0/gnucash/engine.scm cd /tmp/B.v8o6rdi5/BUILD/gnucash-5.7/build/bindings/guile && /usr/bin/cmake -E create_symlink /tmp/B.v8o6rdi5/BUILD/gnucash-5.7/bindings/guile/engine.scm /tmp/B.v8o6rdi5/BUILD/gnucash-5.7/build/share/guile/site/3.0/gnucash/engine.scm make[2]: Leaving directory '/tmp/B.v8o6rdi5/BUILD/gnucash-5.7/build' make[2]: Entering directory '/tmp/B.v8o6rdi5/BUILD/gnucash-5.7/build' [ 2%] Generating ../../share/guile/site/3.0/gnucash/locale/us/tax/txf-help.scm cd /tmp/B.v8o6rdi5/BUILD/gnucash-5.7/build/libgnucash/tax && /usr/bin/cmake -E create_symlink /tmp/B.v8o6rdi5/BUILD/gnucash-5.7/libgnucash/tax/us/txf-help.scm /tmp/B.v8o6rdi5/BUILD/gnucash-5.7/build/share/guile/site/3.0/gnucash/locale/us/tax/txf-help.scm make[2]: Leaving directory '/tmp/B.v8o6rdi5/BUILD/gnucash-5.7/build' make[1]: Entering directory '/tmp/B.v8o6rdi5/BUILD/gnucash-5.7/build' [ 2%] Built target iso-4217-c make[1]: Leaving directory '/tmp/B.v8o6rdi5/BUILD/gnucash-5.7/build' make[2]: Entering directory '/tmp/B.v8o6rdi5/BUILD/gnucash-5.7/build' [ 2%] Generating ../../share/guile/site/3.0/gnucash/core-utils.scm cd /tmp/B.v8o6rdi5/BUILD/gnucash-5.7/build/bindings/guile && /usr/bin/cmake -E create_symlink /tmp/B.v8o6rdi5/BUILD/gnucash-5.7/bindings/guile/core-utils.scm /tmp/B.v8o6rdi5/BUILD/gnucash-5.7/build/share/guile/site/3.0/gnucash/core-utils.scm make[2]: Leaving directory '/tmp/B.v8o6rdi5/BUILD/gnucash-5.7/build' make[2]: Entering directory '/tmp/B.v8o6rdi5/BUILD/gnucash-5.7/build' [ 2%] Generating ../../share/guile/site/3.0/gnucash/locale/us/tax.scm cd /tmp/B.v8o6rdi5/BUILD/gnucash-5.7/build/libgnucash/tax && /usr/bin/cmake -E create_symlink /tmp/B.v8o6rdi5/BUILD/gnucash-5.7/libgnucash/tax/us/tax.scm /tmp/B.v8o6rdi5/BUILD/gnucash-5.7/build/share/guile/site/3.0/gnucash/locale/us/tax.scm make[2]: Leaving directory '/tmp/B.v8o6rdi5/BUILD/gnucash-5.7/build' make[2]: Entering directory '/tmp/B.v8o6rdi5/BUILD/gnucash-5.7/build' [ 2%] Generating ../../share/guile/site/3.0/gnucash/locale/de_DE/tax/txf.scm cd /tmp/B.v8o6rdi5/BUILD/gnucash-5.7/build/libgnucash/tax && /usr/bin/cmake -E create_symlink /tmp/B.v8o6rdi5/BUILD/gnucash-5.7/libgnucash/tax/de_DE/txf.scm /tmp/B.v8o6rdi5/BUILD/gnucash-5.7/build/share/guile/site/3.0/gnucash/locale/de_DE/tax/txf.scm make[2]: Leaving directory '/tmp/B.v8o6rdi5/BUILD/gnucash-5.7/build' make[2]: Entering directory '/tmp/B.v8o6rdi5/BUILD/gnucash-5.7/build' [ 2%] Generating ../../share/guile/site/3.0/gnucash/locale/us/tax/txf.scm cd /tmp/B.v8o6rdi5/BUILD/gnucash-5.7/build/libgnucash/tax && /usr/bin/cmake -E create_symlink /tmp/B.v8o6rdi5/BUILD/gnucash-5.7/libgnucash/tax/us/txf.scm /tmp/B.v8o6rdi5/BUILD/gnucash-5.7/build/share/guile/site/3.0/gnucash/locale/us/tax/txf.scm make[2]: Leaving directory '/tmp/B.v8o6rdi5/BUILD/gnucash-5.7/build' make[2]: Entering directory '/tmp/B.v8o6rdi5/BUILD/gnucash-5.7/build' [ 2%] Generating ../../share/guile/site/3.0/gnucash/engine/gnc-numeric.scm cd /tmp/B.v8o6rdi5/BUILD/gnucash-5.7/build/bindings/guile && /usr/bin/cmake -E create_symlink /tmp/B.v8o6rdi5/BUILD/gnucash-5.7/bindings/guile/gnc-numeric.scm /tmp/B.v8o6rdi5/BUILD/gnucash-5.7/build/share/guile/site/3.0/gnucash/engine/gnc-numeric.scm make[2]: Leaving directory '/tmp/B.v8o6rdi5/BUILD/gnucash-5.7/build' make[2]: Entering directory '/tmp/B.v8o6rdi5/BUILD/gnucash-5.7/build' [ 2%] Generating ../../share/guile/site/3.0/gnucash/locale/de_DE/tax/txf-help.scm cd /tmp/B.v8o6rdi5/BUILD/gnucash-5.7/build/libgnucash/tax && /usr/bin/cmake -E create_symlink /tmp/B.v8o6rdi5/BUILD/gnucash-5.7/libgnucash/tax/de_DE/txf-help.scm /tmp/B.v8o6rdi5/BUILD/gnucash-5.7/build/share/guile/site/3.0/gnucash/locale/de_DE/tax/txf-help.scm make[2]: Leaving directory '/tmp/B.v8o6rdi5/BUILD/gnucash-5.7/build' make[2]: Entering directory '/tmp/B.v8o6rdi5/BUILD/gnucash-5.7/build' [ 0%] Generating ../share/gnucash/tip_of_the_day.list cd /tmp/B.v8o6rdi5/BUILD/gnucash-5.7/build/doc && /usr/bin/cmake -D SRC=/tmp/B.v8o6rdi5/BUILD/gnucash-5.7/doc/tip_of_the_day.list.c -D TOTD=tip_of_the_day.list -D DST_DIR=/tmp/B.v8o6rdi5/BUILD/gnucash-5.7/build/share/gnucash -D CMAKE_C_COMPILER=/usr/bin/x86_64-pld-linux-gnux32-gcc -P /tmp/B.v8o6rdi5/BUILD/gnucash-5.7/cmake/configure-totd.cmake make[2]: Leaving directory '/tmp/B.v8o6rdi5/BUILD/gnucash-5.7/build' make[2]: Entering directory '/tmp/B.v8o6rdi5/BUILD/gnucash-5.7/build' cd /tmp/B.v8o6rdi5/BUILD/gnucash-5.7/build && /usr/bin/cmake -E cmake_depends "Unix Makefiles" /tmp/B.v8o6rdi5/BUILD/gnucash-5.7 /tmp/B.v8o6rdi5/BUILD/gnucash-5.7/gnucash/gnome /tmp/B.v8o6rdi5/BUILD/gnucash-5.7/build /tmp/B.v8o6rdi5/BUILD/gnucash-5.7/build/gnucash/gnome /tmp/B.v8o6rdi5/BUILD/gnucash-5.7/build/gnucash/gnome/CMakeFiles/swig-gnome-c.dir/DependInfo.cmake "--color=" make[2]: Leaving directory '/tmp/B.v8o6rdi5/BUILD/gnucash-5.7/build' make[1]: Entering directory '/tmp/B.v8o6rdi5/BUILD/gnucash-5.7/build' [ 2%] Built target gnc-vcs-info make[1]: Leaving directory '/tmp/B.v8o6rdi5/BUILD/gnucash-5.7/build' /usr/bin/make -f gnucash/gnome/CMakeFiles/swig-gnome-c.dir/build.make gnucash/gnome/CMakeFiles/swig-gnome-c.dir/build make[1]: Entering directory '/tmp/B.v8o6rdi5/BUILD/gnucash-5.7/build' [ 2%] Built target scm-app-utils-2-links make[1]: Leaving directory '/tmp/B.v8o6rdi5/BUILD/gnucash-5.7/build' make[1]: Entering directory '/tmp/B.v8o6rdi5/BUILD/gnucash-5.7/build' [ 2%] Built target scm-engine-2-links make[1]: Leaving directory '/tmp/B.v8o6rdi5/BUILD/gnucash-5.7/build' /usr/bin/make -f gnucash/html/CMakeFiles/swig-gnc-html-c.dir/build.make gnucash/html/CMakeFiles/swig-gnc-html-c.dir/depend make[1]: Entering directory '/tmp/B.v8o6rdi5/BUILD/gnucash-5.7/build' [ 4%] Built target scm-tax-us-1-links make[1]: Leaving directory '/tmp/B.v8o6rdi5/BUILD/gnucash-5.7/build' /usr/bin/make -f gnucash/report/CMakeFiles/swig-report-c.dir/build.make gnucash/report/CMakeFiles/swig-report-c.dir/depend make[1]: Entering directory '/tmp/B.v8o6rdi5/BUILD/gnucash-5.7/build' [ 4%] Built target totd make[1]: Leaving directory '/tmp/B.v8o6rdi5/BUILD/gnucash-5.7/build' make[1]: Entering directory '/tmp/B.v8o6rdi5/BUILD/gnucash-5.7/build' [ 4%] Built target scm-core-utils-links make[1]: Leaving directory '/tmp/B.v8o6rdi5/BUILD/gnucash-5.7/build' /usr/bin/make -f gnucash/gnome/CMakeFiles/dist-gnucash-gnome-gnucash-appdata-xml-in.dir/build.make gnucash/gnome/CMakeFiles/dist-gnucash-gnome-gnucash-appdata-xml-in.dir/depend make[2]: Entering directory '/tmp/B.v8o6rdi5/BUILD/gnucash-5.7/build' [ 2%] Generating swig-app-utils-guile.cpp cd /tmp/B.v8o6rdi5/BUILD/gnucash-5.7/build/bindings/guile && /usr/bin/swig -guile -Linkage module -c++ -procdoc sw-gnc-option-doc -procdocformat plain -I/tmp/B.v8o6rdi5/BUILD/gnucash-5.7/common -I/tmp/B.v8o6rdi5/BUILD/gnucash-5.7/libgnucash/engine -I/tmp/B.v8o6rdi5/BUILD/gnucash-5.7/bindings/guile -I/tmp/B.v8o6rdi5/BUILD/gnucash-5.7/libgnucash/app-utils -o /tmp/B.v8o6rdi5/BUILD/gnucash-5.7/build/bindings/guile/swig-app-utils-guile.cpp /tmp/B.v8o6rdi5/BUILD/gnucash-5.7/bindings/guile/../app-utils.i make[2]: Leaving directory '/tmp/B.v8o6rdi5/BUILD/gnucash-5.7/build' make[2]: Entering directory '/tmp/B.v8o6rdi5/BUILD/gnucash-5.7/build' [ 1%] Generating swig-unittest-support-guile.c cd /tmp/B.v8o6rdi5/BUILD/gnucash-5.7/build/common/test-core && /usr/bin/swig -guile -Linkage module -I/tmp/B.v8o6rdi5/BUILD/gnucash-5.7/common -I/tmp/B.v8o6rdi5/BUILD/gnucash-5.7/libgnucash/engine -o /tmp/B.v8o6rdi5/BUILD/gnucash-5.7/build/common/test-core/swig-unittest-support-guile.c /tmp/B.v8o6rdi5/BUILD/gnucash-5.7/common/test-core/unittest-support.i make[2]: Leaving directory '/tmp/B.v8o6rdi5/BUILD/gnucash-5.7/build' make[1]: Entering directory '/tmp/B.v8o6rdi5/BUILD/gnucash-5.7/build' [ 4%] Built target scm-engine-1-links make[1]: Leaving directory '/tmp/B.v8o6rdi5/BUILD/gnucash-5.7/build' make[1]: Entering directory '/tmp/B.v8o6rdi5/BUILD/gnucash-5.7/build' [ 4%] Built target scm-tax-us-3-links make[1]: Leaving directory '/tmp/B.v8o6rdi5/BUILD/gnucash-5.7/build' make[1]: Entering directory '/tmp/B.v8o6rdi5/BUILD/gnucash-5.7/build' [ 4%] Built target scm-tax-de_DE-1-links make[1]: Leaving directory '/tmp/B.v8o6rdi5/BUILD/gnucash-5.7/build' /usr/bin/make -f gnucash/gnome/CMakeFiles/gnucash-desktop.dir/build.make gnucash/gnome/CMakeFiles/gnucash-desktop.dir/depend make[1]: Entering directory '/tmp/B.v8o6rdi5/BUILD/gnucash-5.7/build' [ 4%] Built target scm-tax-de_DE-2-links make[1]: Leaving directory '/tmp/B.v8o6rdi5/BUILD/gnucash-5.7/build' /usr/bin/make -f gnucash/gnome-utils/CMakeFiles/scm-gnome-utils-2-links.dir/build.make gnucash/gnome-utils/CMakeFiles/scm-gnome-utils-2-links.dir/depend make[2]: Entering directory '/tmp/B.v8o6rdi5/BUILD/gnucash-5.7/build' [ 2%] Generating ../../share/guile/site/3.0/gnucash/app-utils/date-utilities.scm cd /tmp/B.v8o6rdi5/BUILD/gnucash-5.7/build/bindings/guile && /usr/bin/cmake -E create_symlink /tmp/B.v8o6rdi5/BUILD/gnucash-5.7/bindings/guile/date-utilities.scm /tmp/B.v8o6rdi5/BUILD/gnucash-5.7/build/share/guile/site/3.0/gnucash/app-utils/date-utilities.scm make[2]: Leaving directory '/tmp/B.v8o6rdi5/BUILD/gnucash-5.7/build' make[1]: Entering directory '/tmp/B.v8o6rdi5/BUILD/gnucash-5.7/build' [ 4%] Built target scm-tax-us-2-links make[1]: Leaving directory '/tmp/B.v8o6rdi5/BUILD/gnucash-5.7/build' make[2]: Entering directory '/tmp/B.v8o6rdi5/BUILD/gnucash-5.7/build' [ 2%] Generating swig-expressions-guile.c cd /tmp/B.v8o6rdi5/BUILD/gnucash-5.7/build/bindings/guile && /usr/bin/swig -guile -Linkage module -I/tmp/B.v8o6rdi5/BUILD/gnucash-5.7/common -I/tmp/B.v8o6rdi5/BUILD/gnucash-5.7/libgnucash/engine -I/tmp/B.v8o6rdi5/BUILD/gnucash-5.7/bindings/guile -I/tmp/B.v8o6rdi5/BUILD/gnucash-5.7/libgnucash/app-utils -I/tmp/B.v8o6rdi5/BUILD/gnucash-5.7/libgnucash/expressions -o /tmp/B.v8o6rdi5/BUILD/gnucash-5.7/build/bindings/guile/swig-expressions-guile.c /tmp/B.v8o6rdi5/BUILD/gnucash-5.7/bindings/guile/expressions.i make[2]: Leaving directory '/tmp/B.v8o6rdi5/BUILD/gnucash-5.7/build' /usr/bin/make -f gnucash/gnome-utils/CMakeFiles/scm-gnome-utils-1-links.dir/build.make gnucash/gnome-utils/CMakeFiles/scm-gnome-utils-1-links.dir/depend make[2]: Entering directory '/tmp/B.v8o6rdi5/BUILD/gnucash-5.7/build' cd /tmp/B.v8o6rdi5/BUILD/gnucash-5.7/build && /usr/bin/cmake -E cmake_depends "Unix Makefiles" /tmp/B.v8o6rdi5/BUILD/gnucash-5.7 /tmp/B.v8o6rdi5/BUILD/gnucash-5.7/gnucash/html /tmp/B.v8o6rdi5/BUILD/gnucash-5.7/build /tmp/B.v8o6rdi5/BUILD/gnucash-5.7/build/gnucash/html /tmp/B.v8o6rdi5/BUILD/gnucash-5.7/build/gnucash/html/CMakeFiles/swig-gnc-html-c.dir/DependInfo.cmake "--color=" make[2]: Leaving directory '/tmp/B.v8o6rdi5/BUILD/gnucash-5.7/build' make[2]: Entering directory '/tmp/B.v8o6rdi5/BUILD/gnucash-5.7/build' cd /tmp/B.v8o6rdi5/BUILD/gnucash-5.7/build && /usr/bin/cmake -E cmake_depends "Unix Makefiles" /tmp/B.v8o6rdi5/BUILD/gnucash-5.7 /tmp/B.v8o6rdi5/BUILD/gnucash-5.7/gnucash/report /tmp/B.v8o6rdi5/BUILD/gnucash-5.7/build /tmp/B.v8o6rdi5/BUILD/gnucash-5.7/build/gnucash/report /tmp/B.v8o6rdi5/BUILD/gnucash-5.7/build/gnucash/report/CMakeFiles/swig-report-c.dir/DependInfo.cmake "--color=" make[2]: Leaving directory '/tmp/B.v8o6rdi5/BUILD/gnucash-5.7/build' make[1]: Entering directory '/tmp/B.v8o6rdi5/BUILD/gnucash-5.7/build' [ 4%] Built target swig-unittest-support-guile-c make[1]: Leaving directory '/tmp/B.v8o6rdi5/BUILD/gnucash-5.7/build' make[2]: Entering directory '/tmp/B.v8o6rdi5/BUILD/gnucash-5.7/build' [ 4%] Generating ../../share/guile/site/3.0/gnucash/json/parser.scm cd /tmp/B.v8o6rdi5/BUILD/gnucash-5.7/build/borrowed/guile-json && /usr/bin/cmake -E create_symlink /tmp/B.v8o6rdi5/BUILD/gnucash-5.7/borrowed/guile-json/json/parser.scm /tmp/B.v8o6rdi5/BUILD/gnucash-5.7/build/share/guile/site/3.0/gnucash/json/parser.scm make[2]: Leaving directory '/tmp/B.v8o6rdi5/BUILD/gnucash-5.7/build' make[2]: Entering directory '/tmp/B.v8o6rdi5/BUILD/gnucash-5.7/build' [ 4%] Generating ../../share/guile/site/3.0/gnucash/engine/business-core.scm cd /tmp/B.v8o6rdi5/BUILD/gnucash-5.7/build/bindings/guile && /usr/bin/cmake -E create_symlink /tmp/B.v8o6rdi5/BUILD/gnucash-5.7/bindings/guile/business-core.scm /tmp/B.v8o6rdi5/BUILD/gnucash-5.7/build/share/guile/site/3.0/gnucash/engine/business-core.scm make[2]: Leaving directory '/tmp/B.v8o6rdi5/BUILD/gnucash-5.7/build' make[2]: Entering directory '/tmp/B.v8o6rdi5/BUILD/gnucash-5.7/build' cd /tmp/B.v8o6rdi5/BUILD/gnucash-5.7/build && /usr/bin/cmake -E cmake_depends "Unix Makefiles" /tmp/B.v8o6rdi5/BUILD/gnucash-5.7 /tmp/B.v8o6rdi5/BUILD/gnucash-5.7/gnucash/gnome /tmp/B.v8o6rdi5/BUILD/gnucash-5.7/build /tmp/B.v8o6rdi5/BUILD/gnucash-5.7/build/gnucash/gnome /tmp/B.v8o6rdi5/BUILD/gnucash-5.7/build/gnucash/gnome/CMakeFiles/dist-gnucash-gnome-gnucash-appdata-xml-in.dir/DependInfo.cmake "--color=" make[2]: Leaving directory '/tmp/B.v8o6rdi5/BUILD/gnucash-5.7/build' /usr/bin/make -f gnucash/html/CMakeFiles/swig-gnc-html-c.dir/build.make gnucash/html/CMakeFiles/swig-gnc-html-c.dir/build make[2]: Entering directory '/tmp/B.v8o6rdi5/BUILD/gnucash-5.7/build' cd /tmp/B.v8o6rdi5/BUILD/gnucash-5.7/build && /usr/bin/cmake -E cmake_depends "Unix Makefiles" /tmp/B.v8o6rdi5/BUILD/gnucash-5.7 /tmp/B.v8o6rdi5/BUILD/gnucash-5.7/gnucash/gnome /tmp/B.v8o6rdi5/BUILD/gnucash-5.7/build /tmp/B.v8o6rdi5/BUILD/gnucash-5.7/build/gnucash/gnome /tmp/B.v8o6rdi5/BUILD/gnucash-5.7/build/gnucash/gnome/CMakeFiles/gnucash-desktop.dir/DependInfo.cmake "--color=" make[2]: Leaving directory '/tmp/B.v8o6rdi5/BUILD/gnucash-5.7/build' make[2]: Entering directory '/tmp/B.v8o6rdi5/BUILD/gnucash-5.7/build' [ 4%] Generating ../../share/guile/site/3.0/gnucash/json/syntax.scm cd /tmp/B.v8o6rdi5/BUILD/gnucash-5.7/build/borrowed/guile-json && /usr/bin/cmake -E create_symlink /tmp/B.v8o6rdi5/BUILD/gnucash-5.7/borrowed/guile-json/json/syntax.scm /tmp/B.v8o6rdi5/BUILD/gnucash-5.7/build/share/guile/site/3.0/gnucash/json/syntax.scm make[2]: Leaving directory '/tmp/B.v8o6rdi5/BUILD/gnucash-5.7/build' /usr/bin/make -f gnucash/report/CMakeFiles/swig-report-c.dir/build.make gnucash/report/CMakeFiles/swig-report-c.dir/build /usr/bin/make -f gnucash/gnome/CMakeFiles/dist-gnucash-gnome-gnucash-appdata-xml-in.dir/build.make gnucash/gnome/CMakeFiles/dist-gnucash-gnome-gnucash-appdata-xml-in.dir/build make[1]: Entering directory '/tmp/B.v8o6rdi5/BUILD/gnucash-5.7/build' [ 4%] Built target swig-apputils-guile-cpp make[1]: Leaving directory '/tmp/B.v8o6rdi5/BUILD/gnucash-5.7/build' make[2]: Entering directory '/tmp/B.v8o6rdi5/BUILD/gnucash-5.7/build' cd /tmp/B.v8o6rdi5/BUILD/gnucash-5.7/build && /usr/bin/cmake -E cmake_depends "Unix Makefiles" /tmp/B.v8o6rdi5/BUILD/gnucash-5.7 /tmp/B.v8o6rdi5/BUILD/gnucash-5.7/gnucash/gnome-utils /tmp/B.v8o6rdi5/BUILD/gnucash-5.7/build /tmp/B.v8o6rdi5/BUILD/gnucash-5.7/build/gnucash/gnome-utils /tmp/B.v8o6rdi5/BUILD/gnucash-5.7/build/gnucash/gnome-utils/CMakeFiles/scm-gnome-utils-2-links.dir/DependInfo.cmake "--color=" /usr/bin/make -f gnucash/gnome/CMakeFiles/gnucash-desktop.dir/build.make gnucash/gnome/CMakeFiles/gnucash-desktop.dir/build make[2]: Leaving directory '/tmp/B.v8o6rdi5/BUILD/gnucash-5.7/build' make[1]: Entering directory '/tmp/B.v8o6rdi5/BUILD/gnucash-5.7/build' [ 4%] Built target scm-app-utils-1-links make[1]: Leaving directory '/tmp/B.v8o6rdi5/BUILD/gnucash-5.7/build' /usr/bin/make -f gnucash/report/CMakeFiles/scm-report-eguile-links.dir/build.make gnucash/report/CMakeFiles/scm-report-eguile-links.dir/depend /usr/bin/make -f gnucash/gnome-utils/CMakeFiles/scm-gnome-utils-2-links.dir/build.make gnucash/gnome-utils/CMakeFiles/scm-gnome-utils-2-links.dir/build make[1]: Entering directory '/tmp/B.v8o6rdi5/BUILD/gnucash-5.7/build' [ 4%] Built target swig-expressions-guile-c make[1]: Leaving directory '/tmp/B.v8o6rdi5/BUILD/gnucash-5.7/build' /usr/bin/make -f gnucash/report/CMakeFiles/scm-report-eguile-parts-links.dir/build.make gnucash/report/CMakeFiles/scm-report-eguile-parts-links.dir/depend make[2]: Entering directory '/tmp/B.v8o6rdi5/BUILD/gnucash-5.7/build' cd /tmp/B.v8o6rdi5/BUILD/gnucash-5.7/build && /usr/bin/cmake -E cmake_depends "Unix Makefiles" /tmp/B.v8o6rdi5/BUILD/gnucash-5.7 /tmp/B.v8o6rdi5/BUILD/gnucash-5.7/gnucash/gnome-utils /tmp/B.v8o6rdi5/BUILD/gnucash-5.7/build /tmp/B.v8o6rdi5/BUILD/gnucash-5.7/build/gnucash/gnome-utils /tmp/B.v8o6rdi5/BUILD/gnucash-5.7/build/gnucash/gnome-utils/CMakeFiles/scm-gnome-utils-1-links.dir/DependInfo.cmake "--color=" make[2]: Leaving directory '/tmp/B.v8o6rdi5/BUILD/gnucash-5.7/build' /usr/bin/make -f gnucash/gnome-utils/CMakeFiles/scm-gnome-utils-1-links.dir/build.make gnucash/gnome-utils/CMakeFiles/scm-gnome-utils-1-links.dir/build make[2]: Entering directory '/tmp/B.v8o6rdi5/BUILD/gnucash-5.7/build' [ 2%] Generating swig-core-utils-guile.c cd /tmp/B.v8o6rdi5/BUILD/gnucash-5.7/build/bindings/guile && /usr/bin/swig -guile -Linkage module -I/tmp/B.v8o6rdi5/BUILD/gnucash-5.7/common -I/tmp/B.v8o6rdi5/BUILD/gnucash-5.7/libgnucash/engine -I/tmp/B.v8o6rdi5/BUILD/gnucash-5.7/libgnucash/core-utils -o /tmp/B.v8o6rdi5/BUILD/gnucash-5.7/build/bindings/guile/swig-core-utils-guile.c /tmp/B.v8o6rdi5/BUILD/gnucash-5.7/bindings/core-utils.i make[2]: Leaving directory '/tmp/B.v8o6rdi5/BUILD/gnucash-5.7/build' make[1]: Entering directory '/tmp/B.v8o6rdi5/BUILD/gnucash-5.7/build' [ 4%] Built target guile-json-details-links make[1]: Leaving directory '/tmp/B.v8o6rdi5/BUILD/gnucash-5.7/build' make[1]: Entering directory '/tmp/B.v8o6rdi5/BUILD/gnucash-5.7/build' [ 4%] Built target scm-engine-0-links make[1]: Leaving directory '/tmp/B.v8o6rdi5/BUILD/gnucash-5.7/build' /usr/bin/make -f gnucash/report/CMakeFiles/scm-report-2-links.dir/build.make gnucash/report/CMakeFiles/scm-report-2-links.dir/depend make[1]: Entering directory '/tmp/B.v8o6rdi5/BUILD/gnucash-5.7/build' [ 4%] Built target swig-core-utils-guile-c make[1]: Leaving directory '/tmp/B.v8o6rdi5/BUILD/gnucash-5.7/build' make[2]: Entering directory '/tmp/B.v8o6rdi5/BUILD/gnucash-5.7/build' cd /tmp/B.v8o6rdi5/BUILD/gnucash-5.7/build && /usr/bin/cmake -E cmake_depends "Unix Makefiles" /tmp/B.v8o6rdi5/BUILD/gnucash-5.7 /tmp/B.v8o6rdi5/BUILD/gnucash-5.7/gnucash/report /tmp/B.v8o6rdi5/BUILD/gnucash-5.7/build /tmp/B.v8o6rdi5/BUILD/gnucash-5.7/build/gnucash/report /tmp/B.v8o6rdi5/BUILD/gnucash-5.7/build/gnucash/report/CMakeFiles/scm-report-eguile-parts-links.dir/DependInfo.cmake "--color=" make[2]: Leaving directory '/tmp/B.v8o6rdi5/BUILD/gnucash-5.7/build' /usr/bin/make -f gnucash/report/CMakeFiles/scm-report-eguile-parts-links.dir/build.make gnucash/report/CMakeFiles/scm-report-eguile-parts-links.dir/build make[2]: Entering directory '/tmp/B.v8o6rdi5/BUILD/gnucash-5.7/build' [ 2%] Generating finance-quote-wrapper.1 cd /tmp/B.v8o6rdi5/BUILD/gnucash-5.7/build/libgnucash/quotes && /usr/bin/perl /usr/bin/pod2man /tmp/B.v8o6rdi5/BUILD/gnucash-5.7/build/bin/finance-quote-wrapper /tmp/B.v8o6rdi5/BUILD/gnucash-5.7/build/libgnucash/quotes/finance-quote-wrapper.1 make[2]: Leaving directory '/tmp/B.v8o6rdi5/BUILD/gnucash-5.7/build' make[2]: Entering directory '/tmp/B.v8o6rdi5/BUILD/gnucash-5.7/build' cd /tmp/B.v8o6rdi5/BUILD/gnucash-5.7/build && /usr/bin/cmake -E cmake_depends "Unix Makefiles" /tmp/B.v8o6rdi5/BUILD/gnucash-5.7 /tmp/B.v8o6rdi5/BUILD/gnucash-5.7/gnucash/report /tmp/B.v8o6rdi5/BUILD/gnucash-5.7/build /tmp/B.v8o6rdi5/BUILD/gnucash-5.7/build/gnucash/report /tmp/B.v8o6rdi5/BUILD/gnucash-5.7/build/gnucash/report/CMakeFiles/scm-report-eguile-links.dir/DependInfo.cmake "--color=" make[2]: Leaving directory '/tmp/B.v8o6rdi5/BUILD/gnucash-5.7/build' /usr/bin/make -f gnucash/report/CMakeFiles/scm-report-eguile-links.dir/build.make gnucash/report/CMakeFiles/scm-report-eguile-links.dir/build make[2]: Entering directory '/tmp/B.v8o6rdi5/BUILD/gnucash-5.7/build' cd /tmp/B.v8o6rdi5/BUILD/gnucash-5.7/build && /usr/bin/cmake -E cmake_depends "Unix Makefiles" /tmp/B.v8o6rdi5/BUILD/gnucash-5.7 /tmp/B.v8o6rdi5/BUILD/gnucash-5.7/gnucash/report /tmp/B.v8o6rdi5/BUILD/gnucash-5.7/build /tmp/B.v8o6rdi5/BUILD/gnucash-5.7/build/gnucash/report /tmp/B.v8o6rdi5/BUILD/gnucash-5.7/build/gnucash/report/CMakeFiles/scm-report-2-links.dir/DependInfo.cmake "--color=" make[2]: Leaving directory '/tmp/B.v8o6rdi5/BUILD/gnucash-5.7/build' /usr/bin/make -f gnucash/report/CMakeFiles/scm-report-2-links.dir/build.make gnucash/report/CMakeFiles/scm-report-2-links.dir/build make[2]: Entering directory '/tmp/B.v8o6rdi5/BUILD/gnucash-5.7/build' [ 4%] Generating ../../share/guile/site/3.0/gnucash/gnome-utils/gnc-menu-extensions.scm cd /tmp/B.v8o6rdi5/BUILD/gnucash-5.7/build/gnucash/gnome-utils && /usr/bin/cmake -E create_symlink /tmp/B.v8o6rdi5/BUILD/gnucash-5.7/gnucash/gnome-utils/gnc-menu-extensions.scm /tmp/B.v8o6rdi5/BUILD/gnucash-5.7/build/share/guile/site/3.0/gnucash/gnome-utils/gnc-menu-extensions.scm make[2]: Leaving directory '/tmp/B.v8o6rdi5/BUILD/gnucash-5.7/build' make[2]: Entering directory '/tmp/B.v8o6rdi5/BUILD/gnucash-5.7/build' [ 4%] Generating ../../share/guile/site/3.0/gnucash/gnome-utils.scm cd /tmp/B.v8o6rdi5/BUILD/gnucash-5.7/build/gnucash/gnome-utils && /usr/bin/cmake -E create_symlink /tmp/B.v8o6rdi5/BUILD/gnucash-5.7/gnucash/gnome-utils/gnome-utils.scm /tmp/B.v8o6rdi5/BUILD/gnucash-5.7/build/share/guile/site/3.0/gnucash/gnome-utils.scm make[2]: Leaving directory '/tmp/B.v8o6rdi5/BUILD/gnucash-5.7/build' make[1]: Entering directory '/tmp/B.v8o6rdi5/BUILD/gnucash-5.7/build' [ 4%] Built target quotes-man make[1]: Leaving directory '/tmp/B.v8o6rdi5/BUILD/gnucash-5.7/build' /usr/bin/make -f gnucash/html/CMakeFiles/scm-gnc-html-links.dir/build.make gnucash/html/CMakeFiles/scm-gnc-html-links.dir/depend make[2]: Entering directory '/tmp/B.v8o6rdi5/BUILD/gnucash-5.7/build' [ 4%] Generating swig-gnc-html.c cd /tmp/B.v8o6rdi5/BUILD/gnucash-5.7/build/gnucash/html && /usr/bin/swig -guile -Linkage module -I/tmp/B.v8o6rdi5/BUILD/gnucash-5.7/common -I/tmp/B.v8o6rdi5/BUILD/gnucash-5.7/libgnucash/engine -o /tmp/B.v8o6rdi5/BUILD/gnucash-5.7/build/gnucash/html/swig-gnc-html.c /tmp/B.v8o6rdi5/BUILD/gnucash-5.7/gnucash/html/gnc-html.i make[2]: Leaving directory '/tmp/B.v8o6rdi5/BUILD/gnucash-5.7/build' make[2]: Entering directory '/tmp/B.v8o6rdi5/BUILD/gnucash-5.7/build' [ 4%] Generating swig-gnome.c cd /tmp/B.v8o6rdi5/BUILD/gnucash-5.7/build/gnucash/gnome && /usr/bin/swig -guile -Linkage module -I/tmp/B.v8o6rdi5/BUILD/gnucash-5.7/common -I/tmp/B.v8o6rdi5/BUILD/gnucash-5.7/libgnucash/engine -o /tmp/B.v8o6rdi5/BUILD/gnucash-5.7/build/gnucash/gnome/swig-gnome.c /tmp/B.v8o6rdi5/BUILD/gnucash-5.7/gnucash/gnome/gnome.i make[2]: Leaving directory '/tmp/B.v8o6rdi5/BUILD/gnucash-5.7/build' make[1]: Entering directory '/tmp/B.v8o6rdi5/BUILD/gnucash-5.7/build' [ 4%] Built target scm-gnome-utils-1-links make[1]: Leaving directory '/tmp/B.v8o6rdi5/BUILD/gnucash-5.7/build' /usr/bin/make -f gnucash/report/CMakeFiles/scm-report-1-links.dir/build.make gnucash/report/CMakeFiles/scm-report-1-links.dir/depend make[2]: Entering directory '/tmp/B.v8o6rdi5/BUILD/gnucash-5.7/build' [ 4%] Generating ../../share/guile/site/3.0/gnucash/eguile/eguile-utilities.scm cd /tmp/B.v8o6rdi5/BUILD/gnucash-5.7/build/gnucash/report && /usr/bin/cmake -E create_symlink /tmp/B.v8o6rdi5/BUILD/gnucash-5.7/gnucash/report/eguile-utilities.scm /tmp/B.v8o6rdi5/BUILD/gnucash-5.7/build/share/guile/site/3.0/gnucash/eguile/eguile-utilities.scm make[2]: Leaving directory '/tmp/B.v8o6rdi5/BUILD/gnucash-5.7/build' make[1]: Entering directory '/tmp/B.v8o6rdi5/BUILD/gnucash-5.7/build' [ 4%] Built target scm-gnome-utils-2-links make[1]: Leaving directory '/tmp/B.v8o6rdi5/BUILD/gnucash-5.7/build' /usr/bin/make -f gnucash/report/reports/CMakeFiles/scm-reports-standard-2-links.dir/build.make gnucash/report/reports/CMakeFiles/scm-reports-standard-2-links.dir/depend make[2]: Entering directory '/tmp/B.v8o6rdi5/BUILD/gnucash-5.7/build' cd /tmp/B.v8o6rdi5/BUILD/gnucash-5.7/build && /usr/bin/cmake -E cmake_depends "Unix Makefiles" /tmp/B.v8o6rdi5/BUILD/gnucash-5.7 /tmp/B.v8o6rdi5/BUILD/gnucash-5.7/gnucash/html /tmp/B.v8o6rdi5/BUILD/gnucash-5.7/build /tmp/B.v8o6rdi5/BUILD/gnucash-5.7/build/gnucash/html /tmp/B.v8o6rdi5/BUILD/gnucash-5.7/build/gnucash/html/CMakeFiles/scm-gnc-html-links.dir/DependInfo.cmake "--color=" make[2]: Leaving directory '/tmp/B.v8o6rdi5/BUILD/gnucash-5.7/build' /usr/bin/make -f gnucash/html/CMakeFiles/scm-gnc-html-links.dir/build.make gnucash/html/CMakeFiles/scm-gnc-html-links.dir/build make[1]: Entering directory '/tmp/B.v8o6rdi5/BUILD/gnucash-5.7/build' [ 4%] Built target swig-gnc-html-c make[1]: Leaving directory '/tmp/B.v8o6rdi5/BUILD/gnucash-5.7/build' make[2]: Entering directory '/tmp/B.v8o6rdi5/BUILD/gnucash-5.7/build' [ 4%] Generating ../../share/guile/site/3.0/gnucash/eguile.scm cd /tmp/B.v8o6rdi5/BUILD/gnucash-5.7/build/gnucash/report && /usr/bin/cmake -E create_symlink /tmp/B.v8o6rdi5/BUILD/gnucash-5.7/gnucash/report/eguile.scm /tmp/B.v8o6rdi5/BUILD/gnucash-5.7/build/share/guile/site/3.0/gnucash/eguile.scm make[2]: Leaving directory '/tmp/B.v8o6rdi5/BUILD/gnucash-5.7/build' make[2]: Entering directory '/tmp/B.v8o6rdi5/BUILD/gnucash-5.7/build' [ 4%] Generating ../../share/guile/site/3.0/gnucash/report.scm cd /tmp/B.v8o6rdi5/BUILD/gnucash-5.7/build/gnucash/report && /usr/bin/cmake -E create_symlink /tmp/B.v8o6rdi5/BUILD/gnucash-5.7/gnucash/report/report.scm /tmp/B.v8o6rdi5/BUILD/gnucash-5.7/build/share/guile/site/3.0/gnucash/report.scm make[2]: Leaving directory '/tmp/B.v8o6rdi5/BUILD/gnucash-5.7/build' make[1]: Entering directory '/tmp/B.v8o6rdi5/BUILD/gnucash-5.7/build' [ 4%] Built target swig-gnome-c make[1]: Leaving directory '/tmp/B.v8o6rdi5/BUILD/gnucash-5.7/build' make[2]: Entering directory '/tmp/B.v8o6rdi5/BUILD/gnucash-5.7/build' cd /tmp/B.v8o6rdi5/BUILD/gnucash-5.7/build && /usr/bin/cmake -E cmake_depends "Unix Makefiles" /tmp/B.v8o6rdi5/BUILD/gnucash-5.7 /tmp/B.v8o6rdi5/BUILD/gnucash-5.7/gnucash/report /tmp/B.v8o6rdi5/BUILD/gnucash-5.7/build /tmp/B.v8o6rdi5/BUILD/gnucash-5.7/build/gnucash/report /tmp/B.v8o6rdi5/BUILD/gnucash-5.7/build/gnucash/report/CMakeFiles/scm-report-1-links.dir/DependInfo.cmake "--color=" make[2]: Leaving directory '/tmp/B.v8o6rdi5/BUILD/gnucash-5.7/build' make[2]: Entering directory '/tmp/B.v8o6rdi5/BUILD/gnucash-5.7/build' [ 1%] Generating ../share/locale/ar/LC_MESSAGES/gnucash.mo cd /tmp/B.v8o6rdi5/BUILD/gnucash-5.7/build/po && /usr/bin/msgfmt -o /tmp/B.v8o6rdi5/BUILD/gnucash-5.7/build/share/locale/ar/LC_MESSAGES/gnucash.mo /tmp/B.v8o6rdi5/BUILD/gnucash-5.7/po/ar.po make[2]: Leaving directory '/tmp/B.v8o6rdi5/BUILD/gnucash-5.7/build' /usr/bin/make -f gnucash/report/CMakeFiles/scm-report-1-links.dir/build.make gnucash/report/CMakeFiles/scm-report-1-links.dir/build /usr/bin/make -f gnucash/report/reports/CMakeFiles/scm-reports-common-links.dir/build.make gnucash/report/reports/CMakeFiles/scm-reports-common-links.dir/depend make[2]: Entering directory '/tmp/B.v8o6rdi5/BUILD/gnucash-5.7/build' cd /tmp/B.v8o6rdi5/BUILD/gnucash-5.7/build && /usr/bin/cmake -E cmake_depends "Unix Makefiles" /tmp/B.v8o6rdi5/BUILD/gnucash-5.7 /tmp/B.v8o6rdi5/BUILD/gnucash-5.7/gnucash/report/reports /tmp/B.v8o6rdi5/BUILD/gnucash-5.7/build /tmp/B.v8o6rdi5/BUILD/gnucash-5.7/build/gnucash/report/reports /tmp/B.v8o6rdi5/BUILD/gnucash-5.7/build/gnucash/report/reports/CMakeFiles/scm-reports-standard-2-links.dir/DependInfo.cmake "--color=" make[2]: Leaving directory '/tmp/B.v8o6rdi5/BUILD/gnucash-5.7/build' make[2]: Entering directory '/tmp/B.v8o6rdi5/BUILD/gnucash-5.7/build' [ 4%] Generating swig-report.c cd /tmp/B.v8o6rdi5/BUILD/gnucash-5.7/build/gnucash/report && /usr/bin/swig -guile -Linkage module -I/tmp/B.v8o6rdi5/BUILD/gnucash-5.7/common -I/tmp/B.v8o6rdi5/BUILD/gnucash-5.7/libgnucash/engine -o /tmp/B.v8o6rdi5/BUILD/gnucash-5.7/build/gnucash/report/swig-report.c /tmp/B.v8o6rdi5/BUILD/gnucash-5.7/gnucash/report/report.i make[2]: Leaving directory '/tmp/B.v8o6rdi5/BUILD/gnucash-5.7/build' /usr/bin/make -f gnucash/report/reports/CMakeFiles/scm-reports-standard-2-links.dir/build.make gnucash/report/reports/CMakeFiles/scm-reports-standard-2-links.dir/build make[2]: Entering directory '/tmp/B.v8o6rdi5/BUILD/gnucash-5.7/build' [ 1%] Generating swig-unittest-support-python.c, unittest_support.py cd /tmp/B.v8o6rdi5/BUILD/gnucash-5.7/build/common/test-core && /usr/bin/swig -python -Wall -Werror -I/usr/include/glib-2.0 -I/usr/libx32/glib-2.0/include -I/usr/include -I/tmp/B.v8o6rdi5/BUILD/gnucash-5.7/common -I/tmp/B.v8o6rdi5/BUILD/gnucash-5.7/libgnucash/engine -I/tmp/B.v8o6rdi5/BUILD/gnucash-5.7/libgnucash/app-utils -I/tmp/B.v8o6rdi5/BUILD/gnucash-5.7/bindings -I/tmp/B.v8o6rdi5/BUILD/gnucash-5.7/bindings/python -o /tmp/B.v8o6rdi5/BUILD/gnucash-5.7/build/common/test-core/swig-unittest-support-python.c /tmp/B.v8o6rdi5/BUILD/gnucash-5.7/common/test-core/unittest-support.i make[2]: Leaving directory '/tmp/B.v8o6rdi5/BUILD/gnucash-5.7/build' make[1]: Entering directory '/tmp/B.v8o6rdi5/BUILD/gnucash-5.7/build' [ 5%] Built target scm-report-2-links make[1]: Leaving directory '/tmp/B.v8o6rdi5/BUILD/gnucash-5.7/build' /usr/bin/make -f gnucash/report/reports/CMakeFiles/scm-reports-standard-with-exposed-generator-links.dir/build.make gnucash/report/reports/CMakeFiles/scm-reports-standard-with-exposed-generator-links.dir/depend make[1]: Entering directory '/tmp/B.v8o6rdi5/BUILD/gnucash-5.7/build' [ 5%] Built target scm-report-eguile-links make[1]: Leaving directory '/tmp/B.v8o6rdi5/BUILD/gnucash-5.7/build' make[2]: Entering directory '/tmp/B.v8o6rdi5/BUILD/gnucash-5.7/build' cd /tmp/B.v8o6rdi5/BUILD/gnucash-5.7/build && /usr/bin/cmake -E cmake_depends "Unix Makefiles" /tmp/B.v8o6rdi5/BUILD/gnucash-5.7 /tmp/B.v8o6rdi5/BUILD/gnucash-5.7/gnucash/report/reports /tmp/B.v8o6rdi5/BUILD/gnucash-5.7/build /tmp/B.v8o6rdi5/BUILD/gnucash-5.7/build/gnucash/report/reports /tmp/B.v8o6rdi5/BUILD/gnucash-5.7/build/gnucash/report/reports/CMakeFiles/scm-reports-common-links.dir/DependInfo.cmake "--color=" make[2]: Leaving directory '/tmp/B.v8o6rdi5/BUILD/gnucash-5.7/build' /usr/bin/make -f gnucash/report/reports/CMakeFiles/scm-reports-standard-links.dir/build.make gnucash/report/reports/CMakeFiles/scm-reports-standard-links.dir/depend make[2]: Entering directory '/tmp/B.v8o6rdi5/BUILD/gnucash-5.7/build' [ 4%] Generating ../../share/guile/site/3.0/gnucash/eguile/eguile-html-utilities.scm cd /tmp/B.v8o6rdi5/BUILD/gnucash-5.7/build/gnucash/report && /usr/bin/cmake -E create_symlink /tmp/B.v8o6rdi5/BUILD/gnucash-5.7/gnucash/report/eguile-html-utilities.scm /tmp/B.v8o6rdi5/BUILD/gnucash-5.7/build/share/guile/site/3.0/gnucash/eguile/eguile-html-utilities.scm make[2]: Leaving directory '/tmp/B.v8o6rdi5/BUILD/gnucash-5.7/build' /usr/bin/make -f gnucash/report/reports/CMakeFiles/scm-reports-common-links.dir/build.make gnucash/report/reports/CMakeFiles/scm-reports-common-links.dir/build make[2]: Entering directory '/tmp/B.v8o6rdi5/BUILD/gnucash-5.7/build' [ 4%] Generating ../share/locale/az/LC_MESSAGES/gnucash.mo cd /tmp/B.v8o6rdi5/BUILD/gnucash-5.7/build/po && /usr/bin/msgfmt -o /tmp/B.v8o6rdi5/BUILD/gnucash-5.7/build/share/locale/az/LC_MESSAGES/gnucash.mo /tmp/B.v8o6rdi5/BUILD/gnucash-5.7/po/az.po make[2]: Leaving directory '/tmp/B.v8o6rdi5/BUILD/gnucash-5.7/build' /usr/bin/make -f gnucash/report/reports/CMakeFiles/scm-rpt-reports-links.dir/build.make gnucash/report/reports/CMakeFiles/scm-rpt-reports-links.dir/depend make[2]: Entering directory '/tmp/B.v8o6rdi5/BUILD/gnucash-5.7/build' [ 4%] Generating ../share/locale/as/LC_MESSAGES/gnucash.mo cd /tmp/B.v8o6rdi5/BUILD/gnucash-5.7/build/po && /usr/bin/msgfmt -o /tmp/B.v8o6rdi5/BUILD/gnucash-5.7/build/share/locale/as/LC_MESSAGES/gnucash.mo /tmp/B.v8o6rdi5/BUILD/gnucash-5.7/po/as.po make[2]: Leaving directory '/tmp/B.v8o6rdi5/BUILD/gnucash-5.7/build' make[1]: Entering directory '/tmp/B.v8o6rdi5/BUILD/gnucash-5.7/build' [ 5%] Built target swig-report-c make[1]: Leaving directory '/tmp/B.v8o6rdi5/BUILD/gnucash-5.7/build' /usr/bin/make -f gnucash/report/reports/CMakeFiles/scm-reports-example-links.dir/build.make gnucash/report/reports/CMakeFiles/scm-reports-example-links.dir/depend make[2]: Entering directory '/tmp/B.v8o6rdi5/BUILD/gnucash-5.7/build' [ 5%] Generating ../../share/guile/site/3.0/gnucash/report/commodity-utilities.scm cd /tmp/B.v8o6rdi5/BUILD/gnucash-5.7/build/gnucash/report && /usr/bin/cmake -E create_symlink /tmp/B.v8o6rdi5/BUILD/gnucash-5.7/gnucash/report/commodity-utilities.scm /tmp/B.v8o6rdi5/BUILD/gnucash-5.7/build/share/guile/site/3.0/gnucash/report/commodity-utilities.scm make[2]: Leaving directory '/tmp/B.v8o6rdi5/BUILD/gnucash-5.7/build' make[2]: Entering directory '/tmp/B.v8o6rdi5/BUILD/gnucash-5.7/build' [ 5%] Generating ../../share/guile/site/3.0/gnucash/html.scm cd /tmp/B.v8o6rdi5/BUILD/gnucash-5.7/build/gnucash/html && /usr/bin/cmake -E create_symlink /tmp/B.v8o6rdi5/BUILD/gnucash-5.7/gnucash/html/html.scm /tmp/B.v8o6rdi5/BUILD/gnucash-5.7/build/share/guile/site/3.0/gnucash/html.scm make[2]: Leaving directory '/tmp/B.v8o6rdi5/BUILD/gnucash-5.7/build' make[2]: Entering directory '/tmp/B.v8o6rdi5/BUILD/gnucash-5.7/build' cd /tmp/B.v8o6rdi5/BUILD/gnucash-5.7/build && /usr/bin/cmake -E cmake_depends "Unix Makefiles" /tmp/B.v8o6rdi5/BUILD/gnucash-5.7 /tmp/B.v8o6rdi5/BUILD/gnucash-5.7/gnucash/report/reports /tmp/B.v8o6rdi5/BUILD/gnucash-5.7/build /tmp/B.v8o6rdi5/BUILD/gnucash-5.7/build/gnucash/report/reports /tmp/B.v8o6rdi5/BUILD/gnucash-5.7/build/gnucash/report/reports/CMakeFiles/scm-reports-standard-with-exposed-generator-links.dir/DependInfo.cmake "--color=" make[2]: Leaving directory '/tmp/B.v8o6rdi5/BUILD/gnucash-5.7/build' /usr/bin/make -f gnucash/report/reports/CMakeFiles/scm-reports-standard-with-exposed-generator-links.dir/build.make gnucash/report/reports/CMakeFiles/scm-reports-standard-with-exposed-generator-links.dir/build make[1]: Entering directory '/tmp/B.v8o6rdi5/BUILD/gnucash-5.7/build' [ 5%] Built target scm-report-eguile-parts-links make[1]: Leaving directory '/tmp/B.v8o6rdi5/BUILD/gnucash-5.7/build' /usr/bin/make -f gnucash/report/reports/CMakeFiles/scm-reports-us-links.dir/build.make gnucash/report/reports/CMakeFiles/scm-reports-us-links.dir/depend make[2]: Entering directory '/tmp/B.v8o6rdi5/BUILD/gnucash-5.7/build' cd /tmp/B.v8o6rdi5/BUILD/gnucash-5.7/build && /usr/bin/cmake -E cmake_depends "Unix Makefiles" /tmp/B.v8o6rdi5/BUILD/gnucash-5.7 /tmp/B.v8o6rdi5/BUILD/gnucash-5.7/gnucash/report/reports /tmp/B.v8o6rdi5/BUILD/gnucash-5.7/build /tmp/B.v8o6rdi5/BUILD/gnucash-5.7/build/gnucash/report/reports /tmp/B.v8o6rdi5/BUILD/gnucash-5.7/build/gnucash/report/reports/CMakeFiles/scm-reports-standard-links.dir/DependInfo.cmake "--color=" make[2]: Leaving directory '/tmp/B.v8o6rdi5/BUILD/gnucash-5.7/build' /usr/bin/make -f gnucash/report/reports/CMakeFiles/scm-reports-standard-links.dir/build.make gnucash/report/reports/CMakeFiles/scm-reports-standard-links.dir/build make[2]: Entering directory '/tmp/B.v8o6rdi5/BUILD/gnucash-5.7/build' [ 5%] Generating ../../../share/guile/site/3.0/gnucash/reports/standard/customer-summary.scm cd /tmp/B.v8o6rdi5/BUILD/gnucash-5.7/build/gnucash/report/reports && /usr/bin/cmake -E create_symlink /tmp/B.v8o6rdi5/BUILD/gnucash-5.7/gnucash/report/reports/standard/customer-summary.scm /tmp/B.v8o6rdi5/BUILD/gnucash-5.7/build/share/guile/site/3.0/gnucash/reports/standard/customer-summary.scm make[2]: Leaving directory '/tmp/B.v8o6rdi5/BUILD/gnucash-5.7/build' make[1]: Entering directory '/tmp/B.v8o6rdi5/BUILD/gnucash-5.7/build' [ 5%] Built target swig-unittest-support-python make[1]: Leaving directory '/tmp/B.v8o6rdi5/BUILD/gnucash-5.7/build' make[2]: Entering directory '/tmp/B.v8o6rdi5/BUILD/gnucash-5.7/build' cd /tmp/B.v8o6rdi5/BUILD/gnucash-5.7/build && /usr/bin/cmake -E cmake_depends "Unix Makefiles" /tmp/B.v8o6rdi5/BUILD/gnucash-5.7 /tmp/B.v8o6rdi5/BUILD/gnucash-5.7/gnucash/report/reports /tmp/B.v8o6rdi5/BUILD/gnucash-5.7/build /tmp/B.v8o6rdi5/BUILD/gnucash-5.7/build/gnucash/report/reports /tmp/B.v8o6rdi5/BUILD/gnucash-5.7/build/gnucash/report/reports/CMakeFiles/scm-rpt-reports-links.dir/DependInfo.cmake "--color=" make[2]: Leaving directory '/tmp/B.v8o6rdi5/BUILD/gnucash-5.7/build' make[2]: Entering directory '/tmp/B.v8o6rdi5/BUILD/gnucash-5.7/build' cd /tmp/B.v8o6rdi5/BUILD/gnucash-5.7/build && /usr/bin/cmake -E cmake_depends "Unix Makefiles" /tmp/B.v8o6rdi5/BUILD/gnucash-5.7 /tmp/B.v8o6rdi5/BUILD/gnucash-5.7/gnucash/report/reports /tmp/B.v8o6rdi5/BUILD/gnucash-5.7/build /tmp/B.v8o6rdi5/BUILD/gnucash-5.7/build/gnucash/report/reports /tmp/B.v8o6rdi5/BUILD/gnucash-5.7/build/gnucash/report/reports/CMakeFiles/scm-reports-example-links.dir/DependInfo.cmake "--color=" make[2]: Leaving directory '/tmp/B.v8o6rdi5/BUILD/gnucash-5.7/build' /usr/bin/make -f gnucash/report/reports/CMakeFiles/scm-rpt-reports-links.dir/build.make gnucash/report/reports/CMakeFiles/scm-rpt-reports-links.dir/build /usr/bin/make -f gnucash/report/reports/CMakeFiles/scm-reports-example-links.dir/build.make gnucash/report/reports/CMakeFiles/scm-reports-example-links.dir/build make[1]: Entering directory '/tmp/B.v8o6rdi5/BUILD/gnucash-5.7/build' [ 5%] Built target scm-gnc-html-links make[1]: Leaving directory '/tmp/B.v8o6rdi5/BUILD/gnucash-5.7/build' make[2]: Entering directory '/tmp/B.v8o6rdi5/BUILD/gnucash-5.7/build' [ 5%] Generating ../../../share/guile/site/3.0/gnucash/reports/cash-flow-calc.scm cd /tmp/B.v8o6rdi5/BUILD/gnucash-5.7/build/gnucash/report/reports && /usr/bin/cmake -E create_symlink /tmp/B.v8o6rdi5/BUILD/gnucash-5.7/gnucash/report/reports/cash-flow-calc.scm /tmp/B.v8o6rdi5/BUILD/gnucash-5.7/build/share/guile/site/3.0/gnucash/reports/cash-flow-calc.scm make[2]: Leaving directory '/tmp/B.v8o6rdi5/BUILD/gnucash-5.7/build' make[2]: Entering directory '/tmp/B.v8o6rdi5/BUILD/gnucash-5.7/build' [ 4%] Generating ../share/locale/cs/LC_MESSAGES/gnucash.mo cd /tmp/B.v8o6rdi5/BUILD/gnucash-5.7/build/po && /usr/bin/msgfmt -o /tmp/B.v8o6rdi5/BUILD/gnucash-5.7/build/share/locale/cs/LC_MESSAGES/gnucash.mo /tmp/B.v8o6rdi5/BUILD/gnucash-5.7/po/cs.po make[2]: Leaving directory '/tmp/B.v8o6rdi5/BUILD/gnucash-5.7/build' make[2]: Entering directory '/tmp/B.v8o6rdi5/BUILD/gnucash-5.7/build' [ 4%] Generating ../share/locale/bg/LC_MESSAGES/gnucash.mo cd /tmp/B.v8o6rdi5/BUILD/gnucash-5.7/build/po && /usr/bin/msgfmt -o /tmp/B.v8o6rdi5/BUILD/gnucash-5.7/build/share/locale/bg/LC_MESSAGES/gnucash.mo /tmp/B.v8o6rdi5/BUILD/gnucash-5.7/po/bg.po make[2]: Leaving directory '/tmp/B.v8o6rdi5/BUILD/gnucash-5.7/build' /usr/bin/make -f gnucash/report/reports/CMakeFiles/scm-reports-de_DE-links.dir/build.make gnucash/report/reports/CMakeFiles/scm-reports-de_DE-links.dir/depend make[2]: Entering directory '/tmp/B.v8o6rdi5/BUILD/gnucash-5.7/build' cd /tmp/B.v8o6rdi5/BUILD/gnucash-5.7/build && /usr/bin/cmake -E cmake_depends "Unix Makefiles" /tmp/B.v8o6rdi5/BUILD/gnucash-5.7 /tmp/B.v8o6rdi5/BUILD/gnucash-5.7/gnucash/report/reports /tmp/B.v8o6rdi5/BUILD/gnucash-5.7/build /tmp/B.v8o6rdi5/BUILD/gnucash-5.7/build/gnucash/report/reports /tmp/B.v8o6rdi5/BUILD/gnucash-5.7/build/gnucash/report/reports/CMakeFiles/scm-reports-us-links.dir/DependInfo.cmake "--color=" make[2]: Leaving directory '/tmp/B.v8o6rdi5/BUILD/gnucash-5.7/build' make[1]: Entering directory '/tmp/B.v8o6rdi5/BUILD/gnucash-5.7/build' [ 6%] Built target scm-reports-standard-2-links make[1]: Leaving directory '/tmp/B.v8o6rdi5/BUILD/gnucash-5.7/build' /usr/bin/make -f gnucash/report/reports/CMakeFiles/scm-reports-us-links.dir/build.make gnucash/report/reports/CMakeFiles/scm-reports-us-links.dir/build make[2]: Entering directory '/tmp/B.v8o6rdi5/BUILD/gnucash-5.7/build' [ 5%] Generating ../../share/guile/site/3.0/gnucash/report/html-acct-table.scm cd /tmp/B.v8o6rdi5/BUILD/gnucash-5.7/build/gnucash/report && /usr/bin/cmake -E create_symlink /tmp/B.v8o6rdi5/BUILD/gnucash-5.7/gnucash/report/html-acct-table.scm /tmp/B.v8o6rdi5/BUILD/gnucash-5.7/build/share/guile/site/3.0/gnucash/report/html-acct-table.scm make[2]: Leaving directory '/tmp/B.v8o6rdi5/BUILD/gnucash-5.7/build' make[1]: Entering directory '/tmp/B.v8o6rdi5/BUILD/gnucash-5.7/build' [ 6%] Built target scm-reports-common-links make[1]: Leaving directory '/tmp/B.v8o6rdi5/BUILD/gnucash-5.7/build' make[2]: Entering directory '/tmp/B.v8o6rdi5/BUILD/gnucash-5.7/build' [ 6%] Generating ../../../share/guile/site/3.0/gnucash/reports/standard/account-piecharts.scm cd /tmp/B.v8o6rdi5/BUILD/gnucash-5.7/build/gnucash/report/reports && /usr/bin/cmake -E create_symlink /tmp/B.v8o6rdi5/BUILD/gnucash-5.7/gnucash/report/reports/standard/account-piecharts.scm /tmp/B.v8o6rdi5/BUILD/gnucash-5.7/build/share/guile/site/3.0/gnucash/reports/standard/account-piecharts.scm make[2]: Leaving directory '/tmp/B.v8o6rdi5/BUILD/gnucash-5.7/build' make[2]: Entering directory '/tmp/B.v8o6rdi5/BUILD/gnucash-5.7/build' [ 6%] Generating ../../../share/guile/site/3.0/gnucash/reports/standard/new-aging.scm cd /tmp/B.v8o6rdi5/BUILD/gnucash-5.7/build/gnucash/report/reports && /usr/bin/cmake -E create_symlink /tmp/B.v8o6rdi5/BUILD/gnucash-5.7/gnucash/report/reports/standard/new-aging.scm /tmp/B.v8o6rdi5/BUILD/gnucash-5.7/build/share/guile/site/3.0/gnucash/reports/standard/new-aging.scm make[2]: Leaving directory '/tmp/B.v8o6rdi5/BUILD/gnucash-5.7/build' make[2]: Entering directory '/tmp/B.v8o6rdi5/BUILD/gnucash-5.7/build' [ 4%] Generating ../share/locale/da/LC_MESSAGES/gnucash.mo cd /tmp/B.v8o6rdi5/BUILD/gnucash-5.7/build/po && /usr/bin/msgfmt -o /tmp/B.v8o6rdi5/BUILD/gnucash-5.7/build/share/locale/da/LC_MESSAGES/gnucash.mo /tmp/B.v8o6rdi5/BUILD/gnucash-5.7/po/da.po make[2]: Leaving directory '/tmp/B.v8o6rdi5/BUILD/gnucash-5.7/build' make[2]: Entering directory '/tmp/B.v8o6rdi5/BUILD/gnucash-5.7/build' [ 6%] Generating ../../../share/guile/site/3.0/gnucash/reports/standard/account-summary.scm cd /tmp/B.v8o6rdi5/BUILD/gnucash-5.7/build/gnucash/report/reports && /usr/bin/cmake -E create_symlink /tmp/B.v8o6rdi5/BUILD/gnucash-5.7/gnucash/report/reports/standard/account-summary.scm /tmp/B.v8o6rdi5/BUILD/gnucash-5.7/build/share/guile/site/3.0/gnucash/reports/standard/account-summary.scm make[2]: Leaving directory '/tmp/B.v8o6rdi5/BUILD/gnucash-5.7/build' make[2]: Entering directory '/tmp/B.v8o6rdi5/BUILD/gnucash-5.7/build' [ 4%] Generating ../share/locale/de/LC_MESSAGES/gnucash.mo cd /tmp/B.v8o6rdi5/BUILD/gnucash-5.7/build/po && /usr/bin/msgfmt -o /tmp/B.v8o6rdi5/BUILD/gnucash-5.7/build/share/locale/de/LC_MESSAGES/gnucash.mo /tmp/B.v8o6rdi5/BUILD/gnucash-5.7/po/de.po make[2]: Leaving directory '/tmp/B.v8o6rdi5/BUILD/gnucash-5.7/build' make[2]: Entering directory '/tmp/B.v8o6rdi5/BUILD/gnucash-5.7/build' [ 4%] Generating ../share/locale/ca/LC_MESSAGES/gnucash.mo cd /tmp/B.v8o6rdi5/BUILD/gnucash-5.7/build/po && /usr/bin/msgfmt -o /tmp/B.v8o6rdi5/BUILD/gnucash-5.7/build/share/locale/ca/LC_MESSAGES/gnucash.mo /tmp/B.v8o6rdi5/BUILD/gnucash-5.7/po/ca.po make[2]: Leaving directory '/tmp/B.v8o6rdi5/BUILD/gnucash-5.7/build' make[2]: Entering directory '/tmp/B.v8o6rdi5/BUILD/gnucash-5.7/build' [ 6%] Generating ../../../share/guile/site/3.0/gnucash/reports/example/average-balance.scm cd /tmp/B.v8o6rdi5/BUILD/gnucash-5.7/build/gnucash/report/reports && /usr/bin/cmake -E create_symlink /tmp/B.v8o6rdi5/BUILD/gnucash-5.7/gnucash/report/reports/example/average-balance.scm /tmp/B.v8o6rdi5/BUILD/gnucash-5.7/build/share/guile/site/3.0/gnucash/reports/example/average-balance.scm make[2]: Leaving directory '/tmp/B.v8o6rdi5/BUILD/gnucash-5.7/build' make[2]: Entering directory '/tmp/B.v8o6rdi5/BUILD/gnucash-5.7/build' [ 6%] Generating ../../../share/guile/site/3.0/gnucash/reports.scm cd /tmp/B.v8o6rdi5/BUILD/gnucash-5.7/build/gnucash/report/reports && /usr/bin/cmake -E create_symlink /tmp/B.v8o6rdi5/BUILD/gnucash-5.7/gnucash/report/reports/reports.scm /tmp/B.v8o6rdi5/BUILD/gnucash-5.7/build/share/guile/site/3.0/gnucash/reports.scm make[2]: Leaving directory '/tmp/B.v8o6rdi5/BUILD/gnucash-5.7/build' make[2]: Entering directory '/tmp/B.v8o6rdi5/BUILD/gnucash-5.7/build' cd /tmp/B.v8o6rdi5/BUILD/gnucash-5.7/build && /usr/bin/cmake -E cmake_depends "Unix Makefiles" /tmp/B.v8o6rdi5/BUILD/gnucash-5.7 /tmp/B.v8o6rdi5/BUILD/gnucash-5.7/gnucash/report/reports /tmp/B.v8o6rdi5/BUILD/gnucash-5.7/build /tmp/B.v8o6rdi5/BUILD/gnucash-5.7/build/gnucash/report/reports /tmp/B.v8o6rdi5/BUILD/gnucash-5.7/build/gnucash/report/reports/CMakeFiles/scm-reports-de_DE-links.dir/DependInfo.cmake "--color=" make[2]: Leaving directory '/tmp/B.v8o6rdi5/BUILD/gnucash-5.7/build' make[2]: Entering directory '/tmp/B.v8o6rdi5/BUILD/gnucash-5.7/build' [ 4%] Generating ../share/locale/brx/LC_MESSAGES/gnucash.mo cd /tmp/B.v8o6rdi5/BUILD/gnucash-5.7/build/po && /usr/bin/msgfmt -o /tmp/B.v8o6rdi5/BUILD/gnucash-5.7/build/share/locale/brx/LC_MESSAGES/gnucash.mo /tmp/B.v8o6rdi5/BUILD/gnucash-5.7/po/brx.po make[2]: Leaving directory '/tmp/B.v8o6rdi5/BUILD/gnucash-5.7/build' make[2]: Entering directory '/tmp/B.v8o6rdi5/BUILD/gnucash-5.7/build' [ 6%] Generating ../../../share/guile/site/3.0/gnucash/reports/standard/advanced-portfolio.scm cd /tmp/B.v8o6rdi5/BUILD/gnucash-5.7/build/gnucash/report/reports && /usr/bin/cmake -E create_symlink /tmp/B.v8o6rdi5/BUILD/gnucash-5.7/gnucash/report/reports/standard/advanced-portfolio.scm /tmp/B.v8o6rdi5/BUILD/gnucash-5.7/build/share/guile/site/3.0/gnucash/reports/standard/advanced-portfolio.scm make[2]: Leaving directory '/tmp/B.v8o6rdi5/BUILD/gnucash-5.7/build' /usr/bin/make -f gnucash/report/reports/CMakeFiles/scm-reports-de_DE-links.dir/build.make gnucash/report/reports/CMakeFiles/scm-reports-de_DE-links.dir/build make[2]: Entering directory '/tmp/B.v8o6rdi5/BUILD/gnucash-5.7/build' [ 6%] Generating ../../share/guile/site/3.0/gnucash/report/html-chart.scm cd /tmp/B.v8o6rdi5/BUILD/gnucash-5.7/build/gnucash/report && /usr/bin/cmake -E create_symlink /tmp/B.v8o6rdi5/BUILD/gnucash-5.7/gnucash/report/html-chart.scm /tmp/B.v8o6rdi5/BUILD/gnucash-5.7/build/share/guile/site/3.0/gnucash/report/html-chart.scm make[2]: Leaving directory '/tmp/B.v8o6rdi5/BUILD/gnucash-5.7/build' make[2]: Entering directory '/tmp/B.v8o6rdi5/BUILD/gnucash-5.7/build' [ 4%] Generating ../share/locale/el/LC_MESSAGES/gnucash.mo cd /tmp/B.v8o6rdi5/BUILD/gnucash-5.7/build/po && /usr/bin/msgfmt -o /tmp/B.v8o6rdi5/BUILD/gnucash-5.7/build/share/locale/el/LC_MESSAGES/gnucash.mo /tmp/B.v8o6rdi5/BUILD/gnucash-5.7/po/el.po make[2]: Leaving directory '/tmp/B.v8o6rdi5/BUILD/gnucash-5.7/build' make[1]: Entering directory '/tmp/B.v8o6rdi5/BUILD/gnucash-5.7/build' [ 8%] Built target scm-rpt-reports-links make[1]: Leaving directory '/tmp/B.v8o6rdi5/BUILD/gnucash-5.7/build' /usr/bin/make -f gnucash/import-export/qif-imp/CMakeFiles/scm-qif-import-0-links.dir/build.make gnucash/import-export/qif-imp/CMakeFiles/scm-qif-import-0-links.dir/depend make[2]: Entering directory '/tmp/B.v8o6rdi5/BUILD/gnucash-5.7/build' [ 6%] Generating ../../../share/guile/site/3.0/gnucash/reports/standard/balance-sheet.scm cd /tmp/B.v8o6rdi5/BUILD/gnucash-5.7/build/gnucash/report/reports && /usr/bin/cmake -E create_symlink /tmp/B.v8o6rdi5/BUILD/gnucash-5.7/gnucash/report/reports/standard/balance-sheet.scm /tmp/B.v8o6rdi5/BUILD/gnucash-5.7/build/share/guile/site/3.0/gnucash/reports/standard/balance-sheet.scm make[2]: Leaving directory '/tmp/B.v8o6rdi5/BUILD/gnucash-5.7/build' make[2]: Entering directory '/tmp/B.v8o6rdi5/BUILD/gnucash-5.7/build' [ 4%] Generating ../share/locale/en_AU/LC_MESSAGES/gnucash.mo cd /tmp/B.v8o6rdi5/BUILD/gnucash-5.7/build/po && /usr/bin/msgfmt -o /tmp/B.v8o6rdi5/BUILD/gnucash-5.7/build/share/locale/en_AU/LC_MESSAGES/gnucash.mo /tmp/B.v8o6rdi5/BUILD/gnucash-5.7/po/en_AU.po make[2]: Leaving directory '/tmp/B.v8o6rdi5/BUILD/gnucash-5.7/build' /usr/bin/make -f gnucash/import-export/qif-imp/CMakeFiles/scm-qif-import-2-links.dir/build.make gnucash/import-export/qif-imp/CMakeFiles/scm-qif-import-2-links.dir/depend make[2]: Entering directory '/tmp/B.v8o6rdi5/BUILD/gnucash-5.7/build' [ 6%] Generating ../../share/guile/site/3.0/gnucash/report/html-document.scm cd /tmp/B.v8o6rdi5/BUILD/gnucash-5.7/build/gnucash/report && /usr/bin/cmake -E create_symlink /tmp/B.v8o6rdi5/BUILD/gnucash-5.7/gnucash/report/html-document.scm /tmp/B.v8o6rdi5/BUILD/gnucash-5.7/build/share/guile/site/3.0/gnucash/report/html-document.scm make[2]: Leaving directory '/tmp/B.v8o6rdi5/BUILD/gnucash-5.7/build' make[2]: Entering directory '/tmp/B.v8o6rdi5/BUILD/gnucash-5.7/build' [ 6%] Generating ../../../share/guile/site/3.0/gnucash/reports/standard/register.scm cd /tmp/B.v8o6rdi5/BUILD/gnucash-5.7/build/gnucash/report/reports && /usr/bin/cmake -E create_symlink /tmp/B.v8o6rdi5/BUILD/gnucash-5.7/gnucash/report/reports/standard/register.scm /tmp/B.v8o6rdi5/BUILD/gnucash-5.7/build/share/guile/site/3.0/gnucash/reports/standard/register.scm make[2]: Leaving directory '/tmp/B.v8o6rdi5/BUILD/gnucash-5.7/build' make[2]: Entering directory '/tmp/B.v8o6rdi5/BUILD/gnucash-5.7/build' [ 6%] Generating ../../../share/guile/site/3.0/gnucash/reports/locale-specific/us/taxtxf.scm cd /tmp/B.v8o6rdi5/BUILD/gnucash-5.7/build/gnucash/report/reports && /usr/bin/cmake -E create_symlink /tmp/B.v8o6rdi5/BUILD/gnucash-5.7/gnucash/report/reports/locale-specific/us/taxtxf.scm /tmp/B.v8o6rdi5/BUILD/gnucash-5.7/build/share/guile/site/3.0/gnucash/reports/locale-specific/us/taxtxf.scm make[2]: Leaving directory '/tmp/B.v8o6rdi5/BUILD/gnucash-5.7/build' make[2]: Entering directory '/tmp/B.v8o6rdi5/BUILD/gnucash-5.7/build' [ 8%] Generating ../../../share/guile/site/3.0/gnucash/reports/standard/balance-forecast.scm cd /tmp/B.v8o6rdi5/BUILD/gnucash-5.7/build/gnucash/report/reports && /usr/bin/cmake -E create_symlink /tmp/B.v8o6rdi5/BUILD/gnucash-5.7/gnucash/report/reports/standard/balance-forecast.scm /tmp/B.v8o6rdi5/BUILD/gnucash-5.7/build/share/guile/site/3.0/gnucash/reports/standard/balance-forecast.scm make[2]: Leaving directory '/tmp/B.v8o6rdi5/BUILD/gnucash-5.7/build' make[2]: Entering directory '/tmp/B.v8o6rdi5/BUILD/gnucash-5.7/build' [ 8%] Generating ../../../share/guile/site/3.0/gnucash/reports/standard/new-owner-report.scm cd /tmp/B.v8o6rdi5/BUILD/gnucash-5.7/build/gnucash/report/reports && /usr/bin/cmake -E create_symlink /tmp/B.v8o6rdi5/BUILD/gnucash-5.7/gnucash/report/reports/standard/new-owner-report.scm /tmp/B.v8o6rdi5/BUILD/gnucash-5.7/build/share/guile/site/3.0/gnucash/reports/standard/new-owner-report.scm make[2]: Leaving directory '/tmp/B.v8o6rdi5/BUILD/gnucash-5.7/build' make[2]: Entering directory '/tmp/B.v8o6rdi5/BUILD/gnucash-5.7/build' [ 4%] Generating ../share/locale/doi/LC_MESSAGES/gnucash.mo cd /tmp/B.v8o6rdi5/BUILD/gnucash-5.7/build/po && /usr/bin/msgfmt -o /tmp/B.v8o6rdi5/BUILD/gnucash-5.7/build/share/locale/doi/LC_MESSAGES/gnucash.mo /tmp/B.v8o6rdi5/BUILD/gnucash-5.7/po/doi.po make[2]: Leaving directory '/tmp/B.v8o6rdi5/BUILD/gnucash-5.7/build' make[2]: Entering directory '/tmp/B.v8o6rdi5/BUILD/gnucash-5.7/build' [ 8%] Generating ../../../share/guile/site/3.0/gnucash/reports/locale-specific/de_DE/taxtxf.scm cd /tmp/B.v8o6rdi5/BUILD/gnucash-5.7/build/gnucash/report/reports && /usr/bin/cmake -E create_symlink /tmp/B.v8o6rdi5/BUILD/gnucash-5.7/gnucash/report/reports/locale-specific/de_DE/taxtxf.scm /tmp/B.v8o6rdi5/BUILD/gnucash-5.7/build/share/guile/site/3.0/gnucash/reports/locale-specific/de_DE/taxtxf.scm make[2]: Leaving directory '/tmp/B.v8o6rdi5/BUILD/gnucash-5.7/build' make[2]: Entering directory '/tmp/B.v8o6rdi5/BUILD/gnucash-5.7/build' cd /tmp/B.v8o6rdi5/BUILD/gnucash-5.7/build && /usr/bin/cmake -E cmake_depends "Unix Makefiles" /tmp/B.v8o6rdi5/BUILD/gnucash-5.7 /tmp/B.v8o6rdi5/BUILD/gnucash-5.7/gnucash/import-export/qif-imp /tmp/B.v8o6rdi5/BUILD/gnucash-5.7/build /tmp/B.v8o6rdi5/BUILD/gnucash-5.7/build/gnucash/import-export/qif-imp /tmp/B.v8o6rdi5/BUILD/gnucash-5.7/build/gnucash/import-export/qif-imp/CMakeFiles/scm-qif-import-0-links.dir/DependInfo.cmake "--color=" make[2]: Leaving directory '/tmp/B.v8o6rdi5/BUILD/gnucash-5.7/build' make[2]: Entering directory '/tmp/B.v8o6rdi5/BUILD/gnucash-5.7/build' [ 8%] Generating ../../../share/guile/site/3.0/gnucash/reports/standard/balsheet-pnl.scm cd /tmp/B.v8o6rdi5/BUILD/gnucash-5.7/build/gnucash/report/reports && /usr/bin/cmake -E create_symlink /tmp/B.v8o6rdi5/BUILD/gnucash-5.7/gnucash/report/reports/standard/balsheet-pnl.scm /tmp/B.v8o6rdi5/BUILD/gnucash-5.7/build/share/guile/site/3.0/gnucash/reports/standard/balsheet-pnl.scm make[2]: Leaving directory '/tmp/B.v8o6rdi5/BUILD/gnucash-5.7/build' make[1]: Entering directory '/tmp/B.v8o6rdi5/BUILD/gnucash-5.7/build' [ 8%] Built target scm-reports-us-links make[1]: Leaving directory '/tmp/B.v8o6rdi5/BUILD/gnucash-5.7/build' make[2]: Entering directory '/tmp/B.v8o6rdi5/BUILD/gnucash-5.7/build' [ 8%] Generating ../../../share/guile/site/3.0/gnucash/reports/example/daily-reports.scm cd /tmp/B.v8o6rdi5/BUILD/gnucash-5.7/build/gnucash/report/reports && /usr/bin/cmake -E create_symlink /tmp/B.v8o6rdi5/BUILD/gnucash-5.7/gnucash/report/reports/example/daily-reports.scm /tmp/B.v8o6rdi5/BUILD/gnucash-5.7/build/share/guile/site/3.0/gnucash/reports/example/daily-reports.scm make[2]: Leaving directory '/tmp/B.v8o6rdi5/BUILD/gnucash-5.7/build' /usr/bin/make -f gnucash/import-export/qif-imp/CMakeFiles/scm-qif-import-0-links.dir/build.make gnucash/import-export/qif-imp/CMakeFiles/scm-qif-import-0-links.dir/build make[2]: Entering directory '/tmp/B.v8o6rdi5/BUILD/gnucash-5.7/build' cd /tmp/B.v8o6rdi5/BUILD/gnucash-5.7/build && /usr/bin/cmake -E cmake_depends "Unix Makefiles" /tmp/B.v8o6rdi5/BUILD/gnucash-5.7 /tmp/B.v8o6rdi5/BUILD/gnucash-5.7/gnucash/import-export/qif-imp /tmp/B.v8o6rdi5/BUILD/gnucash-5.7/build /tmp/B.v8o6rdi5/BUILD/gnucash-5.7/build/gnucash/import-export/qif-imp /tmp/B.v8o6rdi5/BUILD/gnucash-5.7/build/gnucash/import-export/qif-imp/CMakeFiles/scm-qif-import-2-links.dir/DependInfo.cmake "--color=" make[2]: Leaving directory '/tmp/B.v8o6rdi5/BUILD/gnucash-5.7/build' /usr/bin/make -f gnucash/import-export/qif-imp/CMakeFiles/scm-qif-import-2-links.dir/build.make gnucash/import-export/qif-imp/CMakeFiles/scm-qif-import-2-links.dir/build make[2]: Entering directory '/tmp/B.v8o6rdi5/BUILD/gnucash-5.7/build' [ 5%] Generating ../share/locale/en_NZ/LC_MESSAGES/gnucash.mo cd /tmp/B.v8o6rdi5/BUILD/gnucash-5.7/build/po && /usr/bin/msgfmt -o /tmp/B.v8o6rdi5/BUILD/gnucash-5.7/build/share/locale/en_NZ/LC_MESSAGES/gnucash.mo /tmp/B.v8o6rdi5/BUILD/gnucash-5.7/po/en_NZ.po make[2]: Leaving directory '/tmp/B.v8o6rdi5/BUILD/gnucash-5.7/build' make[1]: Entering directory '/tmp/B.v8o6rdi5/BUILD/gnucash-5.7/build' [ 8%] Built target scm-reports-standard-with-exposed-generator-links make[1]: Leaving directory '/tmp/B.v8o6rdi5/BUILD/gnucash-5.7/build' make[2]: Entering directory '/tmp/B.v8o6rdi5/BUILD/gnucash-5.7/build' [ 8%] Generating ../../../share/guile/site/3.0/gnucash/reports/standard/budget-balance-sheet.scm cd /tmp/B.v8o6rdi5/BUILD/gnucash-5.7/build/gnucash/report/reports && /usr/bin/cmake -E create_symlink /tmp/B.v8o6rdi5/BUILD/gnucash-5.7/gnucash/report/reports/standard/budget-balance-sheet.scm /tmp/B.v8o6rdi5/BUILD/gnucash-5.7/build/share/guile/site/3.0/gnucash/reports/standard/budget-balance-sheet.scm make[2]: Leaving directory '/tmp/B.v8o6rdi5/BUILD/gnucash-5.7/build' make[2]: Entering directory '/tmp/B.v8o6rdi5/BUILD/gnucash-5.7/build' [ 8%] Generating ../../share/guile/site/3.0/gnucash/report/html-fonts.scm cd /tmp/B.v8o6rdi5/BUILD/gnucash-5.7/build/gnucash/report && /usr/bin/cmake -E create_symlink /tmp/B.v8o6rdi5/BUILD/gnucash-5.7/gnucash/report/html-fonts.scm /tmp/B.v8o6rdi5/BUILD/gnucash-5.7/build/share/guile/site/3.0/gnucash/report/html-fonts.scm make[2]: Leaving directory '/tmp/B.v8o6rdi5/BUILD/gnucash-5.7/build' make[1]: Entering directory '/tmp/B.v8o6rdi5/BUILD/gnucash-5.7/build' [ 9%] Built target scm-reports-de_DE-links make[1]: Leaving directory '/tmp/B.v8o6rdi5/BUILD/gnucash-5.7/build' make[2]: Entering directory '/tmp/B.v8o6rdi5/BUILD/gnucash-5.7/build' /usr/bin/make -f gnucash/import-export/qif-imp/CMakeFiles/scm-qif-import-links.dir/build.make gnucash/import-export/qif-imp/CMakeFiles/scm-qif-import-links.dir/depend [ 8%] Generating ../../share/guile/site/3.0/gnucash/report/html-style-info.scm cd /tmp/B.v8o6rdi5/BUILD/gnucash-5.7/build/gnucash/report && /usr/bin/cmake -E create_symlink /tmp/B.v8o6rdi5/BUILD/gnucash-5.7/gnucash/report/html-style-info.scm /tmp/B.v8o6rdi5/BUILD/gnucash-5.7/build/share/guile/site/3.0/gnucash/report/html-style-info.scm make[2]: Leaving directory '/tmp/B.v8o6rdi5/BUILD/gnucash-5.7/build' make[2]: Entering directory '/tmp/B.v8o6rdi5/BUILD/gnucash-5.7/build' [ 8%] Generating ../../../share/guile/site/3.0/gnucash/reports/standard/budget-barchart.scm cd /tmp/B.v8o6rdi5/BUILD/gnucash-5.7/build/gnucash/report/reports && /usr/bin/cmake -E create_symlink /tmp/B.v8o6rdi5/BUILD/gnucash-5.7/gnucash/report/reports/standard/budget-barchart.scm /tmp/B.v8o6rdi5/BUILD/gnucash-5.7/build/share/guile/site/3.0/gnucash/reports/standard/budget-barchart.scm make[2]: Leaving directory '/tmp/B.v8o6rdi5/BUILD/gnucash-5.7/build' make[2]: Entering directory '/tmp/B.v8o6rdi5/BUILD/gnucash-5.7/build' [ 5%] Generating ../share/locale/en_GB/LC_MESSAGES/gnucash.mo cd /tmp/B.v8o6rdi5/BUILD/gnucash-5.7/build/po && /usr/bin/msgfmt -o /tmp/B.v8o6rdi5/BUILD/gnucash-5.7/build/share/locale/en_GB/LC_MESSAGES/gnucash.mo /tmp/B.v8o6rdi5/BUILD/gnucash-5.7/po/en_GB.po make[2]: Leaving directory '/tmp/B.v8o6rdi5/BUILD/gnucash-5.7/build' /usr/bin/make -f gnucash/report/stylesheets/CMakeFiles/scm-report-stylesheets-1-links.dir/build.make gnucash/report/stylesheets/CMakeFiles/scm-report-stylesheets-1-links.dir/depend make[2]: Entering directory '/tmp/B.v8o6rdi5/BUILD/gnucash-5.7/build' [ 8%] Generating ../../../share/guile/site/3.0/gnucash/reports/example/sample-report.scm cd /tmp/B.v8o6rdi5/BUILD/gnucash-5.7/build/gnucash/report/reports && /usr/bin/cmake -E create_symlink /tmp/B.v8o6rdi5/BUILD/gnucash-5.7/gnucash/report/reports/example/sample-report.scm /tmp/B.v8o6rdi5/BUILD/gnucash-5.7/build/share/guile/site/3.0/gnucash/reports/example/sample-report.scm make[2]: Leaving directory '/tmp/B.v8o6rdi5/BUILD/gnucash-5.7/build' make[2]: Entering directory '/tmp/B.v8o6rdi5/BUILD/gnucash-5.7/build' [ 2%] Building C object libgnucash/gnc-module/CMakeFiles/gnc-module.dir/gnc-module.c.o cd /tmp/B.v8o6rdi5/BUILD/gnucash-5.7/build/libgnucash/gnc-module && /usr/bin/x86_64-pld-linux-gnux32-gcc -DGLIB_VERSION_MAX_ALLOWED=GLIB_VERSION_2_56 -DGLIB_VERSION_MIN_REQUIRED=GLIB_VERSION_2_56 -DG_LOG_DOMAIN=\"gnc.module\" -DHAVE_CONFIG_H -DHAVE_GUILE30 -D_GNU_SOURCE -Dgnc_module_EXPORTS -I/tmp/B.v8o6rdi5/BUILD/gnucash-5.7/libgnucash/gnc-module -I/tmp/B.v8o6rdi5/BUILD/gnucash-5.7/common -I/tmp/B.v8o6rdi5/BUILD/gnucash-5.7/build/common -isystem /usr/include/glib-2.0 -isystem /usr/libx32/glib-2.0/include -Werror -Wall -Wmissing-prototypes -Wmissing-declarations -O2 -fwrapv -pipe -Wformat -Werror=format-security -gdwarf-4 -fno-debug-types-section -fvar-tracking-assignments -g2 -Wp,-D_FORTIFY_SOURCE=2 -fstack-protector-strong --param=ssp-buffer-size=4 -Werror=trampolines -fPIC -mtune=generic -march=x86-64 -gdwarf-4 -fno-debug-types-section -fvar-tracking-assignments -g2 -DNDEBUG -DQT_NO_DEBUG -std=gnu11 -fPIC -MD -MT libgnucash/gnc-module/CMakeFiles/gnc-module.dir/gnc-module.c.o -MF CMakeFiles/gnc-module.dir/gnc-module.c.o.d -o CMakeFiles/gnc-module.dir/gnc-module.c.o -c /tmp/B.v8o6rdi5/BUILD/gnucash-5.7/libgnucash/gnc-module/gnc-module.c make[2]: Leaving directory '/tmp/B.v8o6rdi5/BUILD/gnucash-5.7/build' make[2]: Entering directory '/tmp/B.v8o6rdi5/BUILD/gnucash-5.7/build' cd /tmp/B.v8o6rdi5/BUILD/gnucash-5.7/build && /usr/bin/cmake -E cmake_depends "Unix Makefiles" /tmp/B.v8o6rdi5/BUILD/gnucash-5.7 /tmp/B.v8o6rdi5/BUILD/gnucash-5.7/gnucash/import-export/qif-imp /tmp/B.v8o6rdi5/BUILD/gnucash-5.7/build /tmp/B.v8o6rdi5/BUILD/gnucash-5.7/build/gnucash/import-export/qif-imp /tmp/B.v8o6rdi5/BUILD/gnucash-5.7/build/gnucash/import-export/qif-imp/CMakeFiles/scm-qif-import-links.dir/DependInfo.cmake "--color=" make[2]: Leaving directory '/tmp/B.v8o6rdi5/BUILD/gnucash-5.7/build' /usr/bin/make -f gnucash/import-export/qif-imp/CMakeFiles/scm-qif-import-links.dir/build.make gnucash/import-export/qif-imp/CMakeFiles/scm-qif-import-links.dir/build make[2]: Entering directory '/tmp/B.v8o6rdi5/BUILD/gnucash-5.7/build' [ 9%] Generating ../../../share/guile/site/3.0/gnucash/string.scm cd /tmp/B.v8o6rdi5/BUILD/gnucash-5.7/build/gnucash/import-export/qif-imp && /usr/bin/cmake -E create_symlink /tmp/B.v8o6rdi5/BUILD/gnucash-5.7/gnucash/import-export/qif-imp/string.scm /tmp/B.v8o6rdi5/BUILD/gnucash-5.7/build/share/guile/site/3.0/gnucash/string.scm make[2]: Leaving directory '/tmp/B.v8o6rdi5/BUILD/gnucash-5.7/build' make[2]: Entering directory '/tmp/B.v8o6rdi5/BUILD/gnucash-5.7/build' [ 9%] Generating ../../../share/guile/site/3.0/gnucash/reports/standard/budget-flow.scm cd /tmp/B.v8o6rdi5/BUILD/gnucash-5.7/build/gnucash/report/reports && /usr/bin/cmake -E create_symlink /tmp/B.v8o6rdi5/BUILD/gnucash-5.7/gnucash/report/reports/standard/budget-flow.scm /tmp/B.v8o6rdi5/BUILD/gnucash-5.7/build/share/guile/site/3.0/gnucash/reports/standard/budget-flow.scm make[2]: Leaving directory '/tmp/B.v8o6rdi5/BUILD/gnucash-5.7/build' make[2]: Entering directory '/tmp/B.v8o6rdi5/BUILD/gnucash-5.7/build' cd /tmp/B.v8o6rdi5/BUILD/gnucash-5.7/build && /usr/bin/cmake -E cmake_depends "Unix Makefiles" /tmp/B.v8o6rdi5/BUILD/gnucash-5.7 /tmp/B.v8o6rdi5/BUILD/gnucash-5.7/gnucash/report/stylesheets /tmp/B.v8o6rdi5/BUILD/gnucash-5.7/build /tmp/B.v8o6rdi5/BUILD/gnucash-5.7/build/gnucash/report/stylesheets /tmp/B.v8o6rdi5/BUILD/gnucash-5.7/build/gnucash/report/stylesheets/CMakeFiles/scm-report-stylesheets-1-links.dir/DependInfo.cmake "--color=" make[2]: Leaving directory '/tmp/B.v8o6rdi5/BUILD/gnucash-5.7/build' make[2]: Entering directory '/tmp/B.v8o6rdi5/BUILD/gnucash-5.7/build' [ 9%] Generating ../../../share/guile/site/3.0/gnucash/qif-import.scm cd /tmp/B.v8o6rdi5/BUILD/gnucash-5.7/build/gnucash/import-export/qif-imp && /usr/bin/cmake -E create_symlink /tmp/B.v8o6rdi5/BUILD/gnucash-5.7/gnucash/import-export/qif-imp/qif-import.scm /tmp/B.v8o6rdi5/BUILD/gnucash-5.7/build/share/guile/site/3.0/gnucash/qif-import.scm /usr/bin/make -f gnucash/report/stylesheets/CMakeFiles/scm-report-stylesheets-1-links.dir/build.make gnucash/report/stylesheets/CMakeFiles/scm-report-stylesheets-1-links.dir/build make[2]: Leaving directory '/tmp/B.v8o6rdi5/BUILD/gnucash-5.7/build' make[2]: Entering directory '/tmp/B.v8o6rdi5/BUILD/gnucash-5.7/build' [ 9%] Generating ../../../share/guile/site/3.0/gnucash/reports/standard/budget-income-statement.scm cd /tmp/B.v8o6rdi5/BUILD/gnucash-5.7/build/gnucash/report/reports && /usr/bin/cmake -E create_symlink /tmp/B.v8o6rdi5/BUILD/gnucash-5.7/gnucash/report/reports/standard/budget-income-statement.scm /tmp/B.v8o6rdi5/BUILD/gnucash-5.7/build/share/guile/site/3.0/gnucash/reports/standard/budget-income-statement.scm make[2]: Leaving directory '/tmp/B.v8o6rdi5/BUILD/gnucash-5.7/build' make[2]: Entering directory '/tmp/B.v8o6rdi5/BUILD/gnucash-5.7/build' [ 9%] Generating ../../../share/guile/site/3.0/gnucash/reports/example/sample-graphs.scm cd /tmp/B.v8o6rdi5/BUILD/gnucash-5.7/build/gnucash/report/reports && /usr/bin/cmake -E create_symlink /tmp/B.v8o6rdi5/BUILD/gnucash-5.7/gnucash/report/reports/example/sample-graphs.scm /tmp/B.v8o6rdi5/BUILD/gnucash-5.7/build/share/guile/site/3.0/gnucash/reports/example/sample-graphs.scm make[2]: Leaving directory '/tmp/B.v8o6rdi5/BUILD/gnucash-5.7/build' make[2]: Entering directory '/tmp/B.v8o6rdi5/BUILD/gnucash-5.7/build' [ 9%] Generating ../../share/guile/site/3.0/gnucash/report/html-style-sheet.scm cd /tmp/B.v8o6rdi5/BUILD/gnucash-5.7/build/gnucash/report && /usr/bin/cmake -E create_symlink /tmp/B.v8o6rdi5/BUILD/gnucash-5.7/gnucash/report/html-style-sheet.scm /tmp/B.v8o6rdi5/BUILD/gnucash-5.7/build/share/guile/site/3.0/gnucash/report/html-style-sheet.scm make[2]: Leaving directory '/tmp/B.v8o6rdi5/BUILD/gnucash-5.7/build' make[1]: Entering directory '/tmp/B.v8o6rdi5/BUILD/gnucash-5.7/build' [ 9%] Built target scm-qif-import-2-links make[1]: Leaving directory '/tmp/B.v8o6rdi5/BUILD/gnucash-5.7/build' make[1]: Entering directory '/tmp/B.v8o6rdi5/BUILD/gnucash-5.7/build' [ 9%] Built target scm-qif-import-0-links make[1]: Leaving directory '/tmp/B.v8o6rdi5/BUILD/gnucash-5.7/build' make[2]: Entering directory '/tmp/B.v8o6rdi5/BUILD/gnucash-5.7/build' [ 6%] Generating ../share/locale/es_NI/LC_MESSAGES/gnucash.mo cd /tmp/B.v8o6rdi5/BUILD/gnucash-5.7/build/po && /usr/bin/msgfmt -o /tmp/B.v8o6rdi5/BUILD/gnucash-5.7/build/share/locale/es_NI/LC_MESSAGES/gnucash.mo /tmp/B.v8o6rdi5/BUILD/gnucash-5.7/po/es_NI.po make[2]: Leaving directory '/tmp/B.v8o6rdi5/BUILD/gnucash-5.7/build' make[2]: Entering directory '/tmp/B.v8o6rdi5/BUILD/gnucash-5.7/build' [ 9%] Generating ../../../share/guile/site/3.0/gnucash/reports/standard/budget.scm cd /tmp/B.v8o6rdi5/BUILD/gnucash-5.7/build/gnucash/report/reports && /usr/bin/cmake -E create_symlink /tmp/B.v8o6rdi5/BUILD/gnucash-5.7/gnucash/report/reports/standard/budget.scm /tmp/B.v8o6rdi5/BUILD/gnucash-5.7/build/share/guile/site/3.0/gnucash/reports/standard/budget.scm make[2]: Leaving directory '/tmp/B.v8o6rdi5/BUILD/gnucash-5.7/build' make[1]: Entering directory '/tmp/B.v8o6rdi5/BUILD/gnucash-5.7/build' [ 10%] Built target scm-reports-example-links make[1]: Leaving directory '/tmp/B.v8o6rdi5/BUILD/gnucash-5.7/build' make[2]: Entering directory '/tmp/B.v8o6rdi5/BUILD/gnucash-5.7/build' [ 9%] Generating ../../../share/guile/site/3.0/gnucash/qif-import/qif-dialog-utils.scm cd /tmp/B.v8o6rdi5/BUILD/gnucash-5.7/build/gnucash/import-export/qif-imp && /usr/bin/cmake -E create_symlink /tmp/B.v8o6rdi5/BUILD/gnucash-5.7/gnucash/import-export/qif-imp/qif-dialog-utils.scm /tmp/B.v8o6rdi5/BUILD/gnucash-5.7/build/share/guile/site/3.0/gnucash/qif-import/qif-dialog-utils.scm make[2]: Leaving directory '/tmp/B.v8o6rdi5/BUILD/gnucash-5.7/build' make[2]: Entering directory '/tmp/B.v8o6rdi5/BUILD/gnucash-5.7/build' [ 9%] Generating ../../../share/guile/site/3.0/gnucash/reports/standard/cash-flow.scm cd /tmp/B.v8o6rdi5/BUILD/gnucash-5.7/build/gnucash/report/reports && /usr/bin/cmake -E create_symlink /tmp/B.v8o6rdi5/BUILD/gnucash-5.7/gnucash/report/reports/standard/cash-flow.scm /tmp/B.v8o6rdi5/BUILD/gnucash-5.7/build/share/guile/site/3.0/gnucash/reports/standard/cash-flow.scm make[2]: Leaving directory '/tmp/B.v8o6rdi5/BUILD/gnucash-5.7/build' make[2]: Entering directory '/tmp/B.v8o6rdi5/BUILD/gnucash-5.7/build' [ 5%] Generating ../share/locale/es/LC_MESSAGES/gnucash.mo cd /tmp/B.v8o6rdi5/BUILD/gnucash-5.7/build/po && /usr/bin/msgfmt -o /tmp/B.v8o6rdi5/BUILD/gnucash-5.7/build/share/locale/es/LC_MESSAGES/gnucash.mo /tmp/B.v8o6rdi5/BUILD/gnucash-5.7/po/es.po make[2]: Leaving directory '/tmp/B.v8o6rdi5/BUILD/gnucash-5.7/build' make[2]: Entering directory '/tmp/B.v8o6rdi5/BUILD/gnucash-5.7/build' [ 9%] Generating ../../../share/guile/site/3.0/gnucash/reports/standard/cashflow-barchart.scm cd /tmp/B.v8o6rdi5/BUILD/gnucash-5.7/build/gnucash/report/reports && /usr/bin/cmake -E create_symlink /tmp/B.v8o6rdi5/BUILD/gnucash-5.7/gnucash/report/reports/standard/cashflow-barchart.scm /tmp/B.v8o6rdi5/BUILD/gnucash-5.7/build/share/guile/site/3.0/gnucash/reports/standard/cashflow-barchart.scm make[2]: Leaving directory '/tmp/B.v8o6rdi5/BUILD/gnucash-5.7/build' make[2]: Entering directory '/tmp/B.v8o6rdi5/BUILD/gnucash-5.7/build' [ 10%] Generating ../../../share/guile/site/3.0/gnucash/report/stylesheets/css.scm cd /tmp/B.v8o6rdi5/BUILD/gnucash-5.7/build/gnucash/report/stylesheets && /usr/bin/cmake -E create_symlink /tmp/B.v8o6rdi5/BUILD/gnucash-5.7/gnucash/report/stylesheets/css.scm /tmp/B.v8o6rdi5/BUILD/gnucash-5.7/build/share/guile/site/3.0/gnucash/report/stylesheets/css.scm make[2]: Leaving directory '/tmp/B.v8o6rdi5/BUILD/gnucash-5.7/build' make[2]: Entering directory '/tmp/B.v8o6rdi5/BUILD/gnucash-5.7/build' [ 10%] Generating ../../share/guile/site/3.0/gnucash/report/html-anytag.scm cd /tmp/B.v8o6rdi5/BUILD/gnucash-5.7/build/gnucash/report && /usr/bin/cmake -E create_symlink /tmp/B.v8o6rdi5/BUILD/gnucash-5.7/gnucash/report/html-anytag.scm /tmp/B.v8o6rdi5/BUILD/gnucash-5.7/build/share/guile/site/3.0/gnucash/report/html-anytag.scm make[2]: Leaving directory '/tmp/B.v8o6rdi5/BUILD/gnucash-5.7/build' make[2]: Entering directory '/tmp/B.v8o6rdi5/BUILD/gnucash-5.7/build' [ 6%] Generating ../share/locale/et/LC_MESSAGES/gnucash.mo cd /tmp/B.v8o6rdi5/BUILD/gnucash-5.7/build/po && /usr/bin/msgfmt -o /tmp/B.v8o6rdi5/BUILD/gnucash-5.7/build/share/locale/et/LC_MESSAGES/gnucash.mo /tmp/B.v8o6rdi5/BUILD/gnucash-5.7/po/et.po make[2]: Leaving directory '/tmp/B.v8o6rdi5/BUILD/gnucash-5.7/build' make[2]: Entering directory '/tmp/B.v8o6rdi5/BUILD/gnucash-5.7/build' [ 12%] Generating ../../../share/guile/site/3.0/gnucash/reports/standard/dashboard.scm cd /tmp/B.v8o6rdi5/BUILD/gnucash-5.7/build/gnucash/report/reports && /usr/bin/cmake -E create_symlink /tmp/B.v8o6rdi5/BUILD/gnucash-5.7/gnucash/report/reports/standard/dashboard.scm /tmp/B.v8o6rdi5/BUILD/gnucash-5.7/build/share/guile/site/3.0/gnucash/reports/standard/dashboard.scm make[2]: Leaving directory '/tmp/B.v8o6rdi5/BUILD/gnucash-5.7/build' make[2]: Entering directory '/tmp/B.v8o6rdi5/BUILD/gnucash-5.7/build' [ 8%] Generating ../share/locale/fi/LC_MESSAGES/gnucash.mo cd /tmp/B.v8o6rdi5/BUILD/gnucash-5.7/build/po && /usr/bin/msgfmt -o /tmp/B.v8o6rdi5/BUILD/gnucash-5.7/build/share/locale/fi/LC_MESSAGES/gnucash.mo /tmp/B.v8o6rdi5/BUILD/gnucash-5.7/po/fi.po make[2]: Leaving directory '/tmp/B.v8o6rdi5/BUILD/gnucash-5.7/build' make[2]: Entering directory '/tmp/B.v8o6rdi5/BUILD/gnucash-5.7/build' [ 12%] Generating ../../../share/guile/site/3.0/gnucash/reports/standard/category-barchart.scm cd /tmp/B.v8o6rdi5/BUILD/gnucash-5.7/build/gnucash/report/reports && /usr/bin/cmake -E create_symlink /tmp/B.v8o6rdi5/BUILD/gnucash-5.7/gnucash/report/reports/standard/category-barchart.scm /tmp/B.v8o6rdi5/BUILD/gnucash-5.7/build/share/guile/site/3.0/gnucash/reports/standard/category-barchart.scm make[2]: Leaving directory '/tmp/B.v8o6rdi5/BUILD/gnucash-5.7/build' make[2]: Entering directory '/tmp/B.v8o6rdi5/BUILD/gnucash-5.7/build' [ 12%] Generating ../../../share/guile/site/3.0/gnucash/report/stylesheets/plain.scm cd /tmp/B.v8o6rdi5/BUILD/gnucash-5.7/build/gnucash/report/stylesheets && /usr/bin/cmake -E create_symlink /tmp/B.v8o6rdi5/BUILD/gnucash-5.7/gnucash/report/stylesheets/plain.scm /tmp/B.v8o6rdi5/BUILD/gnucash-5.7/build/share/guile/site/3.0/gnucash/report/stylesheets/plain.scm make[2]: Leaving directory '/tmp/B.v8o6rdi5/BUILD/gnucash-5.7/build' make[2]: Entering directory '/tmp/B.v8o6rdi5/BUILD/gnucash-5.7/build' [ 9%] Linking C shared library ../../libx32/libgnc-module.so cd /tmp/B.v8o6rdi5/BUILD/gnucash-5.7/build/libgnucash/gnc-module && /usr/bin/cmake -E cmake_link_script CMakeFiles/gnc-module.dir/link.txt --verbose=1 /usr/bin/x86_64-pld-linux-gnux32-gcc -fPIC -Werror -Wall -Wmissing-prototypes -Wmissing-declarations -O2 -fwrapv -pipe -Wformat -Werror=format-security -gdwarf-4 -fno-debug-types-section -fvar-tracking-assignments -g2 -Wp,-D_FORTIFY_SOURCE=2 -fstack-protector-strong --param=ssp-buffer-size=4 -Werror=trampolines -fPIC -mtune=generic -march=x86-64 -gdwarf-4 -fno-debug-types-section -fvar-tracking-assignments -g2 -DNDEBUG -DQT_NO_DEBUG -Wl,--as-needed -Wl,--no-copy-dt-needed-entries -Wl,-z,relro -Wl,-z,combreloc -shared -Wl,-soname,libgnc-module.so -o ../../libx32/libgnc-module.so "CMakeFiles/gnc-module.dir/gnc-module.c.o" -Wl,-rpath,::::::::::::::::::::::::::::::: -L/usr/libx32 -Wl,--export-dynamic -lgmodule-2.0 -pthread -lglib-2.0 /usr/libx32/libglib-2.0.so make[2]: Leaving directory '/tmp/B.v8o6rdi5/BUILD/gnucash-5.7/build' make[2]: Entering directory '/tmp/B.v8o6rdi5/BUILD/gnucash-5.7/build' [ 12%] Generating ../../../share/guile/site/3.0/gnucash/qif-import/qif-file.scm cd /tmp/B.v8o6rdi5/BUILD/gnucash-5.7/build/gnucash/import-export/qif-imp && /usr/bin/cmake -E create_symlink /tmp/B.v8o6rdi5/BUILD/gnucash-5.7/gnucash/import-export/qif-imp/qif-file.scm /tmp/B.v8o6rdi5/BUILD/gnucash-5.7/build/share/guile/site/3.0/gnucash/qif-import/qif-file.scm make[2]: Leaving directory '/tmp/B.v8o6rdi5/BUILD/gnucash-5.7/build' make[2]: Entering directory '/tmp/B.v8o6rdi5/BUILD/gnucash-5.7/build' [ 8%] Generating ../share/locale/eu/LC_MESSAGES/gnucash.mo cd /tmp/B.v8o6rdi5/BUILD/gnucash-5.7/build/po && /usr/bin/msgfmt -o /tmp/B.v8o6rdi5/BUILD/gnucash-5.7/build/share/locale/eu/LC_MESSAGES/gnucash.mo /tmp/B.v8o6rdi5/BUILD/gnucash-5.7/po/eu.po make[2]: Leaving directory '/tmp/B.v8o6rdi5/BUILD/gnucash-5.7/build' /usr/bin/make -f gnucash/gschemas/CMakeFiles/pref_transformations.dir/build.make gnucash/gschemas/CMakeFiles/pref_transformations.dir/depend make[2]: Entering directory '/tmp/B.v8o6rdi5/BUILD/gnucash-5.7/build' [ 12%] Generating ../../../share/guile/site/3.0/gnucash/report/stylesheets/footer.scm cd /tmp/B.v8o6rdi5/BUILD/gnucash-5.7/build/gnucash/report/stylesheets && /usr/bin/cmake -E create_symlink /tmp/B.v8o6rdi5/BUILD/gnucash-5.7/gnucash/report/stylesheets/footer.scm /tmp/B.v8o6rdi5/BUILD/gnucash-5.7/build/share/guile/site/3.0/gnucash/report/stylesheets/footer.scm make[2]: Leaving directory '/tmp/B.v8o6rdi5/BUILD/gnucash-5.7/build' /usr/bin/make -f gnucash/gschemas/CMakeFiles/org.gnucash.GnuCash.window.pages.gschema.valid-target.dir/build.make gnucash/gschemas/CMakeFiles/org.gnucash.GnuCash.window.pages.gschema.valid-target.dir/depend make[2]: Entering directory '/tmp/B.v8o6rdi5/BUILD/gnucash-5.7/build' [ 12%] Generating ../../../share/guile/site/3.0/gnucash/qif-import/qif-guess-map.scm cd /tmp/B.v8o6rdi5/BUILD/gnucash-5.7/build/gnucash/import-export/qif-imp && /usr/bin/cmake -E create_symlink /tmp/B.v8o6rdi5/BUILD/gnucash-5.7/gnucash/import-export/qif-imp/qif-guess-map.scm /tmp/B.v8o6rdi5/BUILD/gnucash-5.7/build/share/guile/site/3.0/gnucash/qif-import/qif-guess-map.scm make[2]: Leaving directory '/tmp/B.v8o6rdi5/BUILD/gnucash-5.7/build' make[2]: Entering directory '/tmp/B.v8o6rdi5/BUILD/gnucash-5.7/build' [ 12%] Generating ../../../share/guile/site/3.0/gnucash/reports/standard/equity-statement.scm cd /tmp/B.v8o6rdi5/BUILD/gnucash-5.7/build/gnucash/report/reports && /usr/bin/cmake -E create_symlink /tmp/B.v8o6rdi5/BUILD/gnucash-5.7/gnucash/report/reports/standard/equity-statement.scm /tmp/B.v8o6rdi5/BUILD/gnucash-5.7/build/share/guile/site/3.0/gnucash/reports/standard/equity-statement.scm make[2]: Leaving directory '/tmp/B.v8o6rdi5/BUILD/gnucash-5.7/build' make[2]: Entering directory '/tmp/B.v8o6rdi5/BUILD/gnucash-5.7/build' [ 8%] Generating ../share/locale/fa/LC_MESSAGES/gnucash.mo cd /tmp/B.v8o6rdi5/BUILD/gnucash-5.7/build/po && /usr/bin/msgfmt -o /tmp/B.v8o6rdi5/BUILD/gnucash-5.7/build/share/locale/fa/LC_MESSAGES/gnucash.mo /tmp/B.v8o6rdi5/BUILD/gnucash-5.7/po/fa.po make[2]: Leaving directory '/tmp/B.v8o6rdi5/BUILD/gnucash-5.7/build' make[2]: Entering directory '/tmp/B.v8o6rdi5/BUILD/gnucash-5.7/build' [ 12%] Generating ../../share/guile/site/3.0/gnucash/report/html-table.scm cd /tmp/B.v8o6rdi5/BUILD/gnucash-5.7/build/gnucash/report && /usr/bin/cmake -E create_symlink /tmp/B.v8o6rdi5/BUILD/gnucash-5.7/gnucash/report/html-table.scm /tmp/B.v8o6rdi5/BUILD/gnucash-5.7/build/share/guile/site/3.0/gnucash/report/html-table.scm make[2]: Leaving directory '/tmp/B.v8o6rdi5/BUILD/gnucash-5.7/build' make[2]: Entering directory '/tmp/B.v8o6rdi5/BUILD/gnucash-5.7/build' [ 12%] Generating ../../../share/guile/site/3.0/gnucash/report/stylesheets/head-or-tail.scm cd /tmp/B.v8o6rdi5/BUILD/gnucash-5.7/build/gnucash/report/stylesheets && /usr/bin/cmake -E create_symlink /tmp/B.v8o6rdi5/BUILD/gnucash-5.7/gnucash/report/stylesheets/head-or-tail.scm /tmp/B.v8o6rdi5/BUILD/gnucash-5.7/build/share/guile/site/3.0/gnucash/report/stylesheets/head-or-tail.scm make[2]: Leaving directory '/tmp/B.v8o6rdi5/BUILD/gnucash-5.7/build' make[2]: Entering directory '/tmp/B.v8o6rdi5/BUILD/gnucash-5.7/build' [ 12%] Generating ../../../share/guile/site/3.0/gnucash/qif-import/qif-objects.scm cd /tmp/B.v8o6rdi5/BUILD/gnucash-5.7/build/gnucash/import-export/qif-imp && /usr/bin/cmake -E create_symlink /tmp/B.v8o6rdi5/BUILD/gnucash-5.7/gnucash/import-export/qif-imp/qif-objects.scm /tmp/B.v8o6rdi5/BUILD/gnucash-5.7/build/share/guile/site/3.0/gnucash/qif-import/qif-objects.scm make[2]: Leaving directory '/tmp/B.v8o6rdi5/BUILD/gnucash-5.7/build' make[1]: Entering directory '/tmp/B.v8o6rdi5/BUILD/gnucash-5.7/build' [ 13%] Built target gnc-module make[1]: Leaving directory '/tmp/B.v8o6rdi5/BUILD/gnucash-5.7/build' make[2]: Entering directory '/tmp/B.v8o6rdi5/BUILD/gnucash-5.7/build' cd /tmp/B.v8o6rdi5/BUILD/gnucash-5.7/build && /usr/bin/cmake -E cmake_depends "Unix Makefiles" /tmp/B.v8o6rdi5/BUILD/gnucash-5.7 /tmp/B.v8o6rdi5/BUILD/gnucash-5.7/gnucash/gschemas /tmp/B.v8o6rdi5/BUILD/gnucash-5.7/build /tmp/B.v8o6rdi5/BUILD/gnucash-5.7/build/gnucash/gschemas /tmp/B.v8o6rdi5/BUILD/gnucash-5.7/build/gnucash/gschemas/CMakeFiles/pref_transformations.dir/DependInfo.cmake "--color=" make[2]: Leaving directory '/tmp/B.v8o6rdi5/BUILD/gnucash-5.7/build' make[2]: Entering directory '/tmp/B.v8o6rdi5/BUILD/gnucash-5.7/build' cd /tmp/B.v8o6rdi5/BUILD/gnucash-5.7/build && /usr/bin/cmake -E cmake_depends "Unix Makefiles" /tmp/B.v8o6rdi5/BUILD/gnucash-5.7 /tmp/B.v8o6rdi5/BUILD/gnucash-5.7/gnucash/gschemas /tmp/B.v8o6rdi5/BUILD/gnucash-5.7/build /tmp/B.v8o6rdi5/BUILD/gnucash-5.7/build/gnucash/gschemas /tmp/B.v8o6rdi5/BUILD/gnucash-5.7/build/gnucash/gschemas/CMakeFiles/org.gnucash.GnuCash.window.pages.gschema.valid-target.dir/DependInfo.cmake "--color=" make[2]: Leaving directory '/tmp/B.v8o6rdi5/BUILD/gnucash-5.7/build' /usr/bin/make -f gnucash/gschemas/CMakeFiles/pref_transformations.dir/build.make gnucash/gschemas/CMakeFiles/pref_transformations.dir/build /usr/bin/make -f gnucash/gschemas/CMakeFiles/org.gnucash.GnuCash.window.pages.gschema.valid-target.dir/build.make gnucash/gschemas/CMakeFiles/org.gnucash.GnuCash.window.pages.gschema.valid-target.dir/build make[2]: Entering directory '/tmp/B.v8o6rdi5/BUILD/gnucash-5.7/build' [ 9%] Generating ../share/locale/hr/LC_MESSAGES/gnucash.mo cd /tmp/B.v8o6rdi5/BUILD/gnucash-5.7/build/po && /usr/bin/msgfmt -o /tmp/B.v8o6rdi5/BUILD/gnucash-5.7/build/share/locale/hr/LC_MESSAGES/gnucash.mo /tmp/B.v8o6rdi5/BUILD/gnucash-5.7/po/hr.po make[2]: Leaving directory '/tmp/B.v8o6rdi5/BUILD/gnucash-5.7/build' make[2]: Entering directory '/tmp/B.v8o6rdi5/BUILD/gnucash-5.7/build' [ 13%] Generating ../../../share/guile/site/3.0/gnucash/qif-import/qif-merge-groups.scm cd /tmp/B.v8o6rdi5/BUILD/gnucash-5.7/build/gnucash/import-export/qif-imp && /usr/bin/cmake -E create_symlink /tmp/B.v8o6rdi5/BUILD/gnucash-5.7/gnucash/import-export/qif-imp/qif-merge-groups.scm /tmp/B.v8o6rdi5/BUILD/gnucash-5.7/build/share/guile/site/3.0/gnucash/qif-import/qif-merge-groups.scm make[2]: Leaving directory '/tmp/B.v8o6rdi5/BUILD/gnucash-5.7/build' make[2]: Entering directory '/tmp/B.v8o6rdi5/BUILD/gnucash-5.7/build' [ 13%] Generating ../../../share/guile/site/3.0/gnucash/reports/standard/general-journal.scm cd /tmp/B.v8o6rdi5/BUILD/gnucash-5.7/build/gnucash/report/reports && /usr/bin/cmake -E create_symlink /tmp/B.v8o6rdi5/BUILD/gnucash-5.7/gnucash/report/reports/standard/general-journal.scm /tmp/B.v8o6rdi5/BUILD/gnucash-5.7/build/share/guile/site/3.0/gnucash/reports/standard/general-journal.scm make[2]: Leaving directory '/tmp/B.v8o6rdi5/BUILD/gnucash-5.7/build' make[2]: Entering directory '/tmp/B.v8o6rdi5/BUILD/gnucash-5.7/build' [ 13%] Generating ../../../share/guile/site/3.0/gnucash/reports/standard/general-ledger.scm cd /tmp/B.v8o6rdi5/BUILD/gnucash-5.7/build/gnucash/report/reports && /usr/bin/cmake -E create_symlink /tmp/B.v8o6rdi5/BUILD/gnucash-5.7/gnucash/report/reports/standard/general-ledger.scm /tmp/B.v8o6rdi5/BUILD/gnucash-5.7/build/share/guile/site/3.0/gnucash/reports/standard/general-ledger.scm make[2]: Leaving directory '/tmp/B.v8o6rdi5/BUILD/gnucash-5.7/build' make[2]: Entering directory '/tmp/B.v8o6rdi5/BUILD/gnucash-5.7/build' [ 13%] Generating ../../../share/guile/site/3.0/gnucash/qif-import/qif-to-gnc.scm cd /tmp/B.v8o6rdi5/BUILD/gnucash-5.7/build/gnucash/import-export/qif-imp && /usr/bin/cmake -E create_symlink /tmp/B.v8o6rdi5/BUILD/gnucash-5.7/gnucash/import-export/qif-imp/qif-to-gnc.scm /tmp/B.v8o6rdi5/BUILD/gnucash-5.7/build/share/guile/site/3.0/gnucash/qif-import/qif-to-gnc.scm make[2]: Leaving directory '/tmp/B.v8o6rdi5/BUILD/gnucash-5.7/build' make[1]: Entering directory '/tmp/B.v8o6rdi5/BUILD/gnucash-5.7/build' [ 13%] Built target scm-report-stylesheets-1-links make[1]: Leaving directory '/tmp/B.v8o6rdi5/BUILD/gnucash-5.7/build' make[2]: Entering directory '/tmp/B.v8o6rdi5/BUILD/gnucash-5.7/build' [ 8%] Generating ../share/locale/he/LC_MESSAGES/gnucash.mo cd /tmp/B.v8o6rdi5/BUILD/gnucash-5.7/build/po && /usr/bin/msgfmt -o /tmp/B.v8o6rdi5/BUILD/gnucash-5.7/build/share/locale/he/LC_MESSAGES/gnucash.mo /tmp/B.v8o6rdi5/BUILD/gnucash-5.7/po/he.po make[2]: Leaving directory '/tmp/B.v8o6rdi5/BUILD/gnucash-5.7/build' make[2]: Entering directory '/tmp/B.v8o6rdi5/BUILD/gnucash-5.7/build' [ 13%] Generating ../../../share/guile/site/3.0/gnucash/qif-import/qif-parse.scm cd /tmp/B.v8o6rdi5/BUILD/gnucash-5.7/build/gnucash/import-export/qif-imp && /usr/bin/cmake -E create_symlink /tmp/B.v8o6rdi5/BUILD/gnucash-5.7/gnucash/import-export/qif-imp/qif-parse.scm /tmp/B.v8o6rdi5/BUILD/gnucash-5.7/build/share/guile/site/3.0/gnucash/qif-import/qif-parse.scm make[2]: Leaving directory '/tmp/B.v8o6rdi5/BUILD/gnucash-5.7/build' /usr/bin/make -f gnucash/import-export/aqb/gschemas/CMakeFiles/org.gnucash.GnuCash.dialogs.import.hbci.gschema.valid-target.dir/build.make gnucash/import-export/aqb/gschemas/CMakeFiles/org.gnucash.GnuCash.dialogs.import.hbci.gschema.valid-target.dir/depend make[2]: Entering directory '/tmp/B.v8o6rdi5/BUILD/gnucash-5.7/build' [ 8%] Generating ../share/locale/gu/LC_MESSAGES/gnucash.mo cd /tmp/B.v8o6rdi5/BUILD/gnucash-5.7/build/po && /usr/bin/msgfmt -o /tmp/B.v8o6rdi5/BUILD/gnucash-5.7/build/share/locale/gu/LC_MESSAGES/gnucash.mo /tmp/B.v8o6rdi5/BUILD/gnucash-5.7/po/gu.po make[2]: Leaving directory '/tmp/B.v8o6rdi5/BUILD/gnucash-5.7/build' make[2]: Entering directory '/tmp/B.v8o6rdi5/BUILD/gnucash-5.7/build' [ 13%] Generating ../../share/gnucash/pref_transformations.xml cd /tmp/B.v8o6rdi5/BUILD/gnucash-5.7/build/gnucash/gschemas && env cat /tmp/B.v8o6rdi5/BUILD/gnucash-5.7/gnucash/import-export/aqb/gschemas/pref_transformations.xml /tmp/B.v8o6rdi5/BUILD/gnucash-5.7/gnucash/import-export/ofx/gschemas/pref_transformations.xml /tmp/B.v8o6rdi5/BUILD/gnucash-5.7/gnucash/gschemas/pref_transformations.xml > /tmp/B.v8o6rdi5/BUILD/gnucash-5.7/build/share/gnucash/pref_transformations.xml make[2]: Leaving directory '/tmp/B.v8o6rdi5/BUILD/gnucash-5.7/build' make[2]: Entering directory '/tmp/B.v8o6rdi5/BUILD/gnucash-5.7/build' [ 13%] Generating ../../../share/guile/site/3.0/gnucash/qif-import/qif-utils.scm cd /tmp/B.v8o6rdi5/BUILD/gnucash-5.7/build/gnucash/import-export/qif-imp && /usr/bin/cmake -E create_symlink /tmp/B.v8o6rdi5/BUILD/gnucash-5.7/gnucash/import-export/qif-imp/qif-utils.scm /tmp/B.v8o6rdi5/BUILD/gnucash-5.7/build/share/guile/site/3.0/gnucash/qif-import/qif-utils.scm make[2]: Leaving directory '/tmp/B.v8o6rdi5/BUILD/gnucash-5.7/build' make[2]: Entering directory '/tmp/B.v8o6rdi5/BUILD/gnucash-5.7/build' [ 13%] Generating ../../share/guile/site/3.0/gnucash/report/html-text.scm cd /tmp/B.v8o6rdi5/BUILD/gnucash-5.7/build/gnucash/report && /usr/bin/cmake -E create_symlink /tmp/B.v8o6rdi5/BUILD/gnucash-5.7/gnucash/report/html-text.scm /tmp/B.v8o6rdi5/BUILD/gnucash-5.7/build/share/guile/site/3.0/gnucash/report/html-text.scm make[2]: Leaving directory '/tmp/B.v8o6rdi5/BUILD/gnucash-5.7/build' make[2]: Entering directory '/tmp/B.v8o6rdi5/BUILD/gnucash-5.7/build' [ 8%] Generating ../share/locale/fr/LC_MESSAGES/gnucash.mo cd /tmp/B.v8o6rdi5/BUILD/gnucash-5.7/build/po && /usr/bin/msgfmt -o /tmp/B.v8o6rdi5/BUILD/gnucash-5.7/build/share/locale/fr/LC_MESSAGES/gnucash.mo /tmp/B.v8o6rdi5/BUILD/gnucash-5.7/po/fr.po make[2]: Leaving directory '/tmp/B.v8o6rdi5/BUILD/gnucash-5.7/build' /usr/bin/make -f gnucash/import-export/aqb/gschemas/CMakeFiles/org.gnucash.GnuCash.dialogs.flicker.gschema.valid-target.dir/build.make gnucash/import-export/aqb/gschemas/CMakeFiles/org.gnucash.GnuCash.dialogs.flicker.gschema.valid-target.dir/depend make[2]: Entering directory '/tmp/B.v8o6rdi5/BUILD/gnucash-5.7/build' [ 9%] Generating ../share/locale/id/LC_MESSAGES/gnucash.mo cd /tmp/B.v8o6rdi5/BUILD/gnucash-5.7/build/po && /usr/bin/msgfmt -o /tmp/B.v8o6rdi5/BUILD/gnucash-5.7/build/share/locale/id/LC_MESSAGES/gnucash.mo /tmp/B.v8o6rdi5/BUILD/gnucash-5.7/po/id.po make[2]: Leaving directory '/tmp/B.v8o6rdi5/BUILD/gnucash-5.7/build' make[2]: Entering directory '/tmp/B.v8o6rdi5/BUILD/gnucash-5.7/build' [ 13%] Generating ../../share/guile/site/3.0/gnucash/report/html-utilities.scm cd /tmp/B.v8o6rdi5/BUILD/gnucash-5.7/build/gnucash/report && /usr/bin/cmake -E create_symlink /tmp/B.v8o6rdi5/BUILD/gnucash-5.7/gnucash/report/html-utilities.scm /tmp/B.v8o6rdi5/BUILD/gnucash-5.7/build/share/guile/site/3.0/gnucash/report/html-utilities.scm make[2]: Leaving directory '/tmp/B.v8o6rdi5/BUILD/gnucash-5.7/build' make[2]: Entering directory '/tmp/B.v8o6rdi5/BUILD/gnucash-5.7/build' [ 13%] Generating org.gnucash.GnuCash.window.pages.gschema.valid cd /tmp/B.v8o6rdi5/BUILD/gnucash-5.7/build/gnucash/gschemas && /usr/bin/glib-compile-schemas --strict --dry-run --schema-file=/tmp/B.v8o6rdi5/BUILD/gnucash-5.7/build/share/glib-2.0/schemas/org.gnucash.GnuCash.window.pages.gschema.xml cd /tmp/B.v8o6rdi5/BUILD/gnucash-5.7/build/gnucash/gschemas && /usr/bin/cmake -E touch /tmp/B.v8o6rdi5/BUILD/gnucash-5.7/build/gnucash/gschemas/org.gnucash.GnuCash.window.pages.gschema.valid make[2]: Leaving directory '/tmp/B.v8o6rdi5/BUILD/gnucash-5.7/build' make[1]: Entering directory '/tmp/B.v8o6rdi5/BUILD/gnucash-5.7/build' [ 13%] Built target pref_transformations make[1]: Leaving directory '/tmp/B.v8o6rdi5/BUILD/gnucash-5.7/build' make[2]: Entering directory '/tmp/B.v8o6rdi5/BUILD/gnucash-5.7/build' [ 13%] Generating ../../../share/guile/site/3.0/gnucash/reports/standard/income-gst-statement.scm cd /tmp/B.v8o6rdi5/BUILD/gnucash-5.7/build/gnucash/report/reports && /usr/bin/cmake -E create_symlink /tmp/B.v8o6rdi5/BUILD/gnucash-5.7/gnucash/report/reports/standard/income-gst-statement.scm /tmp/B.v8o6rdi5/BUILD/gnucash-5.7/build/share/guile/site/3.0/gnucash/reports/standard/income-gst-statement.scm make[2]: Leaving directory '/tmp/B.v8o6rdi5/BUILD/gnucash-5.7/build' make[2]: Entering directory '/tmp/B.v8o6rdi5/BUILD/gnucash-5.7/build' cd /tmp/B.v8o6rdi5/BUILD/gnucash-5.7/build && /usr/bin/cmake -E cmake_depends "Unix Makefiles" /tmp/B.v8o6rdi5/BUILD/gnucash-5.7 /tmp/B.v8o6rdi5/BUILD/gnucash-5.7/gnucash/import-export/aqb/gschemas /tmp/B.v8o6rdi5/BUILD/gnucash-5.7/build /tmp/B.v8o6rdi5/BUILD/gnucash-5.7/build/gnucash/import-export/aqb/gschemas /tmp/B.v8o6rdi5/BUILD/gnucash-5.7/build/gnucash/import-export/aqb/gschemas/CMakeFiles/org.gnucash.GnuCash.dialogs.import.hbci.gschema.valid-target.dir/DependInfo.cmake "--color=" make[2]: Leaving directory '/tmp/B.v8o6rdi5/BUILD/gnucash-5.7/build' /usr/bin/make -f gnucash/import-export/aqb/gschemas/CMakeFiles/org.gnucash.GnuCash.dialogs.import.hbci.gschema.valid-target.dir/build.make gnucash/import-export/aqb/gschemas/CMakeFiles/org.gnucash.GnuCash.dialogs.import.hbci.gschema.valid-target.dir/build make[2]: Entering directory '/tmp/B.v8o6rdi5/BUILD/gnucash-5.7/build' [ 13%] Generating ../../../share/guile/site/3.0/gnucash/reports/standard/ifrs-cost-basis.scm cd /tmp/B.v8o6rdi5/BUILD/gnucash-5.7/build/gnucash/report/reports && /usr/bin/cmake -E create_symlink /tmp/B.v8o6rdi5/BUILD/gnucash-5.7/gnucash/report/reports/standard/ifrs-cost-basis.scm /tmp/B.v8o6rdi5/BUILD/gnucash-5.7/build/share/guile/site/3.0/gnucash/reports/standard/ifrs-cost-basis.scm make[2]: Leaving directory '/tmp/B.v8o6rdi5/BUILD/gnucash-5.7/build' make[1]: Entering directory '/tmp/B.v8o6rdi5/BUILD/gnucash-5.7/build' [ 13%] Built target scm-qif-import-links make[1]: Leaving directory '/tmp/B.v8o6rdi5/BUILD/gnucash-5.7/build' make[2]: Entering directory '/tmp/B.v8o6rdi5/BUILD/gnucash-5.7/build' [ 9%] Generating ../share/locale/hu/LC_MESSAGES/gnucash.mo cd /tmp/B.v8o6rdi5/BUILD/gnucash-5.7/build/po && /usr/bin/msgfmt -o /tmp/B.v8o6rdi5/BUILD/gnucash-5.7/build/share/locale/hu/LC_MESSAGES/gnucash.mo /tmp/B.v8o6rdi5/BUILD/gnucash-5.7/po/hu.po make[2]: Leaving directory '/tmp/B.v8o6rdi5/BUILD/gnucash-5.7/build' make[2]: Entering directory '/tmp/B.v8o6rdi5/BUILD/gnucash-5.7/build' [ 9%] Generating ../share/locale/hi/LC_MESSAGES/gnucash.mo cd /tmp/B.v8o6rdi5/BUILD/gnucash-5.7/build/po && /usr/bin/msgfmt -o /tmp/B.v8o6rdi5/BUILD/gnucash-5.7/build/share/locale/hi/LC_MESSAGES/gnucash.mo /tmp/B.v8o6rdi5/BUILD/gnucash-5.7/po/hi.po make[2]: Leaving directory '/tmp/B.v8o6rdi5/BUILD/gnucash-5.7/build' make[2]: Entering directory '/tmp/B.v8o6rdi5/BUILD/gnucash-5.7/build' cd /tmp/B.v8o6rdi5/BUILD/gnucash-5.7/build && /usr/bin/cmake -E cmake_depends "Unix Makefiles" /tmp/B.v8o6rdi5/BUILD/gnucash-5.7 /tmp/B.v8o6rdi5/BUILD/gnucash-5.7/gnucash/import-export/aqb/gschemas /tmp/B.v8o6rdi5/BUILD/gnucash-5.7/build /tmp/B.v8o6rdi5/BUILD/gnucash-5.7/build/gnucash/import-export/aqb/gschemas /tmp/B.v8o6rdi5/BUILD/gnucash-5.7/build/gnucash/import-export/aqb/gschemas/CMakeFiles/org.gnucash.GnuCash.dialogs.flicker.gschema.valid-target.dir/DependInfo.cmake "--color=" make[2]: Leaving directory '/tmp/B.v8o6rdi5/BUILD/gnucash-5.7/build' make[2]: Entering directory '/tmp/B.v8o6rdi5/BUILD/gnucash-5.7/build' [ 13%] Generating ../../share/guile/site/3.0/gnucash/report/options-utilities.scm cd /tmp/B.v8o6rdi5/BUILD/gnucash-5.7/build/gnucash/report && /usr/bin/cmake -E create_symlink /tmp/B.v8o6rdi5/BUILD/gnucash-5.7/gnucash/report/options-utilities.scm /tmp/B.v8o6rdi5/BUILD/gnucash-5.7/build/share/guile/site/3.0/gnucash/report/options-utilities.scm make[2]: Leaving directory '/tmp/B.v8o6rdi5/BUILD/gnucash-5.7/build' /usr/bin/make -f gnucash/import-export/aqb/gschemas/CMakeFiles/org.gnucash.GnuCash.dialogs.flicker.gschema.valid-target.dir/build.make gnucash/import-export/aqb/gschemas/CMakeFiles/org.gnucash.GnuCash.dialogs.flicker.gschema.valid-target.dir/build make[2]: Entering directory '/tmp/B.v8o6rdi5/BUILD/gnucash-5.7/build' [ 13%] Generating ../../share/guile/site/3.0/gnucash/report/report-core.scm cd /tmp/B.v8o6rdi5/BUILD/gnucash-5.7/build/gnucash/report && /usr/bin/cmake -E create_symlink /tmp/B.v8o6rdi5/BUILD/gnucash-5.7/gnucash/report/report-core.scm /tmp/B.v8o6rdi5/BUILD/gnucash-5.7/build/share/guile/site/3.0/gnucash/report/report-core.scm make[2]: Leaving directory '/tmp/B.v8o6rdi5/BUILD/gnucash-5.7/build' make[1]: Entering directory '/tmp/B.v8o6rdi5/BUILD/gnucash-5.7/build' [ 14%] Built target org.gnucash.GnuCash.window.pages.gschema.valid-target make[1]: Leaving directory '/tmp/B.v8o6rdi5/BUILD/gnucash-5.7/build' make[2]: Entering directory '/tmp/B.v8o6rdi5/BUILD/gnucash-5.7/build' [ 13%] Generating ../../../share/guile/site/3.0/gnucash/reports/standard/income-statement.scm cd /tmp/B.v8o6rdi5/BUILD/gnucash-5.7/build/gnucash/report/reports && /usr/bin/cmake -E create_symlink /tmp/B.v8o6rdi5/BUILD/gnucash-5.7/gnucash/report/reports/standard/income-statement.scm /tmp/B.v8o6rdi5/BUILD/gnucash-5.7/build/share/guile/site/3.0/gnucash/reports/standard/income-statement.scm make[2]: Leaving directory '/tmp/B.v8o6rdi5/BUILD/gnucash-5.7/build' /usr/bin/make -f gnucash/import-export/ofx/gschemas/CMakeFiles/org.gnucash.GnuCash.dialogs.import.ofx.gschema.valid-target.dir/build.make gnucash/import-export/ofx/gschemas/CMakeFiles/org.gnucash.GnuCash.dialogs.import.ofx.gschema.valid-target.dir/depend make[2]: Entering directory '/tmp/B.v8o6rdi5/BUILD/gnucash-5.7/build' [ 13%] Generating ../../../share/guile/site/3.0/gnucash/reports/standard/investment-lots.scm cd /tmp/B.v8o6rdi5/BUILD/gnucash-5.7/build/gnucash/report/reports && /usr/bin/cmake -E create_symlink /tmp/B.v8o6rdi5/BUILD/gnucash-5.7/gnucash/report/reports/standard/investment-lots.scm /tmp/B.v8o6rdi5/BUILD/gnucash-5.7/build/share/guile/site/3.0/gnucash/reports/standard/investment-lots.scm make[2]: Leaving directory '/tmp/B.v8o6rdi5/BUILD/gnucash-5.7/build' make[2]: Entering directory '/tmp/B.v8o6rdi5/BUILD/gnucash-5.7/build' [ 14%] Generating ../../share/guile/site/3.0/gnucash/report/report-utilities.scm cd /tmp/B.v8o6rdi5/BUILD/gnucash-5.7/build/gnucash/report && /usr/bin/cmake -E create_symlink /tmp/B.v8o6rdi5/BUILD/gnucash-5.7/gnucash/report/report-utilities.scm /tmp/B.v8o6rdi5/BUILD/gnucash-5.7/build/share/guile/site/3.0/gnucash/report/report-utilities.scm make[2]: Leaving directory '/tmp/B.v8o6rdi5/BUILD/gnucash-5.7/build' /usr/bin/make -f gnucash/gschemas/CMakeFiles/org.gnucash.GnuCash.deprecated.gschema.valid-target.dir/build.make gnucash/gschemas/CMakeFiles/org.gnucash.GnuCash.deprecated.gschema.valid-target.dir/depend make[2]: Entering directory '/tmp/B.v8o6rdi5/BUILD/gnucash-5.7/build' [ 13%] Generating ../../../share/guile/site/3.0/gnucash/reports/standard/lot-viewer.scm cd /tmp/B.v8o6rdi5/BUILD/gnucash-5.7/build/gnucash/report/reports && /usr/bin/cmake -E create_symlink /tmp/B.v8o6rdi5/BUILD/gnucash-5.7/gnucash/report/reports/standard/lot-viewer.scm /tmp/B.v8o6rdi5/BUILD/gnucash-5.7/build/share/guile/site/3.0/gnucash/reports/standard/lot-viewer.scm make[2]: Leaving directory '/tmp/B.v8o6rdi5/BUILD/gnucash-5.7/build' make[2]: Entering directory '/tmp/B.v8o6rdi5/BUILD/gnucash-5.7/build' [ 14%] Generating ../../share/guile/site/3.0/gnucash/report/report-register-hooks.scm cd /tmp/B.v8o6rdi5/BUILD/gnucash-5.7/build/gnucash/report && /usr/bin/cmake -E create_symlink /tmp/B.v8o6rdi5/BUILD/gnucash-5.7/gnucash/report/report-register-hooks.scm /tmp/B.v8o6rdi5/BUILD/gnucash-5.7/build/share/guile/site/3.0/gnucash/report/report-register-hooks.scm make[2]: Leaving directory '/tmp/B.v8o6rdi5/BUILD/gnucash-5.7/build' make[2]: Entering directory '/tmp/B.v8o6rdi5/BUILD/gnucash-5.7/build' cd /tmp/B.v8o6rdi5/BUILD/gnucash-5.7/build && /usr/bin/cmake -E cmake_depends "Unix Makefiles" /tmp/B.v8o6rdi5/BUILD/gnucash-5.7 /tmp/B.v8o6rdi5/BUILD/gnucash-5.7/gnucash/import-export/ofx/gschemas /tmp/B.v8o6rdi5/BUILD/gnucash-5.7/build /tmp/B.v8o6rdi5/BUILD/gnucash-5.7/build/gnucash/import-export/ofx/gschemas /tmp/B.v8o6rdi5/BUILD/gnucash-5.7/build/gnucash/import-export/ofx/gschemas/CMakeFiles/org.gnucash.GnuCash.dialogs.import.ofx.gschema.valid-target.dir/DependInfo.cmake "--color=" make[2]: Leaving directory '/tmp/B.v8o6rdi5/BUILD/gnucash-5.7/build' make[2]: Entering directory '/tmp/B.v8o6rdi5/BUILD/gnucash-5.7/build' /usr/bin/make -f gnucash/import-export/ofx/gschemas/CMakeFiles/org.gnucash.GnuCash.dialogs.import.ofx.gschema.valid-target.dir/build.make gnucash/import-export/ofx/gschemas/CMakeFiles/org.gnucash.GnuCash.dialogs.import.ofx.gschema.valid-target.dir/build [ 16%] Generating ../../../share/guile/site/3.0/gnucash/reports/standard/net-charts.scm cd /tmp/B.v8o6rdi5/BUILD/gnucash-5.7/build/gnucash/report/reports && /usr/bin/cmake -E create_symlink /tmp/B.v8o6rdi5/BUILD/gnucash-5.7/gnucash/report/reports/standard/net-charts.scm /tmp/B.v8o6rdi5/BUILD/gnucash-5.7/build/share/guile/site/3.0/gnucash/reports/standard/net-charts.scm make[2]: Leaving directory '/tmp/B.v8o6rdi5/BUILD/gnucash-5.7/build' make[2]: Entering directory '/tmp/B.v8o6rdi5/BUILD/gnucash-5.7/build' [ 12%] Generating ../share/locale/it/LC_MESSAGES/gnucash.mo cd /tmp/B.v8o6rdi5/BUILD/gnucash-5.7/build/po && /usr/bin/msgfmt -o /tmp/B.v8o6rdi5/BUILD/gnucash-5.7/build/share/locale/it/LC_MESSAGES/gnucash.mo /tmp/B.v8o6rdi5/BUILD/gnucash-5.7/po/it.po make[2]: Leaving directory '/tmp/B.v8o6rdi5/BUILD/gnucash-5.7/build' make[2]: Entering directory '/tmp/B.v8o6rdi5/BUILD/gnucash-5.7/build' [ 16%] Generating ../../share/guile/site/3.0/gnucash/report/trep-engine.scm cd /tmp/B.v8o6rdi5/BUILD/gnucash-5.7/build/gnucash/report && /usr/bin/cmake -E create_symlink /tmp/B.v8o6rdi5/BUILD/gnucash-5.7/gnucash/report/trep-engine.scm /tmp/B.v8o6rdi5/BUILD/gnucash-5.7/build/share/guile/site/3.0/gnucash/report/trep-engine.scm make[2]: Leaving directory '/tmp/B.v8o6rdi5/BUILD/gnucash-5.7/build' make[2]: Entering directory '/tmp/B.v8o6rdi5/BUILD/gnucash-5.7/build' [ 16%] Generating ../../../share/guile/site/3.0/gnucash/reports/standard/portfolio.scm cd /tmp/B.v8o6rdi5/BUILD/gnucash-5.7/build/gnucash/report/reports && /usr/bin/cmake -E create_symlink /tmp/B.v8o6rdi5/BUILD/gnucash-5.7/gnucash/report/reports/standard/portfolio.scm /tmp/B.v8o6rdi5/BUILD/gnucash-5.7/build/share/guile/site/3.0/gnucash/reports/standard/portfolio.scm /usr/bin/make -f gnucash/gschemas/CMakeFiles/org.gnucash.GnuCash.dialogs.business.gschema.valid-target.dir/build.make gnucash/gschemas/CMakeFiles/org.gnucash.GnuCash.dialogs.business.gschema.valid-target.dir/depend make[2]: Leaving directory '/tmp/B.v8o6rdi5/BUILD/gnucash-5.7/build' make[2]: Entering directory '/tmp/B.v8o6rdi5/BUILD/gnucash-5.7/build' [ 16%] Generating org.gnucash.GnuCash.dialogs.import.hbci.gschema.valid cd /tmp/B.v8o6rdi5/BUILD/gnucash-5.7/build/gnucash/import-export/aqb/gschemas && /usr/bin/glib-compile-schemas --strict --dry-run --schema-file=/tmp/B.v8o6rdi5/BUILD/gnucash-5.7/build/share/glib-2.0/schemas/org.gnucash.GnuCash.dialogs.import.hbci.gschema.xml cd /tmp/B.v8o6rdi5/BUILD/gnucash-5.7/build/gnucash/import-export/aqb/gschemas && /usr/bin/cmake -E touch /tmp/B.v8o6rdi5/BUILD/gnucash-5.7/build/gnucash/import-export/aqb/gschemas/org.gnucash.GnuCash.dialogs.import.hbci.gschema.valid make[2]: Leaving directory '/tmp/B.v8o6rdi5/BUILD/gnucash-5.7/build' make[2]: Entering directory '/tmp/B.v8o6rdi5/BUILD/gnucash-5.7/build' [ 12%] Generating ../share/locale/ja/LC_MESSAGES/gnucash.mo cd /tmp/B.v8o6rdi5/BUILD/gnucash-5.7/build/po && /usr/bin/msgfmt -o /tmp/B.v8o6rdi5/BUILD/gnucash-5.7/build/share/locale/ja/LC_MESSAGES/gnucash.mo /tmp/B.v8o6rdi5/BUILD/gnucash-5.7/po/ja.po make[2]: Leaving directory '/tmp/B.v8o6rdi5/BUILD/gnucash-5.7/build' make[2]: Entering directory '/tmp/B.v8o6rdi5/BUILD/gnucash-5.7/build' cd /tmp/B.v8o6rdi5/BUILD/gnucash-5.7/build && /usr/bin/cmake -E cmake_depends "Unix Makefiles" /tmp/B.v8o6rdi5/BUILD/gnucash-5.7 /tmp/B.v8o6rdi5/BUILD/gnucash-5.7/gnucash/gschemas /tmp/B.v8o6rdi5/BUILD/gnucash-5.7/build /tmp/B.v8o6rdi5/BUILD/gnucash-5.7/build/gnucash/gschemas /tmp/B.v8o6rdi5/BUILD/gnucash-5.7/build/gnucash/gschemas/CMakeFiles/org.gnucash.GnuCash.deprecated.gschema.valid-target.dir/DependInfo.cmake "--color=" make[2]: Leaving directory '/tmp/B.v8o6rdi5/BUILD/gnucash-5.7/build' /usr/bin/make -f gnucash/gschemas/CMakeFiles/org.gnucash.GnuCash.deprecated.gschema.valid-target.dir/build.make gnucash/gschemas/CMakeFiles/org.gnucash.GnuCash.deprecated.gschema.valid-target.dir/build make[2]: Entering directory '/tmp/B.v8o6rdi5/BUILD/gnucash-5.7/build' [ 17%] Generating ../../../share/guile/site/3.0/gnucash/reports/standard/price-scatter.scm cd /tmp/B.v8o6rdi5/BUILD/gnucash-5.7/build/gnucash/report/reports && /usr/bin/cmake -E create_symlink /tmp/B.v8o6rdi5/BUILD/gnucash-5.7/gnucash/report/reports/standard/price-scatter.scm /tmp/B.v8o6rdi5/BUILD/gnucash-5.7/build/share/guile/site/3.0/gnucash/reports/standard/price-scatter.scm make[2]: Leaving directory '/tmp/B.v8o6rdi5/BUILD/gnucash-5.7/build' make[2]: Entering directory '/tmp/B.v8o6rdi5/BUILD/gnucash-5.7/build' [ 16%] Generating org.gnucash.GnuCash.dialogs.flicker.gschema.valid cd /tmp/B.v8o6rdi5/BUILD/gnucash-5.7/build/gnucash/import-export/aqb/gschemas && /usr/bin/glib-compile-schemas --strict --dry-run --schema-file=/tmp/B.v8o6rdi5/BUILD/gnucash-5.7/build/share/glib-2.0/schemas/org.gnucash.GnuCash.dialogs.flicker.gschema.xml cd /tmp/B.v8o6rdi5/BUILD/gnucash-5.7/build/gnucash/import-export/aqb/gschemas && /usr/bin/cmake -E touch /tmp/B.v8o6rdi5/BUILD/gnucash-5.7/build/gnucash/import-export/aqb/gschemas/org.gnucash.GnuCash.dialogs.flicker.gschema.valid make[2]: Leaving directory '/tmp/B.v8o6rdi5/BUILD/gnucash-5.7/build' make[1]: Entering directory '/tmp/B.v8o6rdi5/BUILD/gnucash-5.7/build' [ 17%] Built target scm-report-1-links make[1]: Leaving directory '/tmp/B.v8o6rdi5/BUILD/gnucash-5.7/build' make[2]: Entering directory '/tmp/B.v8o6rdi5/BUILD/gnucash-5.7/build' cd /tmp/B.v8o6rdi5/BUILD/gnucash-5.7/build && /usr/bin/cmake -E cmake_depends "Unix Makefiles" /tmp/B.v8o6rdi5/BUILD/gnucash-5.7 /tmp/B.v8o6rdi5/BUILD/gnucash-5.7/gnucash/gschemas /tmp/B.v8o6rdi5/BUILD/gnucash-5.7/build /tmp/B.v8o6rdi5/BUILD/gnucash-5.7/build/gnucash/gschemas /tmp/B.v8o6rdi5/BUILD/gnucash-5.7/build/gnucash/gschemas/CMakeFiles/org.gnucash.GnuCash.dialogs.business.gschema.valid-target.dir/DependInfo.cmake "--color=" make[2]: Leaving directory '/tmp/B.v8o6rdi5/BUILD/gnucash-5.7/build' make[1]: Entering directory '/tmp/B.v8o6rdi5/BUILD/gnucash-5.7/build' [ 18%] Built target org.gnucash.GnuCash.dialogs.import.hbci.gschema.valid-target make[1]: Leaving directory '/tmp/B.v8o6rdi5/BUILD/gnucash-5.7/build' /usr/bin/make -f gnucash/gschemas/CMakeFiles/org.gnucash.GnuCash.dialogs.business.gschema.valid-target.dir/build.make gnucash/gschemas/CMakeFiles/org.gnucash.GnuCash.dialogs.business.gschema.valid-target.dir/build make[2]: Entering directory '/tmp/B.v8o6rdi5/BUILD/gnucash-5.7/build' [ 17%] Generating ../../../share/guile/site/3.0/gnucash/reports/standard/reconcile-report.scm cd /tmp/B.v8o6rdi5/BUILD/gnucash-5.7/build/gnucash/report/reports && /usr/bin/cmake -E create_symlink /tmp/B.v8o6rdi5/BUILD/gnucash-5.7/gnucash/report/reports/standard/reconcile-report.scm /tmp/B.v8o6rdi5/BUILD/gnucash-5.7/build/share/guile/site/3.0/gnucash/reports/standard/reconcile-report.scm make[2]: Leaving directory '/tmp/B.v8o6rdi5/BUILD/gnucash-5.7/build' make[2]: Entering directory '/tmp/B.v8o6rdi5/BUILD/gnucash-5.7/build' [ 12%] Generating ../share/locale/kn/LC_MESSAGES/gnucash.mo cd /tmp/B.v8o6rdi5/BUILD/gnucash-5.7/build/po && /usr/bin/msgfmt -o /tmp/B.v8o6rdi5/BUILD/gnucash-5.7/build/share/locale/kn/LC_MESSAGES/gnucash.mo /tmp/B.v8o6rdi5/BUILD/gnucash-5.7/po/kn.po make[2]: Leaving directory '/tmp/B.v8o6rdi5/BUILD/gnucash-5.7/build' make[2]: Entering directory '/tmp/B.v8o6rdi5/BUILD/gnucash-5.7/build' [ 18%] Generating org.gnucash.GnuCash.dialogs.import.ofx.gschema.valid cd /tmp/B.v8o6rdi5/BUILD/gnucash-5.7/build/gnucash/import-export/ofx/gschemas && /usr/bin/glib-compile-schemas --strict --dry-run --schema-file=/tmp/B.v8o6rdi5/BUILD/gnucash-5.7/build/share/glib-2.0/schemas/org.gnucash.GnuCash.dialogs.import.ofx.gschema.xml cd /tmp/B.v8o6rdi5/BUILD/gnucash-5.7/build/gnucash/import-export/ofx/gschemas && /usr/bin/cmake -E touch /tmp/B.v8o6rdi5/BUILD/gnucash-5.7/build/gnucash/import-export/ofx/gschemas/org.gnucash.GnuCash.dialogs.import.ofx.gschema.valid make[2]: Leaving directory '/tmp/B.v8o6rdi5/BUILD/gnucash-5.7/build' make[1]: Entering directory '/tmp/B.v8o6rdi5/BUILD/gnucash-5.7/build' [ 18%] Built target org.gnucash.GnuCash.dialogs.flicker.gschema.valid-target make[1]: Leaving directory '/tmp/B.v8o6rdi5/BUILD/gnucash-5.7/build' /usr/bin/make -f gnucash/gschemas/CMakeFiles/org.gnucash.GnuCash.dialogs.checkprinting.gschema.valid-target.dir/build.make gnucash/gschemas/CMakeFiles/org.gnucash.GnuCash.dialogs.checkprinting.gschema.valid-target.dir/depend make[2]: Entering directory '/tmp/B.v8o6rdi5/BUILD/gnucash-5.7/build' [ 18%] Generating ../../../share/guile/site/3.0/gnucash/reports/standard/transaction.scm cd /tmp/B.v8o6rdi5/BUILD/gnucash-5.7/build/gnucash/report/reports && /usr/bin/cmake -E create_symlink /tmp/B.v8o6rdi5/BUILD/gnucash-5.7/gnucash/report/reports/standard/transaction.scm /tmp/B.v8o6rdi5/BUILD/gnucash-5.7/build/share/guile/site/3.0/gnucash/reports/standard/transaction.scm make[2]: Leaving directory '/tmp/B.v8o6rdi5/BUILD/gnucash-5.7/build' /usr/bin/make -f gnucash/gschemas/CMakeFiles/org.gnucash.GnuCash.dialogs.commodities.gschema.valid-target.dir/build.make gnucash/gschemas/CMakeFiles/org.gnucash.GnuCash.dialogs.commodities.gschema.valid-target.dir/depend make[2]: Entering directory '/tmp/B.v8o6rdi5/BUILD/gnucash-5.7/build' [ 18%] Generating ../../../share/guile/site/3.0/gnucash/reports/standard/trial-balance.scm cd /tmp/B.v8o6rdi5/BUILD/gnucash-5.7/build/gnucash/report/reports && /usr/bin/cmake -E create_symlink /tmp/B.v8o6rdi5/BUILD/gnucash-5.7/gnucash/report/reports/standard/trial-balance.scm /tmp/B.v8o6rdi5/BUILD/gnucash-5.7/build/share/guile/site/3.0/gnucash/reports/standard/trial-balance.scm make[2]: Leaving directory '/tmp/B.v8o6rdi5/BUILD/gnucash-5.7/build' make[2]: Entering directory '/tmp/B.v8o6rdi5/BUILD/gnucash-5.7/build' [ 18%] Generating org.gnucash.GnuCash.deprecated.gschema.valid cd /tmp/B.v8o6rdi5/BUILD/gnucash-5.7/build/gnucash/gschemas && /usr/bin/glib-compile-schemas --strict --dry-run --schema-file=/tmp/B.v8o6rdi5/BUILD/gnucash-5.7/build/share/glib-2.0/schemas/org.gnucash.GnuCash.deprecated.gschema.xml cd /tmp/B.v8o6rdi5/BUILD/gnucash-5.7/build/gnucash/gschemas && /usr/bin/cmake -E touch /tmp/B.v8o6rdi5/BUILD/gnucash-5.7/build/gnucash/gschemas/org.gnucash.GnuCash.deprecated.gschema.valid make[2]: Leaving directory '/tmp/B.v8o6rdi5/BUILD/gnucash-5.7/build' /usr/bin/make -f gnucash/gschemas/CMakeFiles/org.gnucash.GnuCash.dialogs.export.csv.gschema.valid-target.dir/build.make gnucash/gschemas/CMakeFiles/org.gnucash.GnuCash.dialogs.export.csv.gschema.valid-target.dir/depend make[1]: Entering directory '/tmp/B.v8o6rdi5/BUILD/gnucash-5.7/build' [ 18%] Built target org.gnucash.GnuCash.dialogs.import.ofx.gschema.valid-target make[1]: Leaving directory '/tmp/B.v8o6rdi5/BUILD/gnucash-5.7/build' /usr/bin/make -f gnucash/gschemas/CMakeFiles/org.gnucash.GnuCash.dialogs.gschema.valid-target.dir/build.make gnucash/gschemas/CMakeFiles/org.gnucash.GnuCash.dialogs.gschema.valid-target.dir/depend make[2]: Entering directory '/tmp/B.v8o6rdi5/BUILD/gnucash-5.7/build' [ 18%] Generating ../../../share/guile/site/3.0/gnucash/reports/standard/txn-columns.scm cd /tmp/B.v8o6rdi5/BUILD/gnucash-5.7/build/gnucash/report/reports && /usr/bin/cmake -E create_symlink /tmp/B.v8o6rdi5/BUILD/gnucash-5.7/gnucash/report/reports/standard/txn-columns.scm /tmp/B.v8o6rdi5/BUILD/gnucash-5.7/build/share/guile/site/3.0/gnucash/reports/standard/txn-columns.scm make[2]: Leaving directory '/tmp/B.v8o6rdi5/BUILD/gnucash-5.7/build' make[2]: Entering directory '/tmp/B.v8o6rdi5/BUILD/gnucash-5.7/build' cd /tmp/B.v8o6rdi5/BUILD/gnucash-5.7/build && /usr/bin/cmake -E cmake_depends "Unix Makefiles" /tmp/B.v8o6rdi5/BUILD/gnucash-5.7 /tmp/B.v8o6rdi5/BUILD/gnucash-5.7/gnucash/gschemas /tmp/B.v8o6rdi5/BUILD/gnucash-5.7/build /tmp/B.v8o6rdi5/BUILD/gnucash-5.7/build/gnucash/gschemas /tmp/B.v8o6rdi5/BUILD/gnucash-5.7/build/gnucash/gschemas/CMakeFiles/org.gnucash.GnuCash.dialogs.checkprinting.gschema.valid-target.dir/DependInfo.cmake "--color=" make[2]: Leaving directory '/tmp/B.v8o6rdi5/BUILD/gnucash-5.7/build' make[2]: Entering directory '/tmp/B.v8o6rdi5/BUILD/gnucash-5.7/build' [ 18%] Generating org.gnucash.GnuCash.dialogs.business.gschema.valid cd /tmp/B.v8o6rdi5/BUILD/gnucash-5.7/build/gnucash/gschemas && /usr/bin/glib-compile-schemas --strict --dry-run --schema-file=/tmp/B.v8o6rdi5/BUILD/gnucash-5.7/build/share/glib-2.0/schemas/org.gnucash.GnuCash.dialogs.business.gschema.xml cd /tmp/B.v8o6rdi5/BUILD/gnucash-5.7/build/gnucash/gschemas && /usr/bin/cmake -E touch /tmp/B.v8o6rdi5/BUILD/gnucash-5.7/build/gnucash/gschemas/org.gnucash.GnuCash.dialogs.business.gschema.valid make[2]: Leaving directory '/tmp/B.v8o6rdi5/BUILD/gnucash-5.7/build' make[2]: Entering directory '/tmp/B.v8o6rdi5/BUILD/gnucash-5.7/build' cd /tmp/B.v8o6rdi5/BUILD/gnucash-5.7/build && /usr/bin/cmake -E cmake_depends "Unix Makefiles" /tmp/B.v8o6rdi5/BUILD/gnucash-5.7 /tmp/B.v8o6rdi5/BUILD/gnucash-5.7/gnucash/gschemas /tmp/B.v8o6rdi5/BUILD/gnucash-5.7/build /tmp/B.v8o6rdi5/BUILD/gnucash-5.7/build/gnucash/gschemas /tmp/B.v8o6rdi5/BUILD/gnucash-5.7/build/gnucash/gschemas/CMakeFiles/org.gnucash.GnuCash.dialogs.commodities.gschema.valid-target.dir/DependInfo.cmake "--color=" make[2]: Leaving directory '/tmp/B.v8o6rdi5/BUILD/gnucash-5.7/build' make[1]: Entering directory '/tmp/B.v8o6rdi5/BUILD/gnucash-5.7/build' [ 18%] Built target org.gnucash.GnuCash.deprecated.gschema.valid-target make[1]: Leaving directory '/tmp/B.v8o6rdi5/BUILD/gnucash-5.7/build' make[2]: Entering directory '/tmp/B.v8o6rdi5/BUILD/gnucash-5.7/build' [ 18%] Generating ../../../share/guile/site/3.0/gnucash/reports/standard/view-column.scm cd /tmp/B.v8o6rdi5/BUILD/gnucash-5.7/build/gnucash/report/reports && /usr/bin/cmake -E create_symlink /tmp/B.v8o6rdi5/BUILD/gnucash-5.7/gnucash/report/reports/standard/view-column.scm /tmp/B.v8o6rdi5/BUILD/gnucash-5.7/build/share/guile/site/3.0/gnucash/reports/standard/view-column.scm make[2]: Leaving directory '/tmp/B.v8o6rdi5/BUILD/gnucash-5.7/build' make[2]: Entering directory '/tmp/B.v8o6rdi5/BUILD/gnucash-5.7/build' [ 13%] Generating ../share/locale/lt/LC_MESSAGES/gnucash.mo cd /tmp/B.v8o6rdi5/BUILD/gnucash-5.7/build/po && /usr/bin/msgfmt -o /tmp/B.v8o6rdi5/BUILD/gnucash-5.7/build/share/locale/lt/LC_MESSAGES/gnucash.mo /tmp/B.v8o6rdi5/BUILD/gnucash-5.7/po/lt.po make[2]: Leaving directory '/tmp/B.v8o6rdi5/BUILD/gnucash-5.7/build' make[2]: Entering directory '/tmp/B.v8o6rdi5/BUILD/gnucash-5.7/build' cd /tmp/B.v8o6rdi5/BUILD/gnucash-5.7/build && /usr/bin/cmake -E cmake_depends "Unix Makefiles" /tmp/B.v8o6rdi5/BUILD/gnucash-5.7 /tmp/B.v8o6rdi5/BUILD/gnucash-5.7/gnucash/gschemas /tmp/B.v8o6rdi5/BUILD/gnucash-5.7/build /tmp/B.v8o6rdi5/BUILD/gnucash-5.7/build/gnucash/gschemas /tmp/B.v8o6rdi5/BUILD/gnucash-5.7/build/gnucash/gschemas/CMakeFiles/org.gnucash.GnuCash.dialogs.export.csv.gschema.valid-target.dir/DependInfo.cmake "--color=" make[2]: Leaving directory '/tmp/B.v8o6rdi5/BUILD/gnucash-5.7/build' make[2]: Entering directory '/tmp/B.v8o6rdi5/BUILD/gnucash-5.7/build' cd /tmp/B.v8o6rdi5/BUILD/gnucash-5.7/build && /usr/bin/cmake -E cmake_depends "Unix Makefiles" /tmp/B.v8o6rdi5/BUILD/gnucash-5.7 /tmp/B.v8o6rdi5/BUILD/gnucash-5.7/gnucash/gschemas /tmp/B.v8o6rdi5/BUILD/gnucash-5.7/build /tmp/B.v8o6rdi5/BUILD/gnucash-5.7/build/gnucash/gschemas /tmp/B.v8o6rdi5/BUILD/gnucash-5.7/build/gnucash/gschemas/CMakeFiles/org.gnucash.GnuCash.dialogs.gschema.valid-target.dir/DependInfo.cmake "--color=" make[2]: Leaving directory '/tmp/B.v8o6rdi5/BUILD/gnucash-5.7/build' make[2]: Entering directory '/tmp/B.v8o6rdi5/BUILD/gnucash-5.7/build' [ 13%] Generating ../share/locale/ko/LC_MESSAGES/gnucash.mo cd /tmp/B.v8o6rdi5/BUILD/gnucash-5.7/build/po && /usr/bin/msgfmt -o /tmp/B.v8o6rdi5/BUILD/gnucash-5.7/build/share/locale/ko/LC_MESSAGES/gnucash.mo /tmp/B.v8o6rdi5/BUILD/gnucash-5.7/po/ko.po make[2]: Leaving directory '/tmp/B.v8o6rdi5/BUILD/gnucash-5.7/build' /usr/bin/make -f gnucash/gschemas/CMakeFiles/org.gnucash.GnuCash.dialogs.checkprinting.gschema.valid-target.dir/build.make gnucash/gschemas/CMakeFiles/org.gnucash.GnuCash.dialogs.checkprinting.gschema.valid-target.dir/build make[2]: Entering directory '/tmp/B.v8o6rdi5/BUILD/gnucash-5.7/build' [ 13%] Generating ../share/locale/kok/LC_MESSAGES/gnucash.mo cd /tmp/B.v8o6rdi5/BUILD/gnucash-5.7/build/po && /usr/bin/msgfmt -o /tmp/B.v8o6rdi5/BUILD/gnucash-5.7/build/share/locale/kok/LC_MESSAGES/gnucash.mo /tmp/B.v8o6rdi5/BUILD/gnucash-5.7/po/kok.po make[2]: Leaving directory '/tmp/B.v8o6rdi5/BUILD/gnucash-5.7/build' /usr/bin/make -f gnucash/gschemas/CMakeFiles/org.gnucash.GnuCash.dialogs.commodities.gschema.valid-target.dir/build.make gnucash/gschemas/CMakeFiles/org.gnucash.GnuCash.dialogs.commodities.gschema.valid-target.dir/build /usr/bin/make -f gnucash/gschemas/CMakeFiles/org.gnucash.GnuCash.dialogs.export.csv.gschema.valid-target.dir/build.make gnucash/gschemas/CMakeFiles/org.gnucash.GnuCash.dialogs.export.csv.gschema.valid-target.dir/build /usr/bin/make -f gnucash/gschemas/CMakeFiles/org.gnucash.GnuCash.dialogs.gschema.valid-target.dir/build.make gnucash/gschemas/CMakeFiles/org.gnucash.GnuCash.dialogs.gschema.valid-target.dir/build make[2]: Entering directory '/tmp/B.v8o6rdi5/BUILD/gnucash-5.7/build' [ 13%] Generating ../share/locale/kok@latin/LC_MESSAGES/gnucash.mo cd /tmp/B.v8o6rdi5/BUILD/gnucash-5.7/build/po && /usr/bin/msgfmt -o /tmp/B.v8o6rdi5/BUILD/gnucash-5.7/build/share/locale/kok@latin/LC_MESSAGES/gnucash.mo /tmp/B.v8o6rdi5/BUILD/gnucash-5.7/po/kok@latin.po make[2]: Leaving directory '/tmp/B.v8o6rdi5/BUILD/gnucash-5.7/build' make[2]: Entering directory '/tmp/B.v8o6rdi5/BUILD/gnucash-5.7/build' [ 13%] Generating ../share/locale/ks/LC_MESSAGES/gnucash.mo cd /tmp/B.v8o6rdi5/BUILD/gnucash-5.7/build/po && /usr/bin/msgfmt -o /tmp/B.v8o6rdi5/BUILD/gnucash-5.7/build/share/locale/ks/LC_MESSAGES/gnucash.mo /tmp/B.v8o6rdi5/BUILD/gnucash-5.7/po/ks.po make[2]: Leaving directory '/tmp/B.v8o6rdi5/BUILD/gnucash-5.7/build' make[1]: Entering directory '/tmp/B.v8o6rdi5/BUILD/gnucash-5.7/build' [ 18%] Built target org.gnucash.GnuCash.dialogs.business.gschema.valid-target make[1]: Leaving directory '/tmp/B.v8o6rdi5/BUILD/gnucash-5.7/build' make[2]: Entering directory '/tmp/B.v8o6rdi5/BUILD/gnucash-5.7/build' [ 16%] Generating ../share/locale/mk/LC_MESSAGES/gnucash.mo cd /tmp/B.v8o6rdi5/BUILD/gnucash-5.7/build/po && /usr/bin/msgfmt -o /tmp/B.v8o6rdi5/BUILD/gnucash-5.7/build/share/locale/mk/LC_MESSAGES/gnucash.mo /tmp/B.v8o6rdi5/BUILD/gnucash-5.7/po/mk.po make[2]: Leaving directory '/tmp/B.v8o6rdi5/BUILD/gnucash-5.7/build' make[2]: Entering directory '/tmp/B.v8o6rdi5/BUILD/gnucash-5.7/build' [ 18%] Generating ../../../share/guile/site/3.0/gnucash/reports/standard/taxinvoice.scm cd /tmp/B.v8o6rdi5/BUILD/gnucash-5.7/build/gnucash/report/reports && /usr/bin/cmake -E create_symlink /tmp/B.v8o6rdi5/BUILD/gnucash-5.7/gnucash/report/reports/standard/taxinvoice.scm /tmp/B.v8o6rdi5/BUILD/gnucash-5.7/build/share/guile/site/3.0/gnucash/reports/standard/taxinvoice.scm make[2]: Leaving directory '/tmp/B.v8o6rdi5/BUILD/gnucash-5.7/build' make[2]: Entering directory '/tmp/B.v8o6rdi5/BUILD/gnucash-5.7/build' [ 18%] Generating ../../../share/guile/site/3.0/gnucash/reports/standard/receipt.scm cd /tmp/B.v8o6rdi5/BUILD/gnucash-5.7/build/gnucash/report/reports && /usr/bin/cmake -E create_symlink /tmp/B.v8o6rdi5/BUILD/gnucash-5.7/gnucash/report/reports/standard/receipt.scm /tmp/B.v8o6rdi5/BUILD/gnucash-5.7/build/share/guile/site/3.0/gnucash/reports/standard/receipt.scm make[2]: Leaving directory '/tmp/B.v8o6rdi5/BUILD/gnucash-5.7/build' make[2]: Entering directory '/tmp/B.v8o6rdi5/BUILD/gnucash-5.7/build' [ 18%] Generating ../../../share/guile/site/3.0/gnucash/reports/standard/invoice.scm cd /tmp/B.v8o6rdi5/BUILD/gnucash-5.7/build/gnucash/report/reports && /usr/bin/cmake -E create_symlink /tmp/B.v8o6rdi5/BUILD/gnucash-5.7/gnucash/report/reports/standard/invoice.scm /tmp/B.v8o6rdi5/BUILD/gnucash-5.7/build/share/guile/site/3.0/gnucash/reports/standard/invoice.scm make[2]: Leaving directory '/tmp/B.v8o6rdi5/BUILD/gnucash-5.7/build' make[2]: Entering directory '/tmp/B.v8o6rdi5/BUILD/gnucash-5.7/build' [ 13%] Generating ../share/locale/lv/LC_MESSAGES/gnucash.mo cd /tmp/B.v8o6rdi5/BUILD/gnucash-5.7/build/po && /usr/bin/msgfmt -o /tmp/B.v8o6rdi5/BUILD/gnucash-5.7/build/share/locale/lv/LC_MESSAGES/gnucash.mo /tmp/B.v8o6rdi5/BUILD/gnucash-5.7/po/lv.po make[2]: Leaving directory '/tmp/B.v8o6rdi5/BUILD/gnucash-5.7/build' /usr/bin/make -f gnucash/gschemas/CMakeFiles/org.gnucash.GnuCash.dialogs.import.csv.gschema.valid-target.dir/build.make gnucash/gschemas/CMakeFiles/org.gnucash.GnuCash.dialogs.import.csv.gschema.valid-target.dir/depend make[2]: Entering directory '/tmp/B.v8o6rdi5/BUILD/gnucash-5.7/build' [ 18%] Generating org.gnucash.GnuCash.dialogs.checkprinting.gschema.valid cd /tmp/B.v8o6rdi5/BUILD/gnucash-5.7/build/gnucash/gschemas && /usr/bin/glib-compile-schemas --strict --dry-run --schema-file=/tmp/B.v8o6rdi5/BUILD/gnucash-5.7/build/share/glib-2.0/schemas/org.gnucash.GnuCash.dialogs.checkprinting.gschema.xml cd /tmp/B.v8o6rdi5/BUILD/gnucash-5.7/build/gnucash/gschemas && /usr/bin/cmake -E touch /tmp/B.v8o6rdi5/BUILD/gnucash-5.7/build/gnucash/gschemas/org.gnucash.GnuCash.dialogs.checkprinting.gschema.valid make[2]: Leaving directory '/tmp/B.v8o6rdi5/BUILD/gnucash-5.7/build' make[2]: Entering directory '/tmp/B.v8o6rdi5/BUILD/gnucash-5.7/build' [ 18%] Generating org.gnucash.GnuCash.dialogs.gschema.valid cd /tmp/B.v8o6rdi5/BUILD/gnucash-5.7/build/gnucash/gschemas && /usr/bin/glib-compile-schemas --strict --dry-run --schema-file=/tmp/B.v8o6rdi5/BUILD/gnucash-5.7/build/share/glib-2.0/schemas/org.gnucash.GnuCash.dialogs.gschema.xml cd /tmp/B.v8o6rdi5/BUILD/gnucash-5.7/build/gnucash/gschemas && /usr/bin/cmake -E touch /tmp/B.v8o6rdi5/BUILD/gnucash-5.7/build/gnucash/gschemas/org.gnucash.GnuCash.dialogs.gschema.valid make[2]: Leaving directory '/tmp/B.v8o6rdi5/BUILD/gnucash-5.7/build' make[2]: Entering directory '/tmp/B.v8o6rdi5/BUILD/gnucash-5.7/build' [ 18%] Generating org.gnucash.GnuCash.dialogs.export.csv.gschema.valid cd /tmp/B.v8o6rdi5/BUILD/gnucash-5.7/build/gnucash/gschemas && /usr/bin/glib-compile-schemas --strict --dry-run --schema-file=/tmp/B.v8o6rdi5/BUILD/gnucash-5.7/build/share/glib-2.0/schemas/org.gnucash.GnuCash.dialogs.export.csv.gschema.xml cd /tmp/B.v8o6rdi5/BUILD/gnucash-5.7/build/gnucash/gschemas && /usr/bin/cmake -E touch /tmp/B.v8o6rdi5/BUILD/gnucash-5.7/build/gnucash/gschemas/org.gnucash.GnuCash.dialogs.export.csv.gschema.valid make[2]: Leaving directory '/tmp/B.v8o6rdi5/BUILD/gnucash-5.7/build' make[2]: Entering directory '/tmp/B.v8o6rdi5/BUILD/gnucash-5.7/build' [ 18%] Generating org.gnucash.GnuCash.dialogs.commodities.gschema.valid cd /tmp/B.v8o6rdi5/BUILD/gnucash-5.7/build/gnucash/gschemas && /usr/bin/glib-compile-schemas --strict --dry-run --schema-file=/tmp/B.v8o6rdi5/BUILD/gnucash-5.7/build/share/glib-2.0/schemas/org.gnucash.GnuCash.dialogs.commodities.gschema.xml cd /tmp/B.v8o6rdi5/BUILD/gnucash-5.7/build/gnucash/gschemas && /usr/bin/cmake -E touch /tmp/B.v8o6rdi5/BUILD/gnucash-5.7/build/gnucash/gschemas/org.gnucash.GnuCash.dialogs.commodities.gschema.valid make[2]: Leaving directory '/tmp/B.v8o6rdi5/BUILD/gnucash-5.7/build' make[2]: Entering directory '/tmp/B.v8o6rdi5/BUILD/gnucash-5.7/build' [ 18%] Generating ../../../share/guile/site/3.0/gnucash/reports/standard/balsheet-eg.scm cd /tmp/B.v8o6rdi5/BUILD/gnucash-5.7/build/gnucash/report/reports && /usr/bin/cmake -E create_symlink /tmp/B.v8o6rdi5/BUILD/gnucash-5.7/gnucash/report/reports/standard/balsheet-eg.scm /tmp/B.v8o6rdi5/BUILD/gnucash-5.7/build/share/guile/site/3.0/gnucash/reports/standard/balsheet-eg.scm make[2]: Leaving directory '/tmp/B.v8o6rdi5/BUILD/gnucash-5.7/build' make[1]: Entering directory '/tmp/B.v8o6rdi5/BUILD/gnucash-5.7/build' [ 20%] Built target org.gnucash.GnuCash.dialogs.export.csv.gschema.valid-target make[1]: Leaving directory '/tmp/B.v8o6rdi5/BUILD/gnucash-5.7/build' /usr/bin/make -f gnucash/gschemas/CMakeFiles/org.gnucash.GnuCash.dialogs.import.generic.gschema.valid-target.dir/build.make gnucash/gschemas/CMakeFiles/org.gnucash.GnuCash.dialogs.import.generic.gschema.valid-target.dir/depend make[1]: Entering directory '/tmp/B.v8o6rdi5/BUILD/gnucash-5.7/build' [ 20%] Built target org.gnucash.GnuCash.dialogs.gschema.valid-target make[1]: Leaving directory '/tmp/B.v8o6rdi5/BUILD/gnucash-5.7/build' make[2]: Entering directory '/tmp/B.v8o6rdi5/BUILD/gnucash-5.7/build' cd /tmp/B.v8o6rdi5/BUILD/gnucash-5.7/build && /usr/bin/cmake -E cmake_depends "Unix Makefiles" /tmp/B.v8o6rdi5/BUILD/gnucash-5.7 /tmp/B.v8o6rdi5/BUILD/gnucash-5.7/gnucash/gschemas /tmp/B.v8o6rdi5/BUILD/gnucash-5.7/build /tmp/B.v8o6rdi5/BUILD/gnucash-5.7/build/gnucash/gschemas /tmp/B.v8o6rdi5/BUILD/gnucash-5.7/build/gnucash/gschemas/CMakeFiles/org.gnucash.GnuCash.dialogs.import.csv.gschema.valid-target.dir/DependInfo.cmake "--color=" make[2]: Leaving directory '/tmp/B.v8o6rdi5/BUILD/gnucash-5.7/build' make[1]: Entering directory '/tmp/B.v8o6rdi5/BUILD/gnucash-5.7/build' [ 20%] Built target org.gnucash.GnuCash.dialogs.checkprinting.gschema.valid-target make[1]: Leaving directory '/tmp/B.v8o6rdi5/BUILD/gnucash-5.7/build' make[1]: Entering directory '/tmp/B.v8o6rdi5/BUILD/gnucash-5.7/build' [ 20%] Built target org.gnucash.GnuCash.dialogs.commodities.gschema.valid-target make[1]: Leaving directory '/tmp/B.v8o6rdi5/BUILD/gnucash-5.7/build' /usr/bin/make -f gnucash/gschemas/CMakeFiles/org.gnucash.GnuCash.dialogs.import.qif.gschema.valid-target.dir/build.make gnucash/gschemas/CMakeFiles/org.gnucash.GnuCash.dialogs.import.qif.gschema.valid-target.dir/depend /usr/bin/make -f gnucash/gschemas/CMakeFiles/org.gnucash.GnuCash.dialogs.import.csv.gschema.valid-target.dir/build.make gnucash/gschemas/CMakeFiles/org.gnucash.GnuCash.dialogs.import.csv.gschema.valid-target.dir/build make[1]: Entering directory '/tmp/B.v8o6rdi5/BUILD/gnucash-5.7/build' [ 20%] Built target scm-reports-standard-links make[1]: Leaving directory '/tmp/B.v8o6rdi5/BUILD/gnucash-5.7/build' /usr/bin/make -f gnucash/gschemas/CMakeFiles/org.gnucash.GnuCash.dialogs.reconcile.gschema.valid-target.dir/build.make gnucash/gschemas/CMakeFiles/org.gnucash.GnuCash.dialogs.reconcile.gschema.valid-target.dir/depend make[2]: Entering directory '/tmp/B.v8o6rdi5/BUILD/gnucash-5.7/build' [ 16%] Generating ../share/locale/mai/LC_MESSAGES/gnucash.mo cd /tmp/B.v8o6rdi5/BUILD/gnucash-5.7/build/po && /usr/bin/msgfmt -o /tmp/B.v8o6rdi5/BUILD/gnucash-5.7/build/share/locale/mai/LC_MESSAGES/gnucash.mo /tmp/B.v8o6rdi5/BUILD/gnucash-5.7/po/mai.po make[2]: Leaving directory '/tmp/B.v8o6rdi5/BUILD/gnucash-5.7/build' /usr/bin/make -f gnucash/gschemas/CMakeFiles/org.gnucash.GnuCash.dialogs.sxs.gschema.valid-target.dir/build.make gnucash/gschemas/CMakeFiles/org.gnucash.GnuCash.dialogs.sxs.gschema.valid-target.dir/depend make[2]: Entering directory '/tmp/B.v8o6rdi5/BUILD/gnucash-5.7/build' cd /tmp/B.v8o6rdi5/BUILD/gnucash-5.7/build && /usr/bin/cmake -E cmake_depends "Unix Makefiles" /tmp/B.v8o6rdi5/BUILD/gnucash-5.7 /tmp/B.v8o6rdi5/BUILD/gnucash-5.7/gnucash/gschemas /tmp/B.v8o6rdi5/BUILD/gnucash-5.7/build /tmp/B.v8o6rdi5/BUILD/gnucash-5.7/build/gnucash/gschemas /tmp/B.v8o6rdi5/BUILD/gnucash-5.7/build/gnucash/gschemas/CMakeFiles/org.gnucash.GnuCash.dialogs.import.generic.gschema.valid-target.dir/DependInfo.cmake "--color=" make[2]: Leaving directory '/tmp/B.v8o6rdi5/BUILD/gnucash-5.7/build' /usr/bin/make -f gnucash/gschemas/CMakeFiles/org.gnucash.GnuCash.dialogs.import.generic.gschema.valid-target.dir/build.make gnucash/gschemas/CMakeFiles/org.gnucash.GnuCash.dialogs.import.generic.gschema.valid-target.dir/build make[2]: Entering directory '/tmp/B.v8o6rdi5/BUILD/gnucash-5.7/build' cd /tmp/B.v8o6rdi5/BUILD/gnucash-5.7/build && /usr/bin/cmake -E cmake_depends "Unix Makefiles" /tmp/B.v8o6rdi5/BUILD/gnucash-5.7 /tmp/B.v8o6rdi5/BUILD/gnucash-5.7/gnucash/gschemas /tmp/B.v8o6rdi5/BUILD/gnucash-5.7/build /tmp/B.v8o6rdi5/BUILD/gnucash-5.7/build/gnucash/gschemas /tmp/B.v8o6rdi5/BUILD/gnucash-5.7/build/gnucash/gschemas/CMakeFiles/org.gnucash.GnuCash.dialogs.import.qif.gschema.valid-target.dir/DependInfo.cmake "--color=" make[2]: Leaving directory '/tmp/B.v8o6rdi5/BUILD/gnucash-5.7/build' /usr/bin/make -f gnucash/gschemas/CMakeFiles/org.gnucash.GnuCash.dialogs.import.qif.gschema.valid-target.dir/build.make gnucash/gschemas/CMakeFiles/org.gnucash.GnuCash.dialogs.import.qif.gschema.valid-target.dir/build make[2]: Entering directory '/tmp/B.v8o6rdi5/BUILD/gnucash-5.7/build' cd /tmp/B.v8o6rdi5/BUILD/gnucash-5.7/build && /usr/bin/cmake -E cmake_depends "Unix Makefiles" /tmp/B.v8o6rdi5/BUILD/gnucash-5.7 /tmp/B.v8o6rdi5/BUILD/gnucash-5.7/gnucash/gschemas /tmp/B.v8o6rdi5/BUILD/gnucash-5.7/build /tmp/B.v8o6rdi5/BUILD/gnucash-5.7/build/gnucash/gschemas /tmp/B.v8o6rdi5/BUILD/gnucash-5.7/build/gnucash/gschemas/CMakeFiles/org.gnucash.GnuCash.dialogs.reconcile.gschema.valid-target.dir/DependInfo.cmake "--color=" make[2]: Leaving directory '/tmp/B.v8o6rdi5/BUILD/gnucash-5.7/build' make[2]: Entering directory '/tmp/B.v8o6rdi5/BUILD/gnucash-5.7/build' [ 16%] Generating ../share/locale/mni/LC_MESSAGES/gnucash.mo cd /tmp/B.v8o6rdi5/BUILD/gnucash-5.7/build/po && /usr/bin/msgfmt -o /tmp/B.v8o6rdi5/BUILD/gnucash-5.7/build/share/locale/mni/LC_MESSAGES/gnucash.mo /tmp/B.v8o6rdi5/BUILD/gnucash-5.7/po/mni.po make[2]: Leaving directory '/tmp/B.v8o6rdi5/BUILD/gnucash-5.7/build' /usr/bin/make -f gnucash/gschemas/CMakeFiles/org.gnucash.GnuCash.dialogs.reconcile.gschema.valid-target.dir/build.make gnucash/gschemas/CMakeFiles/org.gnucash.GnuCash.dialogs.reconcile.gschema.valid-target.dir/build make[2]: Entering directory '/tmp/B.v8o6rdi5/BUILD/gnucash-5.7/build' cd /tmp/B.v8o6rdi5/BUILD/gnucash-5.7/build && /usr/bin/cmake -E cmake_depends "Unix Makefiles" /tmp/B.v8o6rdi5/BUILD/gnucash-5.7 /tmp/B.v8o6rdi5/BUILD/gnucash-5.7/gnucash/gschemas /tmp/B.v8o6rdi5/BUILD/gnucash-5.7/build /tmp/B.v8o6rdi5/BUILD/gnucash-5.7/build/gnucash/gschemas /tmp/B.v8o6rdi5/BUILD/gnucash-5.7/build/gnucash/gschemas/CMakeFiles/org.gnucash.GnuCash.dialogs.sxs.gschema.valid-target.dir/DependInfo.cmake "--color=" make[2]: Leaving directory '/tmp/B.v8o6rdi5/BUILD/gnucash-5.7/build' /usr/bin/make -f gnucash/gschemas/CMakeFiles/org.gnucash.GnuCash.dialogs.sxs.gschema.valid-target.dir/build.make gnucash/gschemas/CMakeFiles/org.gnucash.GnuCash.dialogs.sxs.gschema.valid-target.dir/build make[2]: Entering directory '/tmp/B.v8o6rdi5/BUILD/gnucash-5.7/build' [ 18%] Generating ../share/locale/nb/LC_MESSAGES/gnucash.mo cd /tmp/B.v8o6rdi5/BUILD/gnucash-5.7/build/po && /usr/bin/msgfmt -o /tmp/B.v8o6rdi5/BUILD/gnucash-5.7/build/share/locale/nb/LC_MESSAGES/gnucash.mo /tmp/B.v8o6rdi5/BUILD/gnucash-5.7/po/nb.po make[2]: Leaving directory '/tmp/B.v8o6rdi5/BUILD/gnucash-5.7/build' make[2]: Entering directory '/tmp/B.v8o6rdi5/BUILD/gnucash-5.7/build' [ 17%] Generating ../share/locale/mni@bengali/LC_MESSAGES/gnucash.mo cd /tmp/B.v8o6rdi5/BUILD/gnucash-5.7/build/po && /usr/bin/msgfmt -o /tmp/B.v8o6rdi5/BUILD/gnucash-5.7/build/share/locale/mni@bengali/LC_MESSAGES/gnucash.mo /tmp/B.v8o6rdi5/BUILD/gnucash-5.7/po/mni@bengali.po make[2]: Leaving directory '/tmp/B.v8o6rdi5/BUILD/gnucash-5.7/build' make[2]: Entering directory '/tmp/B.v8o6rdi5/BUILD/gnucash-5.7/build' [ 18%] Generating ../share/locale/ne/LC_MESSAGES/gnucash.mo cd /tmp/B.v8o6rdi5/BUILD/gnucash-5.7/build/po && /usr/bin/msgfmt -o /tmp/B.v8o6rdi5/BUILD/gnucash-5.7/build/share/locale/ne/LC_MESSAGES/gnucash.mo /tmp/B.v8o6rdi5/BUILD/gnucash-5.7/po/ne.po make[2]: Leaving directory '/tmp/B.v8o6rdi5/BUILD/gnucash-5.7/build' /usr/bin/make -f gnucash/gschemas/CMakeFiles/org.gnucash.GnuCash.dialogs.totd.gschema.valid-target.dir/build.make gnucash/gschemas/CMakeFiles/org.gnucash.GnuCash.dialogs.totd.gschema.valid-target.dir/depend make[2]: Entering directory '/tmp/B.v8o6rdi5/BUILD/gnucash-5.7/build' [ 20%] Generating org.gnucash.GnuCash.dialogs.import.csv.gschema.valid cd /tmp/B.v8o6rdi5/BUILD/gnucash-5.7/build/gnucash/gschemas && /usr/bin/glib-compile-schemas --strict --dry-run --schema-file=/tmp/B.v8o6rdi5/BUILD/gnucash-5.7/build/share/glib-2.0/schemas/org.gnucash.GnuCash.dialogs.import.csv.gschema.xml cd /tmp/B.v8o6rdi5/BUILD/gnucash-5.7/build/gnucash/gschemas && /usr/bin/cmake -E touch /tmp/B.v8o6rdi5/BUILD/gnucash-5.7/build/gnucash/gschemas/org.gnucash.GnuCash.dialogs.import.csv.gschema.valid make[2]: Leaving directory '/tmp/B.v8o6rdi5/BUILD/gnucash-5.7/build' make[2]: Entering directory '/tmp/B.v8o6rdi5/BUILD/gnucash-5.7/build' [ 17%] Generating ../share/locale/mr/LC_MESSAGES/gnucash.mo cd /tmp/B.v8o6rdi5/BUILD/gnucash-5.7/build/po && /usr/bin/msgfmt -o /tmp/B.v8o6rdi5/BUILD/gnucash-5.7/build/share/locale/mr/LC_MESSAGES/gnucash.mo /tmp/B.v8o6rdi5/BUILD/gnucash-5.7/po/mr.po make[2]: Leaving directory '/tmp/B.v8o6rdi5/BUILD/gnucash-5.7/build' make[2]: Entering directory '/tmp/B.v8o6rdi5/BUILD/gnucash-5.7/build' cd /tmp/B.v8o6rdi5/BUILD/gnucash-5.7/build && /usr/bin/cmake -E cmake_depends "Unix Makefiles" /tmp/B.v8o6rdi5/BUILD/gnucash-5.7 /tmp/B.v8o6rdi5/BUILD/gnucash-5.7/gnucash/gschemas /tmp/B.v8o6rdi5/BUILD/gnucash-5.7/build /tmp/B.v8o6rdi5/BUILD/gnucash-5.7/build/gnucash/gschemas /tmp/B.v8o6rdi5/BUILD/gnucash-5.7/build/gnucash/gschemas/CMakeFiles/org.gnucash.GnuCash.dialogs.totd.gschema.valid-target.dir/DependInfo.cmake "--color=" make[2]: Leaving directory '/tmp/B.v8o6rdi5/BUILD/gnucash-5.7/build' /usr/bin/make -f gnucash/gschemas/CMakeFiles/org.gnucash.GnuCash.dialogs.totd.gschema.valid-target.dir/build.make gnucash/gschemas/CMakeFiles/org.gnucash.GnuCash.dialogs.totd.gschema.valid-target.dir/build make[2]: Entering directory '/tmp/B.v8o6rdi5/BUILD/gnucash-5.7/build' [ 20%] Generating org.gnucash.GnuCash.dialogs.import.generic.gschema.valid cd /tmp/B.v8o6rdi5/BUILD/gnucash-5.7/build/gnucash/gschemas && /usr/bin/glib-compile-schemas --strict --dry-run --schema-file=/tmp/B.v8o6rdi5/BUILD/gnucash-5.7/build/share/glib-2.0/schemas/org.gnucash.GnuCash.dialogs.import.generic.gschema.xml cd /tmp/B.v8o6rdi5/BUILD/gnucash-5.7/build/gnucash/gschemas && /usr/bin/cmake -E touch /tmp/B.v8o6rdi5/BUILD/gnucash-5.7/build/gnucash/gschemas/org.gnucash.GnuCash.dialogs.import.generic.gschema.valid make[2]: Leaving directory '/tmp/B.v8o6rdi5/BUILD/gnucash-5.7/build' make[1]: Entering directory '/tmp/B.v8o6rdi5/BUILD/gnucash-5.7/build' [ 20%] Built target org.gnucash.GnuCash.dialogs.import.csv.gschema.valid-target make[1]: Leaving directory '/tmp/B.v8o6rdi5/BUILD/gnucash-5.7/build' make[2]: Entering directory '/tmp/B.v8o6rdi5/BUILD/gnucash-5.7/build' [ 20%] Generating org.gnucash.GnuCash.dialogs.import.qif.gschema.valid cd /tmp/B.v8o6rdi5/BUILD/gnucash-5.7/build/gnucash/gschemas && /usr/bin/glib-compile-schemas --strict --dry-run --schema-file=/tmp/B.v8o6rdi5/BUILD/gnucash-5.7/build/share/glib-2.0/schemas/org.gnucash.GnuCash.dialogs.import.qif.gschema.xml cd /tmp/B.v8o6rdi5/BUILD/gnucash-5.7/build/gnucash/gschemas && /usr/bin/cmake -E touch /tmp/B.v8o6rdi5/BUILD/gnucash-5.7/build/gnucash/gschemas/org.gnucash.GnuCash.dialogs.import.qif.gschema.valid make[2]: Leaving directory '/tmp/B.v8o6rdi5/BUILD/gnucash-5.7/build' make[2]: Entering directory '/tmp/B.v8o6rdi5/BUILD/gnucash-5.7/build' [ 18%] Generating ../share/locale/rw/LC_MESSAGES/gnucash.mo cd /tmp/B.v8o6rdi5/BUILD/gnucash-5.7/build/po && /usr/bin/msgfmt -o /tmp/B.v8o6rdi5/BUILD/gnucash-5.7/build/share/locale/rw/LC_MESSAGES/gnucash.mo /tmp/B.v8o6rdi5/BUILD/gnucash-5.7/po/rw.po make[2]: Leaving directory '/tmp/B.v8o6rdi5/BUILD/gnucash-5.7/build' /usr/bin/make -f gnucash/gschemas/CMakeFiles/org.gnucash.GnuCash.general.finance-quote.gschema.valid-target.dir/build.make gnucash/gschemas/CMakeFiles/org.gnucash.GnuCash.general.finance-quote.gschema.valid-target.dir/depend make[2]: Entering directory '/tmp/B.v8o6rdi5/BUILD/gnucash-5.7/build' [ 18%] Generating ../share/locale/pl/LC_MESSAGES/gnucash.mo cd /tmp/B.v8o6rdi5/BUILD/gnucash-5.7/build/po && /usr/bin/msgfmt -o /tmp/B.v8o6rdi5/BUILD/gnucash-5.7/build/share/locale/pl/LC_MESSAGES/gnucash.mo /tmp/B.v8o6rdi5/BUILD/gnucash-5.7/po/pl.po make[2]: Leaving directory '/tmp/B.v8o6rdi5/BUILD/gnucash-5.7/build' /usr/bin/make -f gnucash/gschemas/CMakeFiles/org.gnucash.GnuCash.gschema.valid-target.dir/build.make gnucash/gschemas/CMakeFiles/org.gnucash.GnuCash.gschema.valid-target.dir/depend make[2]: Entering directory '/tmp/B.v8o6rdi5/BUILD/gnucash-5.7/build' [ 18%] Generating ../share/locale/nl/LC_MESSAGES/gnucash.mo cd /tmp/B.v8o6rdi5/BUILD/gnucash-5.7/build/po && /usr/bin/msgfmt -o /tmp/B.v8o6rdi5/BUILD/gnucash-5.7/build/share/locale/nl/LC_MESSAGES/gnucash.mo /tmp/B.v8o6rdi5/BUILD/gnucash-5.7/po/nl.po make[2]: Leaving directory '/tmp/B.v8o6rdi5/BUILD/gnucash-5.7/build' /usr/bin/make -f gnucash/gschemas/CMakeFiles/org.gnucash.GnuCash.history.gschema.valid-target.dir/build.make gnucash/gschemas/CMakeFiles/org.gnucash.GnuCash.history.gschema.valid-target.dir/depend make[2]: Entering directory '/tmp/B.v8o6rdi5/BUILD/gnucash-5.7/build' [ 20%] Generating org.gnucash.GnuCash.dialogs.reconcile.gschema.valid cd /tmp/B.v8o6rdi5/BUILD/gnucash-5.7/build/gnucash/gschemas && /usr/bin/glib-compile-schemas --strict --dry-run --schema-file=/tmp/B.v8o6rdi5/BUILD/gnucash-5.7/build/share/glib-2.0/schemas/org.gnucash.GnuCash.dialogs.reconcile.gschema.xml cd /tmp/B.v8o6rdi5/BUILD/gnucash-5.7/build/gnucash/gschemas && /usr/bin/cmake -E touch /tmp/B.v8o6rdi5/BUILD/gnucash-5.7/build/gnucash/gschemas/org.gnucash.GnuCash.dialogs.reconcile.gschema.valid make[2]: Leaving directory '/tmp/B.v8o6rdi5/BUILD/gnucash-5.7/build' make[2]: Entering directory '/tmp/B.v8o6rdi5/BUILD/gnucash-5.7/build' [ 20%] Generating org.gnucash.GnuCash.dialogs.sxs.gschema.valid cd /tmp/B.v8o6rdi5/BUILD/gnucash-5.7/build/gnucash/gschemas && /usr/bin/glib-compile-schemas --strict --dry-run --schema-file=/tmp/B.v8o6rdi5/BUILD/gnucash-5.7/build/share/glib-2.0/schemas/org.gnucash.GnuCash.dialogs.sxs.gschema.xml cd /tmp/B.v8o6rdi5/BUILD/gnucash-5.7/build/gnucash/gschemas && /usr/bin/cmake -E touch /tmp/B.v8o6rdi5/BUILD/gnucash-5.7/build/gnucash/gschemas/org.gnucash.GnuCash.dialogs.sxs.gschema.valid make[2]: Leaving directory '/tmp/B.v8o6rdi5/BUILD/gnucash-5.7/build' make[2]: Entering directory '/tmp/B.v8o6rdi5/BUILD/gnucash-5.7/build' [ 18%] Generating ../share/locale/pt/LC_MESSAGES/gnucash.mo cd /tmp/B.v8o6rdi5/BUILD/gnucash-5.7/build/po && /usr/bin/msgfmt -o /tmp/B.v8o6rdi5/BUILD/gnucash-5.7/build/share/locale/pt/LC_MESSAGES/gnucash.mo /tmp/B.v8o6rdi5/BUILD/gnucash-5.7/po/pt.po make[2]: Leaving directory '/tmp/B.v8o6rdi5/BUILD/gnucash-5.7/build' /usr/bin/make -f gnucash/gschemas/CMakeFiles/org.gnucash.GnuCash.warnings.gschema.valid-target.dir/build.make gnucash/gschemas/CMakeFiles/org.gnucash.GnuCash.warnings.gschema.valid-target.dir/depend make[1]: Entering directory '/tmp/B.v8o6rdi5/BUILD/gnucash-5.7/build' [ 21%] Built target org.gnucash.GnuCash.dialogs.import.generic.gschema.valid-target make[1]: Leaving directory '/tmp/B.v8o6rdi5/BUILD/gnucash-5.7/build' /usr/bin/make -f gnucash/gschemas/CMakeFiles/org.gnucash.GnuCash.window.pages.account.tree.gschema.valid-target.dir/build.make gnucash/gschemas/CMakeFiles/org.gnucash.GnuCash.window.pages.account.tree.gschema.valid-target.dir/depend make[1]: Entering directory '/tmp/B.v8o6rdi5/BUILD/gnucash-5.7/build' [ 21%] Built target org.gnucash.GnuCash.dialogs.import.qif.gschema.valid-target make[1]: Leaving directory '/tmp/B.v8o6rdi5/BUILD/gnucash-5.7/build' /usr/bin/make -f bindings/guile/CMakeFiles/scm-expressions-links.dir/build.make bindings/guile/CMakeFiles/scm-expressions-links.dir/depend make[2]: Entering directory '/tmp/B.v8o6rdi5/BUILD/gnucash-5.7/build' cd /tmp/B.v8o6rdi5/BUILD/gnucash-5.7/build && /usr/bin/cmake -E cmake_depends "Unix Makefiles" /tmp/B.v8o6rdi5/BUILD/gnucash-5.7 /tmp/B.v8o6rdi5/BUILD/gnucash-5.7/gnucash/gschemas /tmp/B.v8o6rdi5/BUILD/gnucash-5.7/build /tmp/B.v8o6rdi5/BUILD/gnucash-5.7/build/gnucash/gschemas /tmp/B.v8o6rdi5/BUILD/gnucash-5.7/build/gnucash/gschemas/CMakeFiles/org.gnucash.GnuCash.general.finance-quote.gschema.valid-target.dir/DependInfo.cmake "--color=" make[2]: Leaving directory '/tmp/B.v8o6rdi5/BUILD/gnucash-5.7/build' make[2]: Entering directory '/tmp/B.v8o6rdi5/BUILD/gnucash-5.7/build' cd /tmp/B.v8o6rdi5/BUILD/gnucash-5.7/build && /usr/bin/cmake -E cmake_depends "Unix Makefiles" /tmp/B.v8o6rdi5/BUILD/gnucash-5.7 /tmp/B.v8o6rdi5/BUILD/gnucash-5.7/gnucash/gschemas /tmp/B.v8o6rdi5/BUILD/gnucash-5.7/build /tmp/B.v8o6rdi5/BUILD/gnucash-5.7/build/gnucash/gschemas /tmp/B.v8o6rdi5/BUILD/gnucash-5.7/build/gnucash/gschemas/CMakeFiles/org.gnucash.GnuCash.gschema.valid-target.dir/DependInfo.cmake "--color=" make[2]: Leaving directory '/tmp/B.v8o6rdi5/BUILD/gnucash-5.7/build' make[1]: Entering directory '/tmp/B.v8o6rdi5/BUILD/gnucash-5.7/build' [ 21%] Built target org.gnucash.GnuCash.dialogs.reconcile.gschema.valid-target make[1]: Leaving directory '/tmp/B.v8o6rdi5/BUILD/gnucash-5.7/build' make[2]: Entering directory '/tmp/B.v8o6rdi5/BUILD/gnucash-5.7/build' [ 18%] Generating ../share/locale/ro/LC_MESSAGES/gnucash.mo cd /tmp/B.v8o6rdi5/BUILD/gnucash-5.7/build/po && /usr/bin/msgfmt -o /tmp/B.v8o6rdi5/BUILD/gnucash-5.7/build/share/locale/ro/LC_MESSAGES/gnucash.mo /tmp/B.v8o6rdi5/BUILD/gnucash-5.7/po/ro.po make[2]: Leaving directory '/tmp/B.v8o6rdi5/BUILD/gnucash-5.7/build' make[2]: Entering directory '/tmp/B.v8o6rdi5/BUILD/gnucash-5.7/build' cd /tmp/B.v8o6rdi5/BUILD/gnucash-5.7/build && /usr/bin/cmake -E cmake_depends "Unix Makefiles" /tmp/B.v8o6rdi5/BUILD/gnucash-5.7 /tmp/B.v8o6rdi5/BUILD/gnucash-5.7/gnucash/gschemas /tmp/B.v8o6rdi5/BUILD/gnucash-5.7/build /tmp/B.v8o6rdi5/BUILD/gnucash-5.7/build/gnucash/gschemas /tmp/B.v8o6rdi5/BUILD/gnucash-5.7/build/gnucash/gschemas/CMakeFiles/org.gnucash.GnuCash.history.gschema.valid-target.dir/DependInfo.cmake "--color=" make[2]: Leaving directory '/tmp/B.v8o6rdi5/BUILD/gnucash-5.7/build' /usr/bin/make -f bindings/guile/test/CMakeFiles/scm-deprecated-gnucash-deprecated-module.dir/build.make bindings/guile/test/CMakeFiles/scm-deprecated-gnucash-deprecated-module.dir/depend /usr/bin/make -f gnucash/gschemas/CMakeFiles/org.gnucash.GnuCash.gschema.valid-target.dir/build.make gnucash/gschemas/CMakeFiles/org.gnucash.GnuCash.gschema.valid-target.dir/build /usr/bin/make -f gnucash/gschemas/CMakeFiles/org.gnucash.GnuCash.general.finance-quote.gschema.valid-target.dir/build.make gnucash/gschemas/CMakeFiles/org.gnucash.GnuCash.general.finance-quote.gschema.valid-target.dir/build /usr/bin/make -f gnucash/gschemas/CMakeFiles/org.gnucash.GnuCash.history.gschema.valid-target.dir/build.make gnucash/gschemas/CMakeFiles/org.gnucash.GnuCash.history.gschema.valid-target.dir/build make[1]: Entering directory '/tmp/B.v8o6rdi5/BUILD/gnucash-5.7/build' [ 21%] Built target org.gnucash.GnuCash.dialogs.sxs.gschema.valid-target make[1]: Leaving directory '/tmp/B.v8o6rdi5/BUILD/gnucash-5.7/build' /usr/bin/make -f bindings/python/CMakeFiles/swig-gnucash-core.dir/build.make bindings/python/CMakeFiles/swig-gnucash-core.dir/depend /usr/bin/make -f bindings/python/CMakeFiles/swig-core-utils-python.dir/build.make bindings/python/CMakeFiles/swig-core-utils-python.dir/depend make[2]: Entering directory '/tmp/B.v8o6rdi5/BUILD/gnucash-5.7/build' [ 21%] Generating org.gnucash.GnuCash.dialogs.totd.gschema.valid cd /tmp/B.v8o6rdi5/BUILD/gnucash-5.7/build/gnucash/gschemas && /usr/bin/glib-compile-schemas --strict --dry-run --schema-file=/tmp/B.v8o6rdi5/BUILD/gnucash-5.7/build/share/glib-2.0/schemas/org.gnucash.GnuCash.dialogs.totd.gschema.xml cd /tmp/B.v8o6rdi5/BUILD/gnucash-5.7/build/gnucash/gschemas && /usr/bin/cmake -E touch /tmp/B.v8o6rdi5/BUILD/gnucash-5.7/build/gnucash/gschemas/org.gnucash.GnuCash.dialogs.totd.gschema.valid make[2]: Leaving directory '/tmp/B.v8o6rdi5/BUILD/gnucash-5.7/build' make[2]: Entering directory '/tmp/B.v8o6rdi5/BUILD/gnucash-5.7/build' cd /tmp/B.v8o6rdi5/BUILD/gnucash-5.7/build && /usr/bin/cmake -E cmake_depends "Unix Makefiles" /tmp/B.v8o6rdi5/BUILD/gnucash-5.7 /tmp/B.v8o6rdi5/BUILD/gnucash-5.7/gnucash/gschemas /tmp/B.v8o6rdi5/BUILD/gnucash-5.7/build /tmp/B.v8o6rdi5/BUILD/gnucash-5.7/build/gnucash/gschemas /tmp/B.v8o6rdi5/BUILD/gnucash-5.7/build/gnucash/gschemas/CMakeFiles/org.gnucash.GnuCash.warnings.gschema.valid-target.dir/DependInfo.cmake "--color=" make[2]: Leaving directory '/tmp/B.v8o6rdi5/BUILD/gnucash-5.7/build' /usr/bin/make -f gnucash/gschemas/CMakeFiles/org.gnucash.GnuCash.warnings.gschema.valid-target.dir/build.make gnucash/gschemas/CMakeFiles/org.gnucash.GnuCash.warnings.gschema.valid-target.dir/build make[2]: Entering directory '/tmp/B.v8o6rdi5/BUILD/gnucash-5.7/build' [ 18%] Generating ../share/locale/pt_BR/LC_MESSAGES/gnucash.mo cd /tmp/B.v8o6rdi5/BUILD/gnucash-5.7/build/po && /usr/bin/msgfmt -o /tmp/B.v8o6rdi5/BUILD/gnucash-5.7/build/share/locale/pt_BR/LC_MESSAGES/gnucash.mo /tmp/B.v8o6rdi5/BUILD/gnucash-5.7/po/pt_BR.po make[2]: Leaving directory '/tmp/B.v8o6rdi5/BUILD/gnucash-5.7/build' /usr/bin/make -f bindings/python/CMakeFiles/swig-app-utils-python.dir/build.make bindings/python/CMakeFiles/swig-app-utils-python.dir/depend make[2]: Entering directory '/tmp/B.v8o6rdi5/BUILD/gnucash-5.7/build' cd /tmp/B.v8o6rdi5/BUILD/gnucash-5.7/build && /usr/bin/cmake -E cmake_depends "Unix Makefiles" /tmp/B.v8o6rdi5/BUILD/gnucash-5.7 /tmp/B.v8o6rdi5/BUILD/gnucash-5.7/gnucash/gschemas /tmp/B.v8o6rdi5/BUILD/gnucash-5.7/build /tmp/B.v8o6rdi5/BUILD/gnucash-5.7/build/gnucash/gschemas /tmp/B.v8o6rdi5/BUILD/gnucash-5.7/build/gnucash/gschemas/CMakeFiles/org.gnucash.GnuCash.window.pages.account.tree.gschema.valid-target.dir/DependInfo.cmake "--color=" make[2]: Leaving directory '/tmp/B.v8o6rdi5/BUILD/gnucash-5.7/build' /usr/bin/make -f gnucash/gschemas/CMakeFiles/org.gnucash.GnuCash.window.pages.account.tree.gschema.valid-target.dir/build.make gnucash/gschemas/CMakeFiles/org.gnucash.GnuCash.window.pages.account.tree.gschema.valid-target.dir/build make[2]: Entering directory '/tmp/B.v8o6rdi5/BUILD/gnucash-5.7/build' cd /tmp/B.v8o6rdi5/BUILD/gnucash-5.7/build && /usr/bin/cmake -E cmake_depends "Unix Makefiles" /tmp/B.v8o6rdi5/BUILD/gnucash-5.7 /tmp/B.v8o6rdi5/BUILD/gnucash-5.7/bindings/guile /tmp/B.v8o6rdi5/BUILD/gnucash-5.7/build /tmp/B.v8o6rdi5/BUILD/gnucash-5.7/build/bindings/guile /tmp/B.v8o6rdi5/BUILD/gnucash-5.7/build/bindings/guile/CMakeFiles/scm-expressions-links.dir/DependInfo.cmake "--color=" make[2]: Leaving directory '/tmp/B.v8o6rdi5/BUILD/gnucash-5.7/build' /usr/bin/make -f bindings/guile/CMakeFiles/scm-expressions-links.dir/build.make bindings/guile/CMakeFiles/scm-expressions-links.dir/build make[2]: Entering directory '/tmp/B.v8o6rdi5/BUILD/gnucash-5.7/build' cd /tmp/B.v8o6rdi5/BUILD/gnucash-5.7/build && /usr/bin/cmake -E cmake_depends "Unix Makefiles" /tmp/B.v8o6rdi5/BUILD/gnucash-5.7 /tmp/B.v8o6rdi5/BUILD/gnucash-5.7/bindings/python /tmp/B.v8o6rdi5/BUILD/gnucash-5.7/build /tmp/B.v8o6rdi5/BUILD/gnucash-5.7/build/bindings/python /tmp/B.v8o6rdi5/BUILD/gnucash-5.7/build/bindings/python/CMakeFiles/swig-gnucash-core.dir/DependInfo.cmake "--color=" make[2]: Leaving directory '/tmp/B.v8o6rdi5/BUILD/gnucash-5.7/build' make[2]: Entering directory '/tmp/B.v8o6rdi5/BUILD/gnucash-5.7/build' cd /tmp/B.v8o6rdi5/BUILD/gnucash-5.7/build && /usr/bin/cmake -E cmake_depends "Unix Makefiles" /tmp/B.v8o6rdi5/BUILD/gnucash-5.7 /tmp/B.v8o6rdi5/BUILD/gnucash-5.7/bindings/guile/test /tmp/B.v8o6rdi5/BUILD/gnucash-5.7/build /tmp/B.v8o6rdi5/BUILD/gnucash-5.7/build/bindings/guile/test /tmp/B.v8o6rdi5/BUILD/gnucash-5.7/build/bindings/guile/test/CMakeFiles/scm-deprecated-gnucash-deprecated-module.dir/DependInfo.cmake "--color=" make[2]: Leaving directory '/tmp/B.v8o6rdi5/BUILD/gnucash-5.7/build' /usr/bin/make -f bindings/python/CMakeFiles/swig-gnucash-core.dir/build.make bindings/python/CMakeFiles/swig-gnucash-core.dir/build make[1]: Entering directory '/tmp/B.v8o6rdi5/BUILD/gnucash-5.7/build' [ 21%] Built target org.gnucash.GnuCash.dialogs.totd.gschema.valid-target make[1]: Leaving directory '/tmp/B.v8o6rdi5/BUILD/gnucash-5.7/build' make[2]: Entering directory '/tmp/B.v8o6rdi5/BUILD/gnucash-5.7/build' [ 18%] Generating ../share/locale/sk/LC_MESSAGES/gnucash.mo cd /tmp/B.v8o6rdi5/BUILD/gnucash-5.7/build/po && /usr/bin/msgfmt -o /tmp/B.v8o6rdi5/BUILD/gnucash-5.7/build/share/locale/sk/LC_MESSAGES/gnucash.mo /tmp/B.v8o6rdi5/BUILD/gnucash-5.7/po/sk.po make[2]: Leaving directory '/tmp/B.v8o6rdi5/BUILD/gnucash-5.7/build' /usr/bin/make -f bindings/python/CMakeFiles/gnucash-core-c-py.dir/build.make bindings/python/CMakeFiles/gnucash-core-c-py.dir/depend /usr/bin/make -f bindings/guile/test/CMakeFiles/scm-deprecated-gnucash-deprecated-module.dir/build.make bindings/guile/test/CMakeFiles/scm-deprecated-gnucash-deprecated-module.dir/build /usr/bin/make -f bindings/python/CMakeFiles/sw-core-utils-py.dir/build.make bindings/python/CMakeFiles/sw-core-utils-py.dir/depend make[2]: Entering directory '/tmp/B.v8o6rdi5/BUILD/gnucash-5.7/build' cd /tmp/B.v8o6rdi5/BUILD/gnucash-5.7/build && /usr/bin/cmake -E cmake_depends "Unix Makefiles" /tmp/B.v8o6rdi5/BUILD/gnucash-5.7 /tmp/B.v8o6rdi5/BUILD/gnucash-5.7/bindings/python /tmp/B.v8o6rdi5/BUILD/gnucash-5.7/build /tmp/B.v8o6rdi5/BUILD/gnucash-5.7/build/bindings/python /tmp/B.v8o6rdi5/BUILD/gnucash-5.7/build/bindings/python/CMakeFiles/swig-core-utils-python.dir/DependInfo.cmake "--color=" make[2]: Leaving directory '/tmp/B.v8o6rdi5/BUILD/gnucash-5.7/build' /usr/bin/make -f bindings/python/CMakeFiles/swig-core-utils-python.dir/build.make bindings/python/CMakeFiles/swig-core-utils-python.dir/build make[2]: Entering directory '/tmp/B.v8o6rdi5/BUILD/gnucash-5.7/build' [ 18%] Generating ../share/locale/sv/LC_MESSAGES/gnucash.mo cd /tmp/B.v8o6rdi5/BUILD/gnucash-5.7/build/po && /usr/bin/msgfmt -o /tmp/B.v8o6rdi5/BUILD/gnucash-5.7/build/share/locale/sv/LC_MESSAGES/gnucash.mo /tmp/B.v8o6rdi5/BUILD/gnucash-5.7/po/sv.po make[2]: Leaving directory '/tmp/B.v8o6rdi5/BUILD/gnucash-5.7/build' /usr/bin/make -f bindings/python/CMakeFiles/sw-app-utils-py.dir/build.make bindings/python/CMakeFiles/sw-app-utils-py.dir/depend make[2]: Entering directory '/tmp/B.v8o6rdi5/BUILD/gnucash-5.7/build' cd /tmp/B.v8o6rdi5/BUILD/gnucash-5.7/build && /usr/bin/cmake -E cmake_depends "Unix Makefiles" /tmp/B.v8o6rdi5/BUILD/gnucash-5.7 /tmp/B.v8o6rdi5/BUILD/gnucash-5.7/bindings/python /tmp/B.v8o6rdi5/BUILD/gnucash-5.7/build /tmp/B.v8o6rdi5/BUILD/gnucash-5.7/build/bindings/python /tmp/B.v8o6rdi5/BUILD/gnucash-5.7/build/bindings/python/CMakeFiles/swig-app-utils-python.dir/DependInfo.cmake "--color=" make[2]: Leaving directory '/tmp/B.v8o6rdi5/BUILD/gnucash-5.7/build' /usr/bin/make -f bindings/python/CMakeFiles/swig-app-utils-python.dir/build.make bindings/python/CMakeFiles/swig-app-utils-python.dir/build make[2]: Entering directory '/tmp/B.v8o6rdi5/BUILD/gnucash-5.7/build' [ 21%] Generating org.gnucash.GnuCash.general.finance-quote.gschema.valid cd /tmp/B.v8o6rdi5/BUILD/gnucash-5.7/build/gnucash/gschemas && /usr/bin/glib-compile-schemas --strict --dry-run --schema-file=/tmp/B.v8o6rdi5/BUILD/gnucash-5.7/build/share/glib-2.0/schemas/org.gnucash.GnuCash.general.finance-quote.gschema.xml cd /tmp/B.v8o6rdi5/BUILD/gnucash-5.7/build/gnucash/gschemas && /usr/bin/cmake -E touch /tmp/B.v8o6rdi5/BUILD/gnucash-5.7/build/gnucash/gschemas/org.gnucash.GnuCash.general.finance-quote.gschema.valid make[2]: Leaving directory '/tmp/B.v8o6rdi5/BUILD/gnucash-5.7/build' make[2]: Entering directory '/tmp/B.v8o6rdi5/BUILD/gnucash-5.7/build' cd /tmp/B.v8o6rdi5/BUILD/gnucash-5.7/build && /usr/bin/cmake -E cmake_depends "Unix Makefiles" /tmp/B.v8o6rdi5/BUILD/gnucash-5.7 /tmp/B.v8o6rdi5/BUILD/gnucash-5.7/bindings/python /tmp/B.v8o6rdi5/BUILD/gnucash-5.7/build /tmp/B.v8o6rdi5/BUILD/gnucash-5.7/build/bindings/python /tmp/B.v8o6rdi5/BUILD/gnucash-5.7/build/bindings/python/CMakeFiles/gnucash-core-c-py.dir/DependInfo.cmake "--color=" make[2]: Leaving directory '/tmp/B.v8o6rdi5/BUILD/gnucash-5.7/build' /usr/bin/make -f bindings/python/CMakeFiles/gnucash-core-c-py.dir/build.make bindings/python/CMakeFiles/gnucash-core-c-py.dir/build make[2]: Entering directory '/tmp/B.v8o6rdi5/BUILD/gnucash-5.7/build' [ 21%] Generating org.gnucash.GnuCash.history.gschema.valid cd /tmp/B.v8o6rdi5/BUILD/gnucash-5.7/build/gnucash/gschemas && /usr/bin/glib-compile-schemas --strict --dry-run --schema-file=/tmp/B.v8o6rdi5/BUILD/gnucash-5.7/build/share/glib-2.0/schemas/org.gnucash.GnuCash.history.gschema.xml cd /tmp/B.v8o6rdi5/BUILD/gnucash-5.7/build/gnucash/gschemas && /usr/bin/cmake -E touch /tmp/B.v8o6rdi5/BUILD/gnucash-5.7/build/gnucash/gschemas/org.gnucash.GnuCash.history.gschema.valid make[2]: Leaving directory '/tmp/B.v8o6rdi5/BUILD/gnucash-5.7/build' make[2]: Entering directory '/tmp/B.v8o6rdi5/BUILD/gnucash-5.7/build' cd /tmp/B.v8o6rdi5/BUILD/gnucash-5.7/build && /usr/bin/cmake -E cmake_depends "Unix Makefiles" /tmp/B.v8o6rdi5/BUILD/gnucash-5.7 /tmp/B.v8o6rdi5/BUILD/gnucash-5.7/bindings/python /tmp/B.v8o6rdi5/BUILD/gnucash-5.7/build /tmp/B.v8o6rdi5/BUILD/gnucash-5.7/build/bindings/python /tmp/B.v8o6rdi5/BUILD/gnucash-5.7/build/bindings/python/CMakeFiles/sw-core-utils-py.dir/DependInfo.cmake "--color=" make[2]: Leaving directory '/tmp/B.v8o6rdi5/BUILD/gnucash-5.7/build' /usr/bin/make -f bindings/python/CMakeFiles/sw-core-utils-py.dir/build.make bindings/python/CMakeFiles/sw-core-utils-py.dir/build make[2]: Entering directory '/tmp/B.v8o6rdi5/BUILD/gnucash-5.7/build' cd /tmp/B.v8o6rdi5/BUILD/gnucash-5.7/build && /usr/bin/cmake -E cmake_depends "Unix Makefiles" /tmp/B.v8o6rdi5/BUILD/gnucash-5.7 /tmp/B.v8o6rdi5/BUILD/gnucash-5.7/bindings/python /tmp/B.v8o6rdi5/BUILD/gnucash-5.7/build /tmp/B.v8o6rdi5/BUILD/gnucash-5.7/build/bindings/python /tmp/B.v8o6rdi5/BUILD/gnucash-5.7/build/bindings/python/CMakeFiles/sw-app-utils-py.dir/DependInfo.cmake "--color=" make[2]: Leaving directory '/tmp/B.v8o6rdi5/BUILD/gnucash-5.7/build' make[2]: Entering directory '/tmp/B.v8o6rdi5/BUILD/gnucash-5.7/build' [ 21%] Generating org.gnucash.GnuCash.gschema.valid cd /tmp/B.v8o6rdi5/BUILD/gnucash-5.7/build/gnucash/gschemas && /usr/bin/glib-compile-schemas --strict --dry-run --schema-file=/tmp/B.v8o6rdi5/BUILD/gnucash-5.7/build/share/glib-2.0/schemas/org.gnucash.GnuCash.gschema.xml cd /tmp/B.v8o6rdi5/BUILD/gnucash-5.7/build/gnucash/gschemas && /usr/bin/cmake -E touch /tmp/B.v8o6rdi5/BUILD/gnucash-5.7/build/gnucash/gschemas/org.gnucash.GnuCash.gschema.valid make[2]: Leaving directory '/tmp/B.v8o6rdi5/BUILD/gnucash-5.7/build' make[2]: Entering directory '/tmp/B.v8o6rdi5/BUILD/gnucash-5.7/build' [ 20%] Generating ../share/locale/tr/LC_MESSAGES/gnucash.mo cd /tmp/B.v8o6rdi5/BUILD/gnucash-5.7/build/po && /usr/bin/msgfmt -o /tmp/B.v8o6rdi5/BUILD/gnucash-5.7/build/share/locale/tr/LC_MESSAGES/gnucash.mo /tmp/B.v8o6rdi5/BUILD/gnucash-5.7/po/tr.po make[2]: Leaving directory '/tmp/B.v8o6rdi5/BUILD/gnucash-5.7/build' make[2]: Entering directory '/tmp/B.v8o6rdi5/BUILD/gnucash-5.7/build' [ 21%] Generating org.gnucash.GnuCash.warnings.gschema.valid cd /tmp/B.v8o6rdi5/BUILD/gnucash-5.7/build/gnucash/gschemas && /usr/bin/glib-compile-schemas --strict --dry-run --schema-file=/tmp/B.v8o6rdi5/BUILD/gnucash-5.7/build/share/glib-2.0/schemas/org.gnucash.GnuCash.warnings.gschema.xml cd /tmp/B.v8o6rdi5/BUILD/gnucash-5.7/build/gnucash/gschemas && /usr/bin/cmake -E touch /tmp/B.v8o6rdi5/BUILD/gnucash-5.7/build/gnucash/gschemas/org.gnucash.GnuCash.warnings.gschema.valid make[2]: Leaving directory '/tmp/B.v8o6rdi5/BUILD/gnucash-5.7/build' /usr/bin/make -f bindings/python/CMakeFiles/sw-app-utils-py.dir/build.make bindings/python/CMakeFiles/sw-app-utils-py.dir/build make[2]: Entering directory '/tmp/B.v8o6rdi5/BUILD/gnucash-5.7/build' [ 21%] Generating ../../share/guile/site/3.0/gnucash/app-utils/fin.scm cd /tmp/B.v8o6rdi5/BUILD/gnucash-5.7/build/bindings/guile && /usr/bin/cmake -E create_symlink /tmp/B.v8o6rdi5/BUILD/gnucash-5.7/bindings/guile/fin.scm /tmp/B.v8o6rdi5/BUILD/gnucash-5.7/build/share/guile/site/3.0/gnucash/app-utils/fin.scm make[2]: Leaving directory '/tmp/B.v8o6rdi5/BUILD/gnucash-5.7/build' /usr/bin/make -f borrowed/guile-json/CMakeFiles/guile-json-details.dir/build.make borrowed/guile-json/CMakeFiles/guile-json-details.dir/depend make[1]: Entering directory '/tmp/B.v8o6rdi5/BUILD/gnucash-5.7/build' [ 22%] Built target org.gnucash.GnuCash.general.finance-quote.gschema.valid-target make[1]: Leaving directory '/tmp/B.v8o6rdi5/BUILD/gnucash-5.7/build' /usr/bin/make -f doc/CMakeFiles/gnucash-manpage.dir/build.make doc/CMakeFiles/gnucash-manpage.dir/depend make[2]: Entering directory '/tmp/B.v8o6rdi5/BUILD/gnucash-5.7/build' [ 21%] Generating org.gnucash.GnuCash.window.pages.account.tree.gschema.valid cd /tmp/B.v8o6rdi5/BUILD/gnucash-5.7/build/gnucash/gschemas && /usr/bin/glib-compile-schemas --strict --dry-run --schema-file=/tmp/B.v8o6rdi5/BUILD/gnucash-5.7/build/share/glib-2.0/schemas/org.gnucash.GnuCash.window.pages.account.tree.gschema.xml cd /tmp/B.v8o6rdi5/BUILD/gnucash-5.7/build/gnucash/gschemas && /usr/bin/cmake -E touch /tmp/B.v8o6rdi5/BUILD/gnucash-5.7/build/gnucash/gschemas/org.gnucash.GnuCash.window.pages.account.tree.gschema.valid make[2]: Leaving directory '/tmp/B.v8o6rdi5/BUILD/gnucash-5.7/build' make[1]: Entering directory '/tmp/B.v8o6rdi5/BUILD/gnucash-5.7/build' [ 22%] Built target org.gnucash.GnuCash.history.gschema.valid-target make[1]: Leaving directory '/tmp/B.v8o6rdi5/BUILD/gnucash-5.7/build' /usr/bin/make -f doc/CMakeFiles/gnucash-cli-manpage.dir/build.make doc/CMakeFiles/gnucash-cli-manpage.dir/depend make[2]: Entering directory '/tmp/B.v8o6rdi5/BUILD/gnucash-5.7/build' [ 20%] Generating ../share/locale/ru/LC_MESSAGES/gnucash.mo cd /tmp/B.v8o6rdi5/BUILD/gnucash-5.7/build/po && /usr/bin/msgfmt -o /tmp/B.v8o6rdi5/BUILD/gnucash-5.7/build/share/locale/ru/LC_MESSAGES/gnucash.mo /tmp/B.v8o6rdi5/BUILD/gnucash-5.7/po/ru.po make[2]: Leaving directory '/tmp/B.v8o6rdi5/BUILD/gnucash-5.7/build' /usr/bin/make -f libgnucash/core-utils/CMakeFiles/gnc-core-utils.dir/build.make libgnucash/core-utils/CMakeFiles/gnc-core-utils.dir/depend make[1]: Entering directory '/tmp/B.v8o6rdi5/BUILD/gnucash-5.7/build' [ 22%] Built target org.gnucash.GnuCash.gschema.valid-target make[1]: Leaving directory '/tmp/B.v8o6rdi5/BUILD/gnucash-5.7/build' make[1]: Entering directory '/tmp/B.v8o6rdi5/BUILD/gnucash-5.7/build' [ 22%] Built target org.gnucash.GnuCash.warnings.gschema.valid-target make[1]: Leaving directory '/tmp/B.v8o6rdi5/BUILD/gnucash-5.7/build' make[2]: Entering directory '/tmp/B.v8o6rdi5/BUILD/gnucash-5.7/build' [ 18%] Generating ../share/locale/sr/LC_MESSAGES/gnucash.mo cd /tmp/B.v8o6rdi5/BUILD/gnucash-5.7/build/po && /usr/bin/msgfmt -o /tmp/B.v8o6rdi5/BUILD/gnucash-5.7/build/share/locale/sr/LC_MESSAGES/gnucash.mo /tmp/B.v8o6rdi5/BUILD/gnucash-5.7/po/sr.po make[2]: Leaving directory '/tmp/B.v8o6rdi5/BUILD/gnucash-5.7/build' make[2]: Entering directory '/tmp/B.v8o6rdi5/BUILD/gnucash-5.7/build' cd /tmp/B.v8o6rdi5/BUILD/gnucash-5.7/build && /usr/bin/cmake -E cmake_depends "Unix Makefiles" /tmp/B.v8o6rdi5/BUILD/gnucash-5.7 /tmp/B.v8o6rdi5/BUILD/gnucash-5.7/borrowed/guile-json /tmp/B.v8o6rdi5/BUILD/gnucash-5.7/build /tmp/B.v8o6rdi5/BUILD/gnucash-5.7/build/borrowed/guile-json /tmp/B.v8o6rdi5/BUILD/gnucash-5.7/build/borrowed/guile-json/CMakeFiles/guile-json-details.dir/DependInfo.cmake "--color=" make[2]: Leaving directory '/tmp/B.v8o6rdi5/BUILD/gnucash-5.7/build' /usr/bin/make -f borrowed/guile-json/CMakeFiles/guile-json-details.dir/build.make borrowed/guile-json/CMakeFiles/guile-json-details.dir/build make[1]: Entering directory '/tmp/B.v8o6rdi5/BUILD/gnucash-5.7/build' [ 22%] Built target scm-expressions-links make[1]: Leaving directory '/tmp/B.v8o6rdi5/BUILD/gnucash-5.7/build' make[1]: Entering directory '/tmp/B.v8o6rdi5/BUILD/gnucash-5.7/build' [ 22%] Built target org.gnucash.GnuCash.window.pages.account.tree.gschema.valid-target make[1]: Leaving directory '/tmp/B.v8o6rdi5/BUILD/gnucash-5.7/build' make[2]: Entering directory '/tmp/B.v8o6rdi5/BUILD/gnucash-5.7/build' cd /tmp/B.v8o6rdi5/BUILD/gnucash-5.7/build && /usr/bin/cmake -E cmake_depends "Unix Makefiles" /tmp/B.v8o6rdi5/BUILD/gnucash-5.7 /tmp/B.v8o6rdi5/BUILD/gnucash-5.7/doc /tmp/B.v8o6rdi5/BUILD/gnucash-5.7/build /tmp/B.v8o6rdi5/BUILD/gnucash-5.7/build/doc /tmp/B.v8o6rdi5/BUILD/gnucash-5.7/build/doc/CMakeFiles/gnucash-manpage.dir/DependInfo.cmake "--color=" make[2]: Leaving directory '/tmp/B.v8o6rdi5/BUILD/gnucash-5.7/build' make[2]: Entering directory '/tmp/B.v8o6rdi5/BUILD/gnucash-5.7/build' cd /tmp/B.v8o6rdi5/BUILD/gnucash-5.7/build && /usr/bin/cmake -E cmake_depends "Unix Makefiles" /tmp/B.v8o6rdi5/BUILD/gnucash-5.7 /tmp/B.v8o6rdi5/BUILD/gnucash-5.7/doc /tmp/B.v8o6rdi5/BUILD/gnucash-5.7/build /tmp/B.v8o6rdi5/BUILD/gnucash-5.7/build/doc /tmp/B.v8o6rdi5/BUILD/gnucash-5.7/build/doc/CMakeFiles/gnucash-cli-manpage.dir/DependInfo.cmake "--color=" make[2]: Leaving directory '/tmp/B.v8o6rdi5/BUILD/gnucash-5.7/build' /usr/bin/make -f gnucash/gschemas/CMakeFiles/compiled-schemas.dir/build.make gnucash/gschemas/CMakeFiles/compiled-schemas.dir/depend /usr/bin/make -f doc/CMakeFiles/gnucash-manpage.dir/build.make doc/CMakeFiles/gnucash-manpage.dir/build make[2]: Entering directory '/tmp/B.v8o6rdi5/BUILD/gnucash-5.7/build' [ 20%] Generating ../share/locale/te/LC_MESSAGES/gnucash.mo cd /tmp/B.v8o6rdi5/BUILD/gnucash-5.7/build/po && /usr/bin/msgfmt -o /tmp/B.v8o6rdi5/BUILD/gnucash-5.7/build/share/locale/te/LC_MESSAGES/gnucash.mo /tmp/B.v8o6rdi5/BUILD/gnucash-5.7/po/te.po make[2]: Leaving directory '/tmp/B.v8o6rdi5/BUILD/gnucash-5.7/build' /usr/bin/make -f doc/CMakeFiles/gnucash-cli-manpage.dir/build.make doc/CMakeFiles/gnucash-cli-manpage.dir/build make[2]: Entering directory '/tmp/B.v8o6rdi5/BUILD/gnucash-5.7/build' [ 20%] Generating ../share/locale/vi/LC_MESSAGES/gnucash.mo cd /tmp/B.v8o6rdi5/BUILD/gnucash-5.7/build/po && /usr/bin/msgfmt -o /tmp/B.v8o6rdi5/BUILD/gnucash-5.7/build/share/locale/vi/LC_MESSAGES/gnucash.mo /tmp/B.v8o6rdi5/BUILD/gnucash-5.7/po/vi.po make[2]: Leaving directory '/tmp/B.v8o6rdi5/BUILD/gnucash-5.7/build' make[2]: Entering directory '/tmp/B.v8o6rdi5/BUILD/gnucash-5.7/build' cd /tmp/B.v8o6rdi5/BUILD/gnucash-5.7/build && /usr/bin/cmake -E cmake_depends "Unix Makefiles" /tmp/B.v8o6rdi5/BUILD/gnucash-5.7 /tmp/B.v8o6rdi5/BUILD/gnucash-5.7/libgnucash/core-utils /tmp/B.v8o6rdi5/BUILD/gnucash-5.7/build /tmp/B.v8o6rdi5/BUILD/gnucash-5.7/build/libgnucash/core-utils /tmp/B.v8o6rdi5/BUILD/gnucash-5.7/build/libgnucash/core-utils/CMakeFiles/gnc-core-utils.dir/DependInfo.cmake "--color=" make[2]: Leaving directory '/tmp/B.v8o6rdi5/BUILD/gnucash-5.7/build' /usr/bin/make -f libgnucash/core-utils/CMakeFiles/gnc-core-utils.dir/build.make libgnucash/core-utils/CMakeFiles/gnc-core-utils.dir/build make[2]: Entering directory '/tmp/B.v8o6rdi5/BUILD/gnucash-5.7/build' cd /tmp/B.v8o6rdi5/BUILD/gnucash-5.7/build && /usr/bin/cmake -E cmake_depends "Unix Makefiles" /tmp/B.v8o6rdi5/BUILD/gnucash-5.7 /tmp/B.v8o6rdi5/BUILD/gnucash-5.7/gnucash/gschemas /tmp/B.v8o6rdi5/BUILD/gnucash-5.7/build /tmp/B.v8o6rdi5/BUILD/gnucash-5.7/build/gnucash/gschemas /tmp/B.v8o6rdi5/BUILD/gnucash-5.7/build/gnucash/gschemas/CMakeFiles/compiled-schemas.dir/DependInfo.cmake "--color=" make[2]: Leaving directory '/tmp/B.v8o6rdi5/BUILD/gnucash-5.7/build' make[2]: Entering directory '/tmp/B.v8o6rdi5/BUILD/gnucash-5.7/build' [ 20%] Generating ../share/locale/uk/LC_MESSAGES/gnucash.mo cd /tmp/B.v8o6rdi5/BUILD/gnucash-5.7/build/po && /usr/bin/msgfmt -o /tmp/B.v8o6rdi5/BUILD/gnucash-5.7/build/share/locale/uk/LC_MESSAGES/gnucash.mo /tmp/B.v8o6rdi5/BUILD/gnucash-5.7/po/uk.po make[2]: Leaving directory '/tmp/B.v8o6rdi5/BUILD/gnucash-5.7/build' /usr/bin/make -f gnucash/gschemas/CMakeFiles/compiled-schemas.dir/build.make gnucash/gschemas/CMakeFiles/compiled-schemas.dir/build make[2]: Entering directory '/tmp/B.v8o6rdi5/BUILD/gnucash-5.7/build' [ 20%] Generating ../share/locale/ur/LC_MESSAGES/gnucash.mo cd /tmp/B.v8o6rdi5/BUILD/gnucash-5.7/build/po && /usr/bin/msgfmt -o /tmp/B.v8o6rdi5/BUILD/gnucash-5.7/build/share/locale/ur/LC_MESSAGES/gnucash.mo /tmp/B.v8o6rdi5/BUILD/gnucash-5.7/po/ur.po make[2]: Leaving directory '/tmp/B.v8o6rdi5/BUILD/gnucash-5.7/build' make[2]: Entering directory '/tmp/B.v8o6rdi5/BUILD/gnucash-5.7/build' [ 22%] Generating ../share/gnucash/gnucash.1 cd /tmp/B.v8o6rdi5/BUILD/gnucash-5.7/build/doc && /usr/bin/cmake -D SRC=/tmp/B.v8o6rdi5/BUILD/gnucash-5.7/doc/gnucash.1.in -D DST=gnucash.1 -D VCS_INFO_FILE=/tmp/B.v8o6rdi5/BUILD/gnucash-5.7/build/libgnucash/core-utils/gnc-vcs-info.h -D DATADIR_BUILD=/tmp/B.v8o6rdi5/BUILD/gnucash-5.7/build/share -D SRC_DIR=/tmp/B.v8o6rdi5/BUILD/gnucash-5.7 -P /tmp/B.v8o6rdi5/BUILD/gnucash-5.7/cmake/configure-manpage.cmake make[2]: Leaving directory '/tmp/B.v8o6rdi5/BUILD/gnucash-5.7/build' make[2]: Entering directory '/tmp/B.v8o6rdi5/BUILD/gnucash-5.7/build' [ 22%] Generating ../share/gnucash/gnucash-cli.1 cd /tmp/B.v8o6rdi5/BUILD/gnucash-5.7/build/doc && /usr/bin/cmake -D SRC=/tmp/B.v8o6rdi5/BUILD/gnucash-5.7/doc/gnucash-cli.1.in -D DST=gnucash-cli.1 -D VCS_INFO_FILE=/tmp/B.v8o6rdi5/BUILD/gnucash-5.7/build/libgnucash/core-utils/gnc-vcs-info.h -D DATADIR_BUILD=/tmp/B.v8o6rdi5/BUILD/gnucash-5.7/build/share -D SRC_DIR=/tmp/B.v8o6rdi5/BUILD/gnucash-5.7 -P /tmp/B.v8o6rdi5/BUILD/gnucash-5.7/cmake/configure-manpage.cmake make[2]: Leaving directory '/tmp/B.v8o6rdi5/BUILD/gnucash-5.7/build' make[2]: Entering directory '/tmp/B.v8o6rdi5/BUILD/gnucash-5.7/build' [ 24%] Generating ../../share/glib-2.0/schemas/gschemas.compiled cd /tmp/B.v8o6rdi5/BUILD/gnucash-5.7/build/gnucash/gschemas && /usr/bin/glib-compile-schemas --strict /tmp/B.v8o6rdi5/BUILD/gnucash-5.7/build/share/glib-2.0/schemas make[2]: Leaving directory '/tmp/B.v8o6rdi5/BUILD/gnucash-5.7/build' make[1]: Entering directory '/tmp/B.v8o6rdi5/BUILD/gnucash-5.7/build' [ 24%] Built target gnucash-manpage make[1]: Leaving directory '/tmp/B.v8o6rdi5/BUILD/gnucash-5.7/build' make[2]: Entering directory '/tmp/B.v8o6rdi5/BUILD/gnucash-5.7/build' [ 20%] Generating ../share/locale/ta/LC_MESSAGES/gnucash.mo cd /tmp/B.v8o6rdi5/BUILD/gnucash-5.7/build/po && /usr/bin/msgfmt -o /tmp/B.v8o6rdi5/BUILD/gnucash-5.7/build/share/locale/ta/LC_MESSAGES/gnucash.mo /tmp/B.v8o6rdi5/BUILD/gnucash-5.7/po/ta.po make[2]: Leaving directory '/tmp/B.v8o6rdi5/BUILD/gnucash-5.7/build' make[1]: Entering directory '/tmp/B.v8o6rdi5/BUILD/gnucash-5.7/build' [ 24%] Built target gnucash-cli-manpage make[1]: Leaving directory '/tmp/B.v8o6rdi5/BUILD/gnucash-5.7/build' make[2]: Entering directory '/tmp/B.v8o6rdi5/BUILD/gnucash-5.7/build' [ 21%] Generating ../share/locale/zh_CN/LC_MESSAGES/gnucash.mo cd /tmp/B.v8o6rdi5/BUILD/gnucash-5.7/build/po && /usr/bin/msgfmt -o /tmp/B.v8o6rdi5/BUILD/gnucash-5.7/build/share/locale/zh_CN/LC_MESSAGES/gnucash.mo /tmp/B.v8o6rdi5/BUILD/gnucash-5.7/po/zh_CN.po make[2]: Leaving directory '/tmp/B.v8o6rdi5/BUILD/gnucash-5.7/build' make[1]: Entering directory '/tmp/B.v8o6rdi5/BUILD/gnucash-5.7/build' [ 25%] Built target compiled-schemas make[1]: Leaving directory '/tmp/B.v8o6rdi5/BUILD/gnucash-5.7/build' make[2]: Entering directory '/tmp/B.v8o6rdi5/BUILD/gnucash-5.7/build' [ 21%] Generating ../share/locale/zh_TW/LC_MESSAGES/gnucash.mo cd /tmp/B.v8o6rdi5/BUILD/gnucash-5.7/build/po && /usr/bin/msgfmt -o /tmp/B.v8o6rdi5/BUILD/gnucash-5.7/build/share/locale/zh_TW/LC_MESSAGES/gnucash.mo /tmp/B.v8o6rdi5/BUILD/gnucash-5.7/po/zh_TW.po make[2]: Leaving directory '/tmp/B.v8o6rdi5/BUILD/gnucash-5.7/build' make[2]: Entering directory '/tmp/B.v8o6rdi5/BUILD/gnucash-5.7/build' [ 22%] Generating ../../../libx32/guile/3.0/site-ccache/gnucash/deprecated/gnucash/deprecated-module.go cd /tmp/B.v8o6rdi5/BUILD/gnucash-5.7/build/bindings/guile/test && /usr/bin/cmake -E env LD_LIBRARY_PATH=/tmp/B.v8o6rdi5/BUILD/gnucash-5.7/build//libx32:/tmp/B.v8o6rdi5/BUILD/gnucash-5.7/build//libx32/gnucash:/home/users/builder/GNUstep/Library/Libraries:/usr/local/libx32:/usr/libx32 GNC_UNINSTALLED=YES GNC_BUILDDIR=/tmp/B.v8o6rdi5/BUILD/gnucash-5.7/build GUILE_LOAD_PATH=/tmp/B.v8o6rdi5/BUILD/gnucash-5.7/bindings/guile/test:/tmp/B.v8o6rdi5/BUILD/gnucash-5.7/build/bindings/guile/test:/tmp/B.v8o6rdi5/BUILD/gnucash-5.7/build/bindings/guile/test/deprecated:/tmp/B.v8o6rdi5/BUILD/gnucash-5.7/build/share/guile/site/3.0 GUILE_LOAD_COMPILED_PATH=/tmp/B.v8o6rdi5/BUILD/gnucash-5.7/build/bindings/guile/test:/tmp/B.v8o6rdi5/BUILD/gnucash-5.7/build/libx32/guile/3.0/site-ccache:/tmp/B.v8o6rdi5/BUILD/gnucash-5.7/build/libx32/guile/3.0/site-ccache/gnucash/deprecated GNC_MODULE_PATH=/tmp/B.v8o6rdi5/BUILD/gnucash-5.7/build//libx32:/tmp/B.v8o6rdi5/BUILD/gnucash-5.7/build//libx32/gnucash: /usr/bin/guile -e "(@@ (guild) main)" -s /usr/bin/guild compile -o /tmp/B.v8o6rdi5/BUILD/gnucash-5.7/build/libx32/guile/3.0/site-ccache/gnucash/deprecated/gnucash/deprecated-module.go /tmp/B.v8o6rdi5/BUILD/gnucash-5.7/build/bindings/guile/test/deprecated/deprecated-module.scm wrote `/tmp/B.v8o6rdi5/BUILD/gnucash-5.7/build/libx32/guile/3.0/site-ccache/gnucash/deprecated/gnucash/deprecated-module.go' make[2]: Leaving directory '/tmp/B.v8o6rdi5/BUILD/gnucash-5.7/build' make[1]: Entering directory '/tmp/B.v8o6rdi5/BUILD/gnucash-5.7/build' [ 25%] Built target po-gmo make[1]: Leaving directory '/tmp/B.v8o6rdi5/BUILD/gnucash-5.7/build' make[2]: Entering directory '/tmp/B.v8o6rdi5/BUILD/gnucash-5.7/build' [ 25%] Building C object libgnucash/core-utils/CMakeFiles/gnc-core-utils.dir/gnc-version.c.o cd /tmp/B.v8o6rdi5/BUILD/gnucash-5.7/build/libgnucash/core-utils && /usr/bin/x86_64-pld-linux-gnux32-gcc -DGLIB_VERSION_MAX_ALLOWED=GLIB_VERSION_2_56 -DGLIB_VERSION_MIN_REQUIRED=GLIB_VERSION_2_56 -DG_LOG_DOMAIN=\"gnc.core-utils\" -DHAVE_CONFIG_H -DHAVE_GUILE30 -D_GNU_SOURCE -Dgnc_core_utils_EXPORTS -I/tmp/B.v8o6rdi5/BUILD/gnucash-5.7/common -I/tmp/B.v8o6rdi5/BUILD/gnucash-5.7/build/common -I/tmp/B.v8o6rdi5/BUILD/gnucash-5.7/build/libgnucash/core-utils -I/tmp/B.v8o6rdi5/BUILD/gnucash-5.7/libgnucash/core-utils -isystem /usr/include/glib-2.0 -isystem /usr/libx32/glib-2.0/include -Werror -Wall -Wmissing-prototypes -Wmissing-declarations -O2 -fwrapv -pipe -Wformat -Werror=format-security -gdwarf-4 -fno-debug-types-section -fvar-tracking-assignments -g2 -Wp,-D_FORTIFY_SOURCE=2 -fstack-protector-strong --param=ssp-buffer-size=4 -Werror=trampolines -fPIC -mtune=generic -march=x86-64 -gdwarf-4 -fno-debug-types-section -fvar-tracking-assignments -g2 -DNDEBUG -DQT_NO_DEBUG -std=gnu11 -fPIC -MD -MT libgnucash/core-utils/CMakeFiles/gnc-core-utils.dir/gnc-version.c.o -MF CMakeFiles/gnc-core-utils.dir/gnc-version.c.o.d -o CMakeFiles/gnc-core-utils.dir/gnc-version.c.o -c /tmp/B.v8o6rdi5/BUILD/gnucash-5.7/libgnucash/core-utils/gnc-version.c make[2]: Leaving directory '/tmp/B.v8o6rdi5/BUILD/gnucash-5.7/build' make[1]: Entering directory '/tmp/B.v8o6rdi5/BUILD/gnucash-5.7/build' [ 25%] Built target scm-deprecated-gnucash-deprecated-module make[1]: Leaving directory '/tmp/B.v8o6rdi5/BUILD/gnucash-5.7/build' make[2]: Entering directory '/tmp/B.v8o6rdi5/BUILD/gnucash-5.7/build' [ 22%] Generating swig-core-utils-python.c, sw_core_utils.py cd /tmp/B.v8o6rdi5/BUILD/gnucash-5.7/build/bindings/python && /usr/bin/swig -python -Wall -Werror -I/usr/include/glib-2.0 -I/usr/libx32/glib-2.0/include -I/usr/include -I/tmp/B.v8o6rdi5/BUILD/gnucash-5.7/common -I/tmp/B.v8o6rdi5/BUILD/gnucash-5.7/libgnucash/engine -I/tmp/B.v8o6rdi5/BUILD/gnucash-5.7/libgnucash/app-utils -I/tmp/B.v8o6rdi5/BUILD/gnucash-5.7/bindings -I/tmp/B.v8o6rdi5/BUILD/gnucash-5.7/bindings/python -I/tmp/B.v8o6rdi5/BUILD/gnucash-5.7/libgnucash/core-utils -o /tmp/B.v8o6rdi5/BUILD/gnucash-5.7/build/bindings/python/swig-core-utils-python.c /tmp/B.v8o6rdi5/BUILD/gnucash-5.7/bindings/core-utils.i make[2]: Leaving directory '/tmp/B.v8o6rdi5/BUILD/gnucash-5.7/build' make[2]: Entering directory '/tmp/B.v8o6rdi5/BUILD/gnucash-5.7/build' [ 22%] Generating swig-core-utils-python.c, sw_core_utils.py cd /tmp/B.v8o6rdi5/BUILD/gnucash-5.7/build/bindings/python && /usr/bin/swig -python -Wall -Werror -I/usr/include/glib-2.0 -I/usr/libx32/glib-2.0/include -I/usr/include -I/tmp/B.v8o6rdi5/BUILD/gnucash-5.7/common -I/tmp/B.v8o6rdi5/BUILD/gnucash-5.7/libgnucash/engine -I/tmp/B.v8o6rdi5/BUILD/gnucash-5.7/libgnucash/app-utils -I/tmp/B.v8o6rdi5/BUILD/gnucash-5.7/bindings -I/tmp/B.v8o6rdi5/BUILD/gnucash-5.7/bindings/python -I/tmp/B.v8o6rdi5/BUILD/gnucash-5.7/libgnucash/core-utils -o /tmp/B.v8o6rdi5/BUILD/gnucash-5.7/build/bindings/python/swig-core-utils-python.c /tmp/B.v8o6rdi5/BUILD/gnucash-5.7/bindings/core-utils.i make[2]: Leaving directory '/tmp/B.v8o6rdi5/BUILD/gnucash-5.7/build' make[2]: Entering directory '/tmp/B.v8o6rdi5/BUILD/gnucash-5.7/build' [ 22%] Building C object libgnucash/core-utils/CMakeFiles/gnc-core-utils.dir/binreloc.c.o cd /tmp/B.v8o6rdi5/BUILD/gnucash-5.7/build/libgnucash/core-utils && /usr/bin/x86_64-pld-linux-gnux32-gcc -DGLIB_VERSION_MAX_ALLOWED=GLIB_VERSION_2_56 -DGLIB_VERSION_MIN_REQUIRED=GLIB_VERSION_2_56 -DG_LOG_DOMAIN=\"gnc.core-utils\" -DHAVE_CONFIG_H -DHAVE_GUILE30 -D_GNU_SOURCE -Dgnc_core_utils_EXPORTS -I/tmp/B.v8o6rdi5/BUILD/gnucash-5.7/common -I/tmp/B.v8o6rdi5/BUILD/gnucash-5.7/build/common -I/tmp/B.v8o6rdi5/BUILD/gnucash-5.7/build/libgnucash/core-utils -I/tmp/B.v8o6rdi5/BUILD/gnucash-5.7/libgnucash/core-utils -isystem /usr/include/glib-2.0 -isystem /usr/libx32/glib-2.0/include -Werror -Wall -Wmissing-prototypes -Wmissing-declarations -O2 -fwrapv -pipe -Wformat -Werror=format-security -gdwarf-4 -fno-debug-types-section -fvar-tracking-assignments -g2 -Wp,-D_FORTIFY_SOURCE=2 -fstack-protector-strong --param=ssp-buffer-size=4 -Werror=trampolines -fPIC -mtune=generic -march=x86-64 -gdwarf-4 -fno-debug-types-section -fvar-tracking-assignments -g2 -DNDEBUG -DQT_NO_DEBUG -std=gnu11 -fPIC -MD -MT libgnucash/core-utils/CMakeFiles/gnc-core-utils.dir/binreloc.c.o -MF CMakeFiles/gnc-core-utils.dir/binreloc.c.o.d -o CMakeFiles/gnc-core-utils.dir/binreloc.c.o -c /tmp/B.v8o6rdi5/BUILD/gnucash-5.7/libgnucash/core-utils/binreloc.c make[2]: Leaving directory '/tmp/B.v8o6rdi5/BUILD/gnucash-5.7/build' make[2]: Entering directory '/tmp/B.v8o6rdi5/BUILD/gnucash-5.7/build' cd /tmp/B.v8o6rdi5/BUILD/gnucash-5.7/build/bindings/python && /usr/bin/cmake -E copy /tmp/B.v8o6rdi5/BUILD/gnucash-5.7/build/bindings/python/sw_core_utils.py /tmp/B.v8o6rdi5/BUILD/gnucash-5.7/build/libx32/python3.10/site-packages/gnucash make[2]: Leaving directory '/tmp/B.v8o6rdi5/BUILD/gnucash-5.7/build' make[2]: Entering directory '/tmp/B.v8o6rdi5/BUILD/gnucash-5.7/build' [ 22%] Building C object libgnucash/core-utils/CMakeFiles/gnc-core-utils.dir/gnc-prefs.c.o cd /tmp/B.v8o6rdi5/BUILD/gnucash-5.7/build/libgnucash/core-utils && /usr/bin/x86_64-pld-linux-gnux32-gcc -DGLIB_VERSION_MAX_ALLOWED=GLIB_VERSION_2_56 -DGLIB_VERSION_MIN_REQUIRED=GLIB_VERSION_2_56 -DG_LOG_DOMAIN=\"gnc.core-utils\" -DHAVE_CONFIG_H -DHAVE_GUILE30 -D_GNU_SOURCE -Dgnc_core_utils_EXPORTS -I/tmp/B.v8o6rdi5/BUILD/gnucash-5.7/common -I/tmp/B.v8o6rdi5/BUILD/gnucash-5.7/build/common -I/tmp/B.v8o6rdi5/BUILD/gnucash-5.7/build/libgnucash/core-utils -I/tmp/B.v8o6rdi5/BUILD/gnucash-5.7/libgnucash/core-utils -isystem /usr/include/glib-2.0 -isystem /usr/libx32/glib-2.0/include -Werror -Wall -Wmissing-prototypes -Wmissing-declarations -O2 -fwrapv -pipe -Wformat -Werror=format-security -gdwarf-4 -fno-debug-types-section -fvar-tracking-assignments -g2 -Wp,-D_FORTIFY_SOURCE=2 -fstack-protector-strong --param=ssp-buffer-size=4 -Werror=trampolines -fPIC -mtune=generic -march=x86-64 -gdwarf-4 -fno-debug-types-section -fvar-tracking-assignments -g2 -DNDEBUG -DQT_NO_DEBUG -std=gnu11 -fPIC -MD -MT libgnucash/core-utils/CMakeFiles/gnc-core-utils.dir/gnc-prefs.c.o -MF CMakeFiles/gnc-core-utils.dir/gnc-prefs.c.o.d -o CMakeFiles/gnc-core-utils.dir/gnc-prefs.c.o -c /tmp/B.v8o6rdi5/BUILD/gnucash-5.7/libgnucash/core-utils/gnc-prefs.c make[2]: Leaving directory '/tmp/B.v8o6rdi5/BUILD/gnucash-5.7/build' make[1]: Entering directory '/tmp/B.v8o6rdi5/BUILD/gnucash-5.7/build' [ 25%] Built target swig-core-utils-python make[1]: Leaving directory '/tmp/B.v8o6rdi5/BUILD/gnucash-5.7/build' make[2]: Entering directory '/tmp/B.v8o6rdi5/BUILD/gnucash-5.7/build' [ 24%] Building C object libgnucash/core-utils/CMakeFiles/gnc-core-utils.dir/gnc-path.c.o cd /tmp/B.v8o6rdi5/BUILD/gnucash-5.7/build/libgnucash/core-utils && /usr/bin/x86_64-pld-linux-gnux32-gcc -DGLIB_VERSION_MAX_ALLOWED=GLIB_VERSION_2_56 -DGLIB_VERSION_MIN_REQUIRED=GLIB_VERSION_2_56 -DG_LOG_DOMAIN=\"gnc.core-utils\" -DHAVE_CONFIG_H -DHAVE_GUILE30 -D_GNU_SOURCE -Dgnc_core_utils_EXPORTS -I/tmp/B.v8o6rdi5/BUILD/gnucash-5.7/common -I/tmp/B.v8o6rdi5/BUILD/gnucash-5.7/build/common -I/tmp/B.v8o6rdi5/BUILD/gnucash-5.7/build/libgnucash/core-utils -I/tmp/B.v8o6rdi5/BUILD/gnucash-5.7/libgnucash/core-utils -isystem /usr/include/glib-2.0 -isystem /usr/libx32/glib-2.0/include -Werror -Wall -Wmissing-prototypes -Wmissing-declarations -O2 -fwrapv -pipe -Wformat -Werror=format-security -gdwarf-4 -fno-debug-types-section -fvar-tracking-assignments -g2 -Wp,-D_FORTIFY_SOURCE=2 -fstack-protector-strong --param=ssp-buffer-size=4 -Werror=trampolines -fPIC -mtune=generic -march=x86-64 -gdwarf-4 -fno-debug-types-section -fvar-tracking-assignments -g2 -DNDEBUG -DQT_NO_DEBUG -std=gnu11 -fPIC -MD -MT libgnucash/core-utils/CMakeFiles/gnc-core-utils.dir/gnc-path.c.o -MF CMakeFiles/gnc-core-utils.dir/gnc-path.c.o.d -o CMakeFiles/gnc-core-utils.dir/gnc-path.c.o -c /tmp/B.v8o6rdi5/BUILD/gnucash-5.7/libgnucash/core-utils/gnc-path.c make[2]: Leaving directory '/tmp/B.v8o6rdi5/BUILD/gnucash-5.7/build' make[1]: Entering directory '/tmp/B.v8o6rdi5/BUILD/gnucash-5.7/build' [ 25%] Built target sw-core-utils-py make[1]: Leaving directory '/tmp/B.v8o6rdi5/BUILD/gnucash-5.7/build' make[2]: Entering directory '/tmp/B.v8o6rdi5/BUILD/gnucash-5.7/build' [ 22%] Building C object libgnucash/core-utils/CMakeFiles/gnc-core-utils.dir/gnc-gkeyfile-utils.c.o cd /tmp/B.v8o6rdi5/BUILD/gnucash-5.7/build/libgnucash/core-utils && /usr/bin/x86_64-pld-linux-gnux32-gcc -DGLIB_VERSION_MAX_ALLOWED=GLIB_VERSION_2_56 -DGLIB_VERSION_MIN_REQUIRED=GLIB_VERSION_2_56 -DG_LOG_DOMAIN=\"gnc.core-utils\" -DHAVE_CONFIG_H -DHAVE_GUILE30 -D_GNU_SOURCE -Dgnc_core_utils_EXPORTS -I/tmp/B.v8o6rdi5/BUILD/gnucash-5.7/common -I/tmp/B.v8o6rdi5/BUILD/gnucash-5.7/build/common -I/tmp/B.v8o6rdi5/BUILD/gnucash-5.7/build/libgnucash/core-utils -I/tmp/B.v8o6rdi5/BUILD/gnucash-5.7/libgnucash/core-utils -isystem /usr/include/glib-2.0 -isystem /usr/libx32/glib-2.0/include -Werror -Wall -Wmissing-prototypes -Wmissing-declarations -O2 -fwrapv -pipe -Wformat -Werror=format-security -gdwarf-4 -fno-debug-types-section -fvar-tracking-assignments -g2 -Wp,-D_FORTIFY_SOURCE=2 -fstack-protector-strong --param=ssp-buffer-size=4 -Werror=trampolines -fPIC -mtune=generic -march=x86-64 -gdwarf-4 -fno-debug-types-section -fvar-tracking-assignments -g2 -DNDEBUG -DQT_NO_DEBUG -std=gnu11 -fPIC -MD -MT libgnucash/core-utils/CMakeFiles/gnc-core-utils.dir/gnc-gkeyfile-utils.c.o -MF CMakeFiles/gnc-core-utils.dir/gnc-gkeyfile-utils.c.o.d -o CMakeFiles/gnc-core-utils.dir/gnc-gkeyfile-utils.c.o -c /tmp/B.v8o6rdi5/BUILD/gnucash-5.7/libgnucash/core-utils/gnc-gkeyfile-utils.c make[2]: Leaving directory '/tmp/B.v8o6rdi5/BUILD/gnucash-5.7/build' make[2]: Entering directory '/tmp/B.v8o6rdi5/BUILD/gnucash-5.7/build' [ 24%] Building C object libgnucash/core-utils/CMakeFiles/gnc-core-utils.dir/gnc-locale-utils.c.o cd /tmp/B.v8o6rdi5/BUILD/gnucash-5.7/build/libgnucash/core-utils && /usr/bin/x86_64-pld-linux-gnux32-gcc -DGLIB_VERSION_MAX_ALLOWED=GLIB_VERSION_2_56 -DGLIB_VERSION_MIN_REQUIRED=GLIB_VERSION_2_56 -DG_LOG_DOMAIN=\"gnc.core-utils\" -DHAVE_CONFIG_H -DHAVE_GUILE30 -D_GNU_SOURCE -Dgnc_core_utils_EXPORTS -I/tmp/B.v8o6rdi5/BUILD/gnucash-5.7/common -I/tmp/B.v8o6rdi5/BUILD/gnucash-5.7/build/common -I/tmp/B.v8o6rdi5/BUILD/gnucash-5.7/build/libgnucash/core-utils -I/tmp/B.v8o6rdi5/BUILD/gnucash-5.7/libgnucash/core-utils -isystem /usr/include/glib-2.0 -isystem /usr/libx32/glib-2.0/include -Werror -Wall -Wmissing-prototypes -Wmissing-declarations -O2 -fwrapv -pipe -Wformat -Werror=format-security -gdwarf-4 -fno-debug-types-section -fvar-tracking-assignments -g2 -Wp,-D_FORTIFY_SOURCE=2 -fstack-protector-strong --param=ssp-buffer-size=4 -Werror=trampolines -fPIC -mtune=generic -march=x86-64 -gdwarf-4 -fno-debug-types-section -fvar-tracking-assignments -g2 -DNDEBUG -DQT_NO_DEBUG -std=gnu11 -fPIC -MD -MT libgnucash/core-utils/CMakeFiles/gnc-core-utils.dir/gnc-locale-utils.c.o -MF CMakeFiles/gnc-core-utils.dir/gnc-locale-utils.c.o.d -o CMakeFiles/gnc-core-utils.dir/gnc-locale-utils.c.o -c /tmp/B.v8o6rdi5/BUILD/gnucash-5.7/libgnucash/core-utils/gnc-locale-utils.c make[2]: Leaving directory '/tmp/B.v8o6rdi5/BUILD/gnucash-5.7/build' make[2]: Entering directory '/tmp/B.v8o6rdi5/BUILD/gnucash-5.7/build' [ 22%] Building C object libgnucash/core-utils/CMakeFiles/gnc-core-utils.dir/gnc-environment.c.o cd /tmp/B.v8o6rdi5/BUILD/gnucash-5.7/build/libgnucash/core-utils && /usr/bin/x86_64-pld-linux-gnux32-gcc -DGLIB_VERSION_MAX_ALLOWED=GLIB_VERSION_2_56 -DGLIB_VERSION_MIN_REQUIRED=GLIB_VERSION_2_56 -DG_LOG_DOMAIN=\"gnc.core-utils\" -DHAVE_CONFIG_H -DHAVE_GUILE30 -D_GNU_SOURCE -Dgnc_core_utils_EXPORTS -I/tmp/B.v8o6rdi5/BUILD/gnucash-5.7/common -I/tmp/B.v8o6rdi5/BUILD/gnucash-5.7/build/common -I/tmp/B.v8o6rdi5/BUILD/gnucash-5.7/build/libgnucash/core-utils -I/tmp/B.v8o6rdi5/BUILD/gnucash-5.7/libgnucash/core-utils -isystem /usr/include/glib-2.0 -isystem /usr/libx32/glib-2.0/include -Werror -Wall -Wmissing-prototypes -Wmissing-declarations -O2 -fwrapv -pipe -Wformat -Werror=format-security -gdwarf-4 -fno-debug-types-section -fvar-tracking-assignments -g2 -Wp,-D_FORTIFY_SOURCE=2 -fstack-protector-strong --param=ssp-buffer-size=4 -Werror=trampolines -fPIC -mtune=generic -march=x86-64 -gdwarf-4 -fno-debug-types-section -fvar-tracking-assignments -g2 -DNDEBUG -DQT_NO_DEBUG -std=gnu11 -fPIC -MD -MT libgnucash/core-utils/CMakeFiles/gnc-core-utils.dir/gnc-environment.c.o -MF CMakeFiles/gnc-core-utils.dir/gnc-environment.c.o.d -o CMakeFiles/gnc-core-utils.dir/gnc-environment.c.o -c /tmp/B.v8o6rdi5/BUILD/gnucash-5.7/libgnucash/core-utils/gnc-environment.c make[2]: Leaving directory '/tmp/B.v8o6rdi5/BUILD/gnucash-5.7/build' make[2]: Entering directory '/tmp/B.v8o6rdi5/BUILD/gnucash-5.7/build' [ 1%] Building C object common/test-core/CMakeFiles/jenny.dir/__/__/borrowed/jenny/jenny.c.o cd /tmp/B.v8o6rdi5/BUILD/gnucash-5.7/build/common/test-core && /usr/bin/x86_64-pld-linux-gnux32-gcc -DHAVE_CONFIG_H -DHAVE_GUILE30 -D_GNU_SOURCE -I/tmp/B.v8o6rdi5/BUILD/gnucash-5.7/build/common -I/tmp/B.v8o6rdi5/BUILD/gnucash-5.7/common -I/tmp/B.v8o6rdi5/BUILD/gnucash-5.7/libgnucash/engine -I/tmp/B.v8o6rdi5/BUILD/gnucash-5.7/common/test-core -I/usr/include/guile/3.0 -Werror -Wall -Wmissing-prototypes -Wmissing-declarations -O2 -fwrapv -pipe -Wformat -Werror=format-security -gdwarf-4 -fno-debug-types-section -fvar-tracking-assignments -g2 -Wp,-D_FORTIFY_SOURCE=2 -fstack-protector-strong --param=ssp-buffer-size=4 -Werror=trampolines -fPIC -mtune=generic -march=x86-64 -gdwarf-4 -fno-debug-types-section -fvar-tracking-assignments -g2 -DNDEBUG -DQT_NO_DEBUG -std=gnu11 -MD -MT common/test-core/CMakeFiles/jenny.dir/__/__/borrowed/jenny/jenny.c.o -MF CMakeFiles/jenny.dir/__/__/borrowed/jenny/jenny.c.o.d -o CMakeFiles/jenny.dir/__/__/borrowed/jenny/jenny.c.o -c /tmp/B.v8o6rdi5/BUILD/gnucash-5.7/borrowed/jenny/jenny.c make[2]: Leaving directory '/tmp/B.v8o6rdi5/BUILD/gnucash-5.7/build' make[2]: Entering directory '/tmp/B.v8o6rdi5/BUILD/gnucash-5.7/build' [ 25%] Linking C executable ../../bin/jenny cd /tmp/B.v8o6rdi5/BUILD/gnucash-5.7/build/common/test-core && /usr/bin/cmake -E cmake_link_script CMakeFiles/jenny.dir/link.txt --verbose=1 /usr/bin/x86_64-pld-linux-gnux32-gcc -Werror -Wall -Wmissing-prototypes -Wmissing-declarations -O2 -fwrapv -pipe -Wformat -Werror=format-security -gdwarf-4 -fno-debug-types-section -fvar-tracking-assignments -g2 -Wp,-D_FORTIFY_SOURCE=2 -fstack-protector-strong --param=ssp-buffer-size=4 -Werror=trampolines -fPIC -mtune=generic -march=x86-64 -gdwarf-4 -fno-debug-types-section -fvar-tracking-assignments -g2 -DNDEBUG -DQT_NO_DEBUG -Wl,--as-needed -Wl,--no-copy-dt-needed-entries -Wl,-z,relro -Wl,-z,combreloc CMakeFiles/jenny.dir/__/__/borrowed/jenny/jenny.c.o -o ../../bin/jenny make[2]: Leaving directory '/tmp/B.v8o6rdi5/BUILD/gnucash-5.7/build' make[2]: Entering directory '/tmp/B.v8o6rdi5/BUILD/gnucash-5.7/build' [ 24%] Building C object libgnucash/core-utils/CMakeFiles/gnc-core-utils.dir/gnc-glib-utils.c.o cd /tmp/B.v8o6rdi5/BUILD/gnucash-5.7/build/libgnucash/core-utils && /usr/bin/x86_64-pld-linux-gnux32-gcc -DGLIB_VERSION_MAX_ALLOWED=GLIB_VERSION_2_56 -DGLIB_VERSION_MIN_REQUIRED=GLIB_VERSION_2_56 -DG_LOG_DOMAIN=\"gnc.core-utils\" -DHAVE_CONFIG_H -DHAVE_GUILE30 -D_GNU_SOURCE -Dgnc_core_utils_EXPORTS -I/tmp/B.v8o6rdi5/BUILD/gnucash-5.7/common -I/tmp/B.v8o6rdi5/BUILD/gnucash-5.7/build/common -I/tmp/B.v8o6rdi5/BUILD/gnucash-5.7/build/libgnucash/core-utils -I/tmp/B.v8o6rdi5/BUILD/gnucash-5.7/libgnucash/core-utils -isystem /usr/include/glib-2.0 -isystem /usr/libx32/glib-2.0/include -Werror -Wall -Wmissing-prototypes -Wmissing-declarations -O2 -fwrapv -pipe -Wformat -Werror=format-security -gdwarf-4 -fno-debug-types-section -fvar-tracking-assignments -g2 -Wp,-D_FORTIFY_SOURCE=2 -fstack-protector-strong --param=ssp-buffer-size=4 -Werror=trampolines -fPIC -mtune=generic -march=x86-64 -gdwarf-4 -fno-debug-types-section -fvar-tracking-assignments -g2 -DNDEBUG -DQT_NO_DEBUG -std=gnu11 -fPIC -MD -MT libgnucash/core-utils/CMakeFiles/gnc-core-utils.dir/gnc-glib-utils.c.o -MF CMakeFiles/gnc-core-utils.dir/gnc-glib-utils.c.o.d -o CMakeFiles/gnc-core-utils.dir/gnc-glib-utils.c.o -c /tmp/B.v8o6rdi5/BUILD/gnucash-5.7/libgnucash/core-utils/gnc-glib-utils.c make[2]: Leaving directory '/tmp/B.v8o6rdi5/BUILD/gnucash-5.7/build' make[1]: Entering directory '/tmp/B.v8o6rdi5/BUILD/gnucash-5.7/build' [ 25%] Built target jenny make[1]: Leaving directory '/tmp/B.v8o6rdi5/BUILD/gnucash-5.7/build' make[2]: Entering directory '/tmp/B.v8o6rdi5/BUILD/gnucash-5.7/build' [ 22%] Generating swig-app-utils-python.c, sw_app_utils.py cd /tmp/B.v8o6rdi5/BUILD/gnucash-5.7/build/bindings/python && /usr/bin/swig -python -Wall -Werror -I/usr/include/glib-2.0 -I/usr/libx32/glib-2.0/include -I/usr/include -I/tmp/B.v8o6rdi5/BUILD/gnucash-5.7/common -I/tmp/B.v8o6rdi5/BUILD/gnucash-5.7/libgnucash/engine -I/tmp/B.v8o6rdi5/BUILD/gnucash-5.7/libgnucash/app-utils -I/tmp/B.v8o6rdi5/BUILD/gnucash-5.7/bindings -I/tmp/B.v8o6rdi5/BUILD/gnucash-5.7/bindings/python -o /tmp/B.v8o6rdi5/BUILD/gnucash-5.7/build/bindings/python/swig-app-utils-python.c /tmp/B.v8o6rdi5/BUILD/gnucash-5.7/bindings/python/../app-utils.i /usr/include/guid.h:41: Warning 301: class keyword used, but not in C++ mode. /usr/include/guid.h:83: Warning 301: class keyword used, but not in C++ mode. make[2]: *** [bindings/python/CMakeFiles/sw-app-utils-py.dir/build.make:78: bindings/python/swig-app-utils-python.c] Error 1 make[2]: Leaving directory '/tmp/B.v8o6rdi5/BUILD/gnucash-5.7/build' make[1]: *** [CMakeFiles/Makefile2:11189: bindings/python/CMakeFiles/sw-app-utils-py.dir/all] Error 2 make[1]: *** Waiting for unfinished jobs.... make[2]: Entering directory '/tmp/B.v8o6rdi5/BUILD/gnucash-5.7/build' [ 22%] Generating swig-app-utils-python.c, sw_app_utils.py cd /tmp/B.v8o6rdi5/BUILD/gnucash-5.7/build/bindings/python && /usr/bin/swig -python -Wall -Werror -I/usr/include/glib-2.0 -I/usr/libx32/glib-2.0/include -I/usr/include -I/tmp/B.v8o6rdi5/BUILD/gnucash-5.7/common -I/tmp/B.v8o6rdi5/BUILD/gnucash-5.7/libgnucash/engine -I/tmp/B.v8o6rdi5/BUILD/gnucash-5.7/libgnucash/app-utils -I/tmp/B.v8o6rdi5/BUILD/gnucash-5.7/bindings -I/tmp/B.v8o6rdi5/BUILD/gnucash-5.7/bindings/python -o /tmp/B.v8o6rdi5/BUILD/gnucash-5.7/build/bindings/python/swig-app-utils-python.c /tmp/B.v8o6rdi5/BUILD/gnucash-5.7/bindings/python/../app-utils.i /usr/include/guid.h:41: Warning 301: class keyword used, but not in C++ mode. /usr/include/guid.h:83: Warning 301: class keyword used, but not in C++ mode. On exit, could not delete file /tmp/B.v8o6rdi5/BUILD/gnucash-5.7/build/bindings/python/swig-app-utils-python.c: No such file or directory On exit, could not delete file /tmp/B.v8o6rdi5/BUILD/gnucash-5.7/build/bindings/python/sw_app_utils.py: No such file or directory make[2]: *** [bindings/python/CMakeFiles/swig-app-utils-python.dir/build.make:80: bindings/python/swig-app-utils-python.c] Error 1 make[2]: Leaving directory '/tmp/B.v8o6rdi5/BUILD/gnucash-5.7/build' make[1]: *** [CMakeFiles/Makefile2:10949: bindings/python/CMakeFiles/swig-app-utils-python.dir/all] Error 2 make[2]: Entering directory '/tmp/B.v8o6rdi5/BUILD/gnucash-5.7/build' [ 22%] Generating ../../libx32/guile/3.0/site-ccache/gnucash/json/syntax.go cd /tmp/B.v8o6rdi5/BUILD/gnucash-5.7/build/borrowed/guile-json && /usr/bin/cmake -E env LD_LIBRARY_PATH=/tmp/B.v8o6rdi5/BUILD/gnucash-5.7/build//libx32:/tmp/B.v8o6rdi5/BUILD/gnucash-5.7/build//libx32/gnucash:/home/users/builder/GNUstep/Library/Libraries:/usr/local/libx32:/usr/libx32 GNC_UNINSTALLED=YES GNC_BUILDDIR=/tmp/B.v8o6rdi5/BUILD/gnucash-5.7/build GUILE_LOAD_PATH=/tmp/B.v8o6rdi5/BUILD/gnucash-5.7/borrowed/guile-json:/tmp/B.v8o6rdi5/BUILD/gnucash-5.7/build/borrowed/guile-json:/tmp/B.v8o6rdi5/BUILD/gnucash-5.7/build/borrowed/guile-json/deprecated:/tmp/B.v8o6rdi5/BUILD/gnucash-5.7/build/share/guile/site/3.0 GUILE_LOAD_COMPILED_PATH=/tmp/B.v8o6rdi5/BUILD/gnucash-5.7/build/borrowed/guile-json:/tmp/B.v8o6rdi5/BUILD/gnucash-5.7/build/libx32/guile/3.0/site-ccache:/tmp/B.v8o6rdi5/BUILD/gnucash-5.7/build/libx32/guile/3.0/site-ccache/gnucash/deprecated GNC_MODULE_PATH=/tmp/B.v8o6rdi5/BUILD/gnucash-5.7/build//libx32:/tmp/B.v8o6rdi5/BUILD/gnucash-5.7/build//libx32/gnucash: /usr/bin/guile -e "(@@ (guild) main)" -s /usr/bin/guild compile -o /tmp/B.v8o6rdi5/BUILD/gnucash-5.7/build/libx32/guile/3.0/site-ccache/gnucash/json/syntax.go /tmp/B.v8o6rdi5/BUILD/gnucash-5.7/borrowed/guile-json/json/syntax.scm wrote `/tmp/B.v8o6rdi5/BUILD/gnucash-5.7/build/libx32/guile/3.0/site-ccache/gnucash/json/syntax.go' make[2]: Leaving directory '/tmp/B.v8o6rdi5/BUILD/gnucash-5.7/build' make[2]: Entering directory '/tmp/B.v8o6rdi5/BUILD/gnucash-5.7/build' [ 2%] Generating swig-engine.cpp cd /tmp/B.v8o6rdi5/BUILD/gnucash-5.7/build/bindings/guile && /usr/bin/swig -guile -Linkage module -c++ -procdoc sw-gnc-option-doc -procdocformat plain -I/tmp/B.v8o6rdi5/BUILD/gnucash-5.7/common -I/tmp/B.v8o6rdi5/BUILD/gnucash-5.7/libgnucash/engine -I/tmp/B.v8o6rdi5/BUILD/gnucash-5.7/bindings/guile -I/tmp/B.v8o6rdi5/BUILD/gnucash-5.7/libgnucash/engine -o /tmp/B.v8o6rdi5/BUILD/gnucash-5.7/build/bindings/guile/swig-engine.cpp /tmp/B.v8o6rdi5/BUILD/gnucash-5.7/bindings/engine.i make[2]: Leaving directory '/tmp/B.v8o6rdi5/BUILD/gnucash-5.7/build' make[1]: Entering directory '/tmp/B.v8o6rdi5/BUILD/gnucash-5.7/build' [ 25%] Built target swig-engine-cpp make[1]: Leaving directory '/tmp/B.v8o6rdi5/BUILD/gnucash-5.7/build' make[2]: Entering directory '/tmp/B.v8o6rdi5/BUILD/gnucash-5.7/build' [ 24%] Building CXX object libgnucash/core-utils/CMakeFiles/gnc-core-utils.dir/gnc-locale-utils.cpp.o cd /tmp/B.v8o6rdi5/BUILD/gnucash-5.7/build/libgnucash/core-utils && /usr/bin/x86_64-pld-linux-gnux32-g++ -DGLIB_VERSION_MAX_ALLOWED=GLIB_VERSION_2_56 -DGLIB_VERSION_MIN_REQUIRED=GLIB_VERSION_2_56 -DG_LOG_DOMAIN=\"gnc.core-utils\" -DHAVE_CONFIG_H -DHAVE_GUILE30 -D_GNU_SOURCE -Dgnc_core_utils_EXPORTS -I/tmp/B.v8o6rdi5/BUILD/gnucash-5.7/common -I/tmp/B.v8o6rdi5/BUILD/gnucash-5.7/build/common -I/tmp/B.v8o6rdi5/BUILD/gnucash-5.7/build/libgnucash/core-utils -I/tmp/B.v8o6rdi5/BUILD/gnucash-5.7/libgnucash/core-utils -isystem /usr/include/glib-2.0 -isystem /usr/libx32/glib-2.0/include -Werror -Wall -Wmissing-declarations -O2 -fwrapv -pipe -Wformat -Werror=format-security -gdwarf-4 -fno-debug-types-section -fvar-tracking-assignments -g2 -Wp,-D_FORTIFY_SOURCE=2 -fstack-protector-strong --param=ssp-buffer-size=4 -Werror=trampolines -fPIC -mtune=generic -march=x86-64 -gdwarf-4 -fno-debug-types-section -fvar-tracking-assignments -g2 -DNDEBUG -DQT_NO_DEBUG -std=c++17 -fPIC -MD -MT libgnucash/core-utils/CMakeFiles/gnc-core-utils.dir/gnc-locale-utils.cpp.o -MF CMakeFiles/gnc-core-utils.dir/gnc-locale-utils.cpp.o.d -o CMakeFiles/gnc-core-utils.dir/gnc-locale-utils.cpp.o -c /tmp/B.v8o6rdi5/BUILD/gnucash-5.7/libgnucash/core-utils/gnc-locale-utils.cpp make[2]: Leaving directory '/tmp/B.v8o6rdi5/BUILD/gnucash-5.7/build' make[2]: Entering directory '/tmp/B.v8o6rdi5/BUILD/gnucash-5.7/build' [ 22%] Generating ../../libx32/guile/3.0/site-ccache/gnucash/json/builder.go cd /tmp/B.v8o6rdi5/BUILD/gnucash-5.7/build/borrowed/guile-json && /usr/bin/cmake -E env LD_LIBRARY_PATH=/tmp/B.v8o6rdi5/BUILD/gnucash-5.7/build//libx32:/tmp/B.v8o6rdi5/BUILD/gnucash-5.7/build//libx32/gnucash:/home/users/builder/GNUstep/Library/Libraries:/usr/local/libx32:/usr/libx32 GNC_UNINSTALLED=YES GNC_BUILDDIR=/tmp/B.v8o6rdi5/BUILD/gnucash-5.7/build GUILE_LOAD_PATH=/tmp/B.v8o6rdi5/BUILD/gnucash-5.7/borrowed/guile-json:/tmp/B.v8o6rdi5/BUILD/gnucash-5.7/build/borrowed/guile-json:/tmp/B.v8o6rdi5/BUILD/gnucash-5.7/build/borrowed/guile-json/deprecated:/tmp/B.v8o6rdi5/BUILD/gnucash-5.7/build/share/guile/site/3.0 GUILE_LOAD_COMPILED_PATH=/tmp/B.v8o6rdi5/BUILD/gnucash-5.7/build/borrowed/guile-json:/tmp/B.v8o6rdi5/BUILD/gnucash-5.7/build/libx32/guile/3.0/site-ccache:/tmp/B.v8o6rdi5/BUILD/gnucash-5.7/build/libx32/guile/3.0/site-ccache/gnucash/deprecated GNC_MODULE_PATH=/tmp/B.v8o6rdi5/BUILD/gnucash-5.7/build//libx32:/tmp/B.v8o6rdi5/BUILD/gnucash-5.7/build//libx32/gnucash: /usr/bin/guile -e "(@@ (guild) main)" -s /usr/bin/guild compile -o /tmp/B.v8o6rdi5/BUILD/gnucash-5.7/build/libx32/guile/3.0/site-ccache/gnucash/json/builder.go /tmp/B.v8o6rdi5/BUILD/gnucash-5.7/borrowed/guile-json/json/builder.scm json/builder.scm:198:37: warning: possibly wrong number of arguments to `#<<parameter> f7896600 proc: #<procedure f7899ae0>>' json/builder.scm:171:6: warning: possibly wrong number of arguments to `#<procedure f789ea00>' json/builder.scm:138:16: warning: possibly wrong number of arguments to `#<procedure f789eb40>' json/builder.scm:36:2: warning: possibly wrong number of arguments to `#<procedure f789ea00>' wrote `/tmp/B.v8o6rdi5/BUILD/gnucash-5.7/build/libx32/guile/3.0/site-ccache/gnucash/json/builder.go' make[2]: Leaving directory '/tmp/B.v8o6rdi5/BUILD/gnucash-5.7/build' make[2]: Entering directory '/tmp/B.v8o6rdi5/BUILD/gnucash-5.7/build' [ 0%] Building CXX object libgnucash/engine/test-core/CMakeFiles/gnc-test-engine.dir/test-engine-stuff.cpp.o cd /tmp/B.v8o6rdi5/BUILD/gnucash-5.7/build/libgnucash/engine/test-core && /usr/bin/x86_64-pld-linux-gnux32-g++ -DHAVE_CONFIG_H -DHAVE_GUILE30 -D_GNU_SOURCE -I/usr/include/glib-2.0 -I/usr/libx32/glib-2.0/include -I/tmp/B.v8o6rdi5/BUILD/gnucash-5.7/build/common -I/tmp/B.v8o6rdi5/BUILD/gnucash-5.7/common -I/tmp/B.v8o6rdi5/BUILD/gnucash-5.7/libgnucash/engine -I/tmp/B.v8o6rdi5/BUILD/gnucash-5.7/common/test-core -Werror -Wall -Wmissing-declarations -O2 -fwrapv -pipe -Wformat -Werror=format-security -gdwarf-4 -fno-debug-types-section -fvar-tracking-assignments -g2 -Wp,-D_FORTIFY_SOURCE=2 -fstack-protector-strong --param=ssp-buffer-size=4 -Werror=trampolines -fPIC -mtune=generic -march=x86-64 -gdwarf-4 -fno-debug-types-section -fvar-tracking-assignments -g2 -DNDEBUG -DQT_NO_DEBUG -std=c++17 -MD -MT libgnucash/engine/test-core/CMakeFiles/gnc-test-engine.dir/test-engine-stuff.cpp.o -MF CMakeFiles/gnc-test-engine.dir/test-engine-stuff.cpp.o.d -o CMakeFiles/gnc-test-engine.dir/test-engine-stuff.cpp.o -c /tmp/B.v8o6rdi5/BUILD/gnucash-5.7/libgnucash/engine/test-core/test-engine-stuff.cpp make[2]: Leaving directory '/tmp/B.v8o6rdi5/BUILD/gnucash-5.7/build' make[2]: Entering directory '/tmp/B.v8o6rdi5/BUILD/gnucash-5.7/build' [ 25%] Linking CXX static library libgnc-test-engine.a cd /tmp/B.v8o6rdi5/BUILD/gnucash-5.7/build/libgnucash/engine/test-core && /usr/bin/cmake -P CMakeFiles/gnc-test-engine.dir/cmake_clean_target.cmake cd /tmp/B.v8o6rdi5/BUILD/gnucash-5.7/build/libgnucash/engine/test-core && /usr/bin/cmake -E cmake_link_script CMakeFiles/gnc-test-engine.dir/link.txt --verbose=1 /usr/bin/ar qc libgnc-test-engine.a "CMakeFiles/gnc-test-engine.dir/test-engine-stuff.cpp.o" /usr/bin/ranlib libgnc-test-engine.a make[2]: Leaving directory '/tmp/B.v8o6rdi5/BUILD/gnucash-5.7/build' make[1]: Entering directory '/tmp/B.v8o6rdi5/BUILD/gnucash-5.7/build' [ 25%] Built target gnc-test-engine make[1]: Leaving directory '/tmp/B.v8o6rdi5/BUILD/gnucash-5.7/build' make[2]: Entering directory '/tmp/B.v8o6rdi5/BUILD/gnucash-5.7/build' [ 22%] Generating gnucash_core.c, gnucash_core_c.py cd /tmp/B.v8o6rdi5/BUILD/gnucash-5.7/build/bindings/python && /usr/bin/swig -python -Wall -Werror -I/usr/include/glib-2.0 -I/usr/libx32/glib-2.0/include -I/usr/include -I/tmp/B.v8o6rdi5/BUILD/gnucash-5.7/common -I/tmp/B.v8o6rdi5/BUILD/gnucash-5.7/libgnucash/engine -I/tmp/B.v8o6rdi5/BUILD/gnucash-5.7/libgnucash/app-utils -I/tmp/B.v8o6rdi5/BUILD/gnucash-5.7/bindings -I/tmp/B.v8o6rdi5/BUILD/gnucash-5.7/bindings/python -I/tmp/B.v8o6rdi5/BUILD/gnucash-5.7/bindings -o /tmp/B.v8o6rdi5/BUILD/gnucash-5.7/build/bindings/python/gnucash_core.c /tmp/B.v8o6rdi5/BUILD/gnucash-5.7/bindings/python/gnucash_core.i /usr/include/guid.h:41: Warning 301: class keyword used, but not in C++ mode. /usr/include/guid.h:83: Warning 301: class keyword used, but not in C++ mode. make[2]: *** [bindings/python/CMakeFiles/gnucash-core-c-py.dir/build.make:109: bindings/python/gnucash_core.c] Error 1 make[2]: Leaving directory '/tmp/B.v8o6rdi5/BUILD/gnucash-5.7/build' make[1]: *** [CMakeFiles/Makefile2:11031: bindings/python/CMakeFiles/gnucash-core-c-py.dir/all] Error 2 make[2]: Entering directory '/tmp/B.v8o6rdi5/BUILD/gnucash-5.7/build' [ 22%] Generating ../../libx32/guile/3.0/site-ccache/gnucash/json/parser.go cd /tmp/B.v8o6rdi5/BUILD/gnucash-5.7/build/borrowed/guile-json && /usr/bin/cmake -E env LD_LIBRARY_PATH=/tmp/B.v8o6rdi5/BUILD/gnucash-5.7/build//libx32:/tmp/B.v8o6rdi5/BUILD/gnucash-5.7/build//libx32/gnucash:/home/users/builder/GNUstep/Library/Libraries:/usr/local/libx32:/usr/libx32 GNC_UNINSTALLED=YES GNC_BUILDDIR=/tmp/B.v8o6rdi5/BUILD/gnucash-5.7/build GUILE_LOAD_PATH=/tmp/B.v8o6rdi5/BUILD/gnucash-5.7/borrowed/guile-json:/tmp/B.v8o6rdi5/BUILD/gnucash-5.7/build/borrowed/guile-json:/tmp/B.v8o6rdi5/BUILD/gnucash-5.7/build/borrowed/guile-json/deprecated:/tmp/B.v8o6rdi5/BUILD/gnucash-5.7/build/share/guile/site/3.0 GUILE_LOAD_COMPILED_PATH=/tmp/B.v8o6rdi5/BUILD/gnucash-5.7/build/borrowed/guile-json:/tmp/B.v8o6rdi5/BUILD/gnucash-5.7/build/libx32/guile/3.0/site-ccache:/tmp/B.v8o6rdi5/BUILD/gnucash-5.7/build/libx32/guile/3.0/site-ccache/gnucash/deprecated GNC_MODULE_PATH=/tmp/B.v8o6rdi5/BUILD/gnucash-5.7/build//libx32:/tmp/B.v8o6rdi5/BUILD/gnucash-5.7/build//libx32/gnucash: /usr/bin/guile -e "(@@ (guild) main)" -s /usr/bin/guild compile -o /tmp/B.v8o6rdi5/BUILD/gnucash-5.7/build/libx32/guile/3.0/site-ccache/gnucash/json/parser.go /tmp/B.v8o6rdi5/BUILD/gnucash-5.7/borrowed/guile-json/json/parser.scm json/parser.scm:345:37: warning: possibly wrong number of arguments to `#<<parameter> f7820610 proc: #<procedure f7823b10>>' json/parser.scm:235:3: warning: possibly wrong number of arguments to `#<procedure f776f198>' wrote `/tmp/B.v8o6rdi5/BUILD/gnucash-5.7/build/libx32/guile/3.0/site-ccache/gnucash/json/parser.go' make[2]: Leaving directory '/tmp/B.v8o6rdi5/BUILD/gnucash-5.7/build' make[1]: Entering directory '/tmp/B.v8o6rdi5/BUILD/gnucash-5.7/build' [ 25%] Built target guile-json-details make[1]: Leaving directory '/tmp/B.v8o6rdi5/BUILD/gnucash-5.7/build' make[2]: Entering directory '/tmp/B.v8o6rdi5/BUILD/gnucash-5.7/build' [ 21%] Generating gnucash_core.c, gnucash_core_c.py cd /tmp/B.v8o6rdi5/BUILD/gnucash-5.7/build/bindings/python && /usr/bin/swig -python -Wall -Werror -I/usr/include/glib-2.0 -I/usr/libx32/glib-2.0/include -I/usr/include -I/tmp/B.v8o6rdi5/BUILD/gnucash-5.7/common -I/tmp/B.v8o6rdi5/BUILD/gnucash-5.7/libgnucash/engine -I/tmp/B.v8o6rdi5/BUILD/gnucash-5.7/libgnucash/app-utils -I/tmp/B.v8o6rdi5/BUILD/gnucash-5.7/bindings -I/tmp/B.v8o6rdi5/BUILD/gnucash-5.7/bindings/python -I/tmp/B.v8o6rdi5/BUILD/gnucash-5.7/bindings -o /tmp/B.v8o6rdi5/BUILD/gnucash-5.7/build/bindings/python/gnucash_core.c /tmp/B.v8o6rdi5/BUILD/gnucash-5.7/bindings/python/gnucash_core.i /usr/include/guid.h:41: Warning 301: class keyword used, but not in C++ mode. /usr/include/guid.h:83: Warning 301: class keyword used, but not in C++ mode. On exit, could not delete file /tmp/B.v8o6rdi5/BUILD/gnucash-5.7/build/bindings/python/gnucash_core.c: No such file or directory On exit, could not delete file /tmp/B.v8o6rdi5/BUILD/gnucash-5.7/build/bindings/python/gnucash_core_c.py: No such file or directory make[2]: *** [bindings/python/CMakeFiles/swig-gnucash-core.dir/build.make:142: bindings/python/gnucash_core.c] Error 1 make[2]: Leaving directory '/tmp/B.v8o6rdi5/BUILD/gnucash-5.7/build' make[1]: *** [CMakeFiles/Makefile2:10897: bindings/python/CMakeFiles/swig-gnucash-core.dir/all] Error 2 make[2]: Entering directory '/tmp/B.v8o6rdi5/BUILD/gnucash-5.7/build' [ 4%] Generating gnucash.desktop.in cd /tmp/B.v8o6rdi5/BUILD/gnucash-5.7/build/gnucash/gnome && /usr/bin/cmake -E env /usr/bin/msgfmt --desktop --template /tmp/B.v8o6rdi5/BUILD/gnucash-5.7/gnucash/gnome/gnucash.desktop.in.in -d /tmp/B.v8o6rdi5/BUILD/gnucash-5.7/po -o /tmp/B.v8o6rdi5/BUILD/gnucash-5.7/build/gnucash/gnome/gnucash.desktop.in make[2]: Leaving directory '/tmp/B.v8o6rdi5/BUILD/gnucash-5.7/build' make[2]: Entering directory '/tmp/B.v8o6rdi5/BUILD/gnucash-5.7/build' [ 25%] Generating gnucash.desktop cd /tmp/B.v8o6rdi5/BUILD/gnucash-5.7/build/gnucash/gnome && /usr/bin/cmake -D SRC=/tmp/B.v8o6rdi5/BUILD/gnucash-5.7/build/gnucash/gnome/gnucash.desktop.in -D DST=/tmp/B.v8o6rdi5/BUILD/gnucash-5.7/build/gnucash/gnome/gnucash.desktop -D VCS_INFO_FILE=/tmp/B.v8o6rdi5/BUILD/gnucash-5.7/build/libgnucash/core-utils/gnc-vcs-info.h -D PROJECT_VERSION=5.7 -D SRC_DIR=/tmp/B.v8o6rdi5/BUILD/gnucash-5.7 -P /tmp/B.v8o6rdi5/BUILD/gnucash-5.7/cmake/configure-gnucash-desktop.cmake make[2]: Leaving directory '/tmp/B.v8o6rdi5/BUILD/gnucash-5.7/build' make[1]: Entering directory '/tmp/B.v8o6rdi5/BUILD/gnucash-5.7/build' [ 25%] Built target gnucash-desktop make[1]: Leaving directory '/tmp/B.v8o6rdi5/BUILD/gnucash-5.7/build' make[2]: Entering directory '/tmp/B.v8o6rdi5/BUILD/gnucash-5.7/build' [ 4%] Generating gnucash.appdata.xml.in cd /tmp/B.v8o6rdi5/BUILD/gnucash-5.7/build/gnucash/gnome && /usr/bin/msgfmt --xml --template /tmp/B.v8o6rdi5/BUILD/gnucash-5.7/gnucash/gnome/gnucash.appdata.xml.in.in -d /tmp/B.v8o6rdi5/BUILD/gnucash-5.7/po -o /tmp/B.v8o6rdi5/BUILD/gnucash-5.7/build/gnucash/gnome/gnucash.appdata.xml.in make[2]: Leaving directory '/tmp/B.v8o6rdi5/BUILD/gnucash-5.7/build' make[1]: Entering directory '/tmp/B.v8o6rdi5/BUILD/gnucash-5.7/build' [ 25%] Built target dist-gnucash-gnome-gnucash-appdata-xml-in make[1]: Leaving directory '/tmp/B.v8o6rdi5/BUILD/gnucash-5.7/build' make[2]: Entering directory '/tmp/B.v8o6rdi5/BUILD/gnucash-5.7/build' [ 22%] Building CXX object libgnucash/core-utils/CMakeFiles/gnc-core-utils.dir/gnc-filepath-utils.cpp.o cd /tmp/B.v8o6rdi5/BUILD/gnucash-5.7/build/libgnucash/core-utils && /usr/bin/x86_64-pld-linux-gnux32-g++ -DGLIB_VERSION_MAX_ALLOWED=GLIB_VERSION_2_56 -DGLIB_VERSION_MIN_REQUIRED=GLIB_VERSION_2_56 -DG_LOG_DOMAIN=\"gnc.core-utils\" -DHAVE_CONFIG_H -DHAVE_GUILE30 -D_GNU_SOURCE -Dgnc_core_utils_EXPORTS -I/tmp/B.v8o6rdi5/BUILD/gnucash-5.7/common -I/tmp/B.v8o6rdi5/BUILD/gnucash-5.7/build/common -I/tmp/B.v8o6rdi5/BUILD/gnucash-5.7/build/libgnucash/core-utils -I/tmp/B.v8o6rdi5/BUILD/gnucash-5.7/libgnucash/core-utils -isystem /usr/include/glib-2.0 -isystem /usr/libx32/glib-2.0/include -Werror -Wall -Wmissing-declarations -O2 -fwrapv -pipe -Wformat -Werror=format-security -gdwarf-4 -fno-debug-types-section -fvar-tracking-assignments -g2 -Wp,-D_FORTIFY_SOURCE=2 -fstack-protector-strong --param=ssp-buffer-size=4 -Werror=trampolines -fPIC -mtune=generic -march=x86-64 -gdwarf-4 -fno-debug-types-section -fvar-tracking-assignments -g2 -DNDEBUG -DQT_NO_DEBUG -std=c++17 -fPIC -MD -MT libgnucash/core-utils/CMakeFiles/gnc-core-utils.dir/gnc-filepath-utils.cpp.o -MF CMakeFiles/gnc-core-utils.dir/gnc-filepath-utils.cpp.o.d -o CMakeFiles/gnc-core-utils.dir/gnc-filepath-utils.cpp.o -c /tmp/B.v8o6rdi5/BUILD/gnucash-5.7/libgnucash/core-utils/gnc-filepath-utils.cpp make[2]: Leaving directory '/tmp/B.v8o6rdi5/BUILD/gnucash-5.7/build' make[2]: Entering directory '/tmp/B.v8o6rdi5/BUILD/gnucash-5.7/build' [ 25%] Linking CXX shared library ../../libx32/libgnc-core-utils.so cd /tmp/B.v8o6rdi5/BUILD/gnucash-5.7/build/libgnucash/core-utils && /usr/bin/cmake -E cmake_link_script CMakeFiles/gnc-core-utils.dir/link.txt --verbose=1 /usr/bin/x86_64-pld-linux-gnux32-g++ -fPIC -Werror -Wall -Wmissing-declarations -O2 -fwrapv -pipe -Wformat -Werror=format-security -gdwarf-4 -fno-debug-types-section -fvar-tracking-assignments -g2 -Wp,-D_FORTIFY_SOURCE=2 -fstack-protector-strong --param=ssp-buffer-size=4 -Werror=trampolines -fPIC -mtune=generic -march=x86-64 -gdwarf-4 -fno-debug-types-section -fvar-tracking-assignments -g2 -DNDEBUG -DQT_NO_DEBUG -Wl,--as-needed -Wl,--no-copy-dt-needed-entries -Wl,-z,relro -Wl,-z,combreloc -shared -Wl,-soname,libgnc-core-utils.so -o ../../libx32/libgnc-core-utils.so "CMakeFiles/gnc-core-utils.dir/binreloc.c.o" "CMakeFiles/gnc-core-utils.dir/gnc-prefs.c.o" "CMakeFiles/gnc-core-utils.dir/gnc-environment.c.o" "CMakeFiles/gnc-core-utils.dir/gnc-filepath-utils.cpp.o" "CMakeFiles/gnc-core-utils.dir/gnc-gkeyfile-utils.c.o" "CMakeFiles/gnc-core-utils.dir/gnc-glib-utils.c.o" "CMakeFiles/gnc-core-utils.dir/gnc-locale-utils.c.o" "CMakeFiles/gnc-core-utils.dir/gnc-locale-utils.cpp.o" "CMakeFiles/gnc-core-utils.dir/gnc-path.c.o" "CMakeFiles/gnc-core-utils.dir/gnc-version.c.o" -Wl,-rpath,::::::::::::::::::::::::::::::: /usr/libx32/libboost_date_time.so /usr/libx32/libboost_filesystem.so /usr/libx32/libboost_locale.so /usr/libx32/libboost_program_options.so /usr/libx32/libboost_regex.so /usr/libx32/libboost_system.so -L/usr/libx32 -lgobject-2.0 -lglib-2.0 /usr/libx32/libglib-2.0.so make[2]: Leaving directory '/tmp/B.v8o6rdi5/BUILD/gnucash-5.7/build' make[1]: Entering directory '/tmp/B.v8o6rdi5/BUILD/gnucash-5.7/build' [ 25%] Built target gnc-core-utils make[1]: Leaving directory '/tmp/B.v8o6rdi5/BUILD/gnucash-5.7/build' make: *** [Makefile:169: all] Error 2 error: Bad exit status from /tmp/B.v8o6rdi5/BUILD/tmp/rpm-tmp.D7Md9Z (%build) RPM build errors: Bad exit status from /tmp/B.v8o6rdi5/BUILD/tmp/rpm-tmp.D7Md9Z (%build) ended at: Sun Jun 30 21:33:52 2024, done in 0:00:24.008301 error: No files produced. + chmod -R u+rwX /tmp/B.v8o6rdi5/BUILD + rm -rf /tmp/B.v8o6rdi5/tmp /tmp/B.v8o6rdi5/BUILD + rm -rf /tmp/B.v8o6rdi5 Begin-PLD-Builder-Info Build-Time: user:75.07s sys:15.34s real:27.79s (faults io:126 non-io:1402152) End-PLD-Builder-Info
[Back to list of logs] [View rpm -qa of builder]