FailedOk

th/SRPMS[OK]
th/x32[OK]
th/i686[OK]
th/x86_64[OK]

ac/SRPMS[OK]
ac/i386[OK]
ac/i586[OK]
ac/i686[OK]
ac/alpha[OK]
ac/amd64[OK]
ac/athlon[OK]
ac/ppc[OK]
ac/sparc[OK]
ac/sparc64[OK]

Advanced Search
main()
Powered by PLD Linux
(c) 2002-2021 PLD Team
$Revision: 1.37 $
Powered by Unix conspiracy.
Your IP: 34.231.243.21

highway 63dfa59e-c8d7-449e-ace3-96dc022ade6e

Status:Failed
Source URL:https://buildlogs.pld-linux.org/pld/th/x32/FAIL/highway,63dfa59e-c8d7-449e-ace3-96dc022ade6e.bz2
text/plain URL:View!
rpm -qa of builder:View!
Date:2021/10/05 22:17:11
Runtime:0:01:56.531214

Toc:

  • prep
  • Executing(%prep): /bin/sh -e /tmp/B.ev3pxxw8/BUILD/tmp/rpm-tmp.2OQKR7
  • build
  • Executing(%build): /bin/sh -e /tmp/B.ev3pxxw8/BUILD/tmp/rpm-tmp.SSaGeR
  • error 1
  • make[2]: *** [CMakeFiles/highway_test.dir/build.make:113: tests/highway_test] Error 1
  • error 2
  • make[1]: *** [CMakeFiles/Makefile2:1046: CMakeFiles/highway_test.dir/all] Error 2
  • error 3
  • error: Bad exit status from /tmp/B.ev3pxxw8/BUILD/tmp/rpm-tmp.SSaGeR (%build)
  • error 4
  • RPM build errors:
  • error 5
  • error: No files produced.

Content:

request from: qboosh
checking if we should skip the build
started at: Tue Oct  5 22:15:13 2021
killing old processes on a builder
sending signal 9 to pid -1
cleaning up /tmp
fetching https://srcbuilder.pld-linux.org/th//srpms/63dfa59e-c8d7-449e-ace3-96dc022ade6e/highway-0.14.2-1.src.rpm
fetched 1555880 bytes, 3262.9 K/s
installing srpm: highway-0.14.2-1.src.rpm
+ install -d /tmp/B.ev3pxxw8/BUILD /tmp/B.ev3pxxw8/RPMS
+ LC_ALL=en_US.UTF-8
+ rpm -qp --changelog highway-0.14.2-1.src.rpm
* Tue Oct 05 2021 PLD Linux Team <feedback@pld-linux.org>
- For complete changelog see: http://git.pld-linux.org/?p=packages/highway.git;a=log;h=master
* Tue Oct 05 2021 Jakub Bogusz <qboosh@pld-linux.org> 72d60b3
- added rdtscp patch from git (disable nanobenchmark on CPUs without rdtscp instruction) * Mon Oct 04 2021 Jakub Bogusz <qboosh@pld-linux.org> 824a55e
- disabled debug packages (static libs are not covered) * Sun Oct 03 2021 Jakub Bogusz <qboosh@pld-linux.org> 8564459
- use system gtest * Sat Oct 02 2021 Jakub Bogusz <qboosh@pld-linux.org> a15f126
- new + rpm -Uhv --nodeps --define '_topdir /tmp/B.ev3pxxw8' --define '_specdir %{_topdir}' --define '_sourcedir %{_specdir}' --define '_rpmdir %{_topdir}/RPMS' --define '_builddir %{_topdir}/BUILD' highway-0.14.2-1.src.rpm Updating / installing... highway-0.14.2-1 ######################################## + rm -f highway-0.14.2-1.src.rpm + install -m 700 -d /tmp/B.ev3pxxw8/BUILD/tmp + TMPDIR=/tmp/B.ev3pxxw8/BUILD/tmp + exec nice -n 0 rpmbuild -bp --short-circuit --nodeps --define '_topdir /tmp/B.ev3pxxw8' --define '_specdir %{_topdir}' --define '_sourcedir %{_specdir}' --define '_rpmdir %{_topdir}/RPMS' --define '_builddir %{_topdir}/BUILD' --target x32-pld-linux --define 'prep exit 0' /tmp/B.ev3pxxw8/highway.spec Building target platforms: x32-pld-linux Building for target x32-pld-linux checking BuildConflict-ing packages rpm: Building target platforms: x32-pld-linux rpm: Building for target x32-pld-linux no BuildConflicts found checking BR rpm: Building target platforms: x32-pld-linux rpm: Building for target x32-pld-linux no BR needed building RPM using: set -ex; : build-id: 63dfa59e-c8d7-449e-ace3-96dc022ade6e; TMPDIR=/tmp/B.ev3pxxw8/BUILD/tmp exec nice -n 0 rpmbuild -bb --define '_smp_mflags -j9' --define '_make_opts -Otarget' --define '_pld_builder 1' --define '_topdir /tmp/B.ev3pxxw8' --define '_specdir %{_topdir}' --define '_sourcedir %{_specdir}' --define '_rpmdir %{_topdir}/RPMS' --define '_builddir %{_topdir}/BUILD' --target x32-pld-linux /tmp/B.ev3pxxw8/highway.spec + : build-id: 63dfa59e-c8d7-449e-ace3-96dc022ade6e + TMPDIR=/tmp/B.ev3pxxw8/BUILD/tmp + exec nice -n 0 rpmbuild -bb --define '_smp_mflags -j9' --define '_make_opts -Otarget' --define '_pld_builder 1' --define '_topdir /tmp/B.ev3pxxw8' --define '_specdir %{_topdir}' --define '_sourcedir %{_specdir}' --define '_rpmdir %{_topdir}/RPMS' --define '_builddir %{_topdir}/BUILD' --target x32-pld-linux /tmp/B.ev3pxxw8/highway.spec Building target platforms: x32-pld-linux Building for target x32-pld-linux Executing(%prep): /bin/sh -e /tmp/B.ev3pxxw8/BUILD/tmp/rpm-tmp.2OQKR7 + umask 022 + cd /tmp/B.ev3pxxw8/BUILD + cd /tmp/B.ev3pxxw8/BUILD + rm -rf highway-0.14.2 + /bin/gzip -dc /tmp/B.ev3pxxw8/highway-0.14.2.tar.gz + /bin/tar -xof - + STATUS=0 + '[' 0 -ne 0 ']' + cd highway-0.14.2 + /bin/chmod -Rf a+rX,u+w,g-w,o-w . + echo 'Patch #0 (highway-rdtscp.patch):' Patch #0 (highway-rdtscp.patch): + </tmp/B.ev3pxxw8/highway-rdtscp.patch + /usr/bin/patch -s -p1 '--fuzz=0' + RPM_EC=0 + jobs -p + exit 0 Executing(%build): /bin/sh -e /tmp/B.ev3pxxw8/BUILD/tmp/rpm-tmp.SSaGeR HOME=/home/users/builder PATH=/home/users/builder/GNUstep/Tools:/bin:/usr/bin:/usr/local/bin TMPDIR=/tmp/B.ev3pxxw8/BUILD/tmp + umask 022 + cd /tmp/B.ev3pxxw8/BUILD + cd highway-0.14.2 + install -d build + cd build + CC=x86_64-pld-linux-gnux32-gcc CXX=x86_64-pld-linux-gnux32-g++ CPPFLAGS='' /usr/bin/cmake '-DCMAKE_VERBOSE_MAKEFILE:BOOL=ON' '-DCMAKE_BUILD_TYPE=PLD' '-DCMAKE_INSTALL_BINDIR:PATH=/usr/bin' '-DCMAKE_INSTALL_SBINDIR:PATH=/usr/sbin' '-DCMAKE_INSTALL_LIBEXECDIR:PATH=/usr/libexec' '-DCMAKE_INSTALL_SYSCONFDIR:PATH=/etc' '-DCMAKE_INSTALL_SHAREDSTATEDIRPATH:PATH=/var/lib' '-DCMAKE_INSTALL_LOCALSTATEDIRPATH:PATH=/var' '-DCMAKE_INSTALL_LIBDIR:PATH=/usr/libx32' '-DCMAKE_INSTALL_INCLUDEDIR:PATH=/usr/include' '-DCMAKE_INSTALL_OLDINCLUDEDIR:PATH=/usr/include' '-DCMAKE_INSTALL_DATAROOTDIR:PATH=/usr/share' '-DCMAKE_INSTALL_DATADIR:PATH=/usr/share' '-DCMAKE_INSTALL_INFODIR:PATH=/usr/share/info' '-DCMAKE_INSTALL_LOCALEDIR:PATH=/usr/share/locale' '-DCMAKE_INSTALL_MANDIR:PATH=/usr/share/man' '-DCMAKE_INSTALL_DOCDIR:PATH=/usr/share/doc' '-DCMAKE_INSTALL_PREFIX:PATH=/usr' '-DSYSCONF_INSTALL_DIR:PATH=/etc' '-DCMAKE_CXX_FLAGS_PLD=-O2 -fwrapv -pipe -Wformat -Werror=format-security -Wp,-D_FORTIFY_SOURCE=2 -fstack-protector-strong --param=ssp-buffer-size=4 -Werror=trampolines -fPIC -mtune=generic -march=x86-64 -DNDEBUG -DQT_NO_DEBUG' '-DCMAKE_C_FLAGS_PLD=-O2 -fwrapv -pipe -Wformat -Werror=format-security -Wp,-D_FORTIFY_SOURCE=2 -fstack-protector-strong --param=ssp-buffer-size=4 -Werror=trampolines -fPIC -mtune=generic -march=x86-64 -DNDEBUG -DQT_NO_DEBUG' '-DCMAKE_Fortran_FLAGS_PLD=-O2 -fwrapv -pipe -Wformat -Werror=format-security -Wp,-D_FORTIFY_SOURCE=2 -fstack-protector-strong --param=ssp-buffer-size=4 -Werror=trampolines -fPIC -mtune=generic -march=x86-64 -DNDEBUG -DQT_NO_DEBUG' '-DCMAKE_EXE_LINKER_FLAGS_PLD=-Wl,--as-needed -Wl,--no-copy-dt-needed-entries -Wl,-z,relro -Wl,-z,combreloc ' '-DCMAKE_SHARED_LINKER_FLAGS_PLD=-Wl,--as-needed -Wl,--no-copy-dt-needed-entries -Wl,-z,relro -Wl,-z,combreloc ' '-DCMAKE_MODULE_LINKER_FLAGS_PLD=-Wl,--as-needed -Wl,--no-copy-dt-needed-entries -Wl,-z,relro -Wl,-z,combreloc ' '-DLIB_SUFFIX=x32' '-DBUILD_SHARED_LIBS:BOOL=ON' .. '-DCMAKE_INSTALL_INCLUDEDIR=include' '-DCMAKE_INSTALL_LIBDIR=libx32' '-DHWY_SYSTEM_GTEST=ON' -- The C compiler identification is GNU 11.2.0 -- The CXX compiler identification is GNU 11.2.0 -- Check for working C compiler: /usr/bin/x86_64-pld-linux-gnux32-gcc -- Check for working C compiler: /usr/bin/x86_64-pld-linux-gnux32-gcc - works -- Detecting C compiler ABI info -- Detecting C compiler ABI info - done -- Detecting C compile features -- Detecting C compile features - done -- Check for working CXX compiler: /usr/bin/x86_64-pld-linux-gnux32-g++ -- Check for working CXX compiler: /usr/bin/x86_64-pld-linux-gnux32-g++ - works -- Detecting CXX compiler ABI info -- Detecting CXX compiler ABI info - done -- Detecting CXX compile features -- Detecting CXX compile features - done -- Performing Test HWY_EMSCRIPTEN -- Performing Test HWY_EMSCRIPTEN - Failed -- Found GTest: /usr/libx32/libgtest.so -- Configuring done -- Generating done CMake Warning: Manually-specified variables were not used by the project: CMAKE_Fortran_FLAGS_PLD CMAKE_INSTALL_LOCALSTATEDIRPATH CMAKE_INSTALL_SHAREDSTATEDIRPATH LIB_SUFFIX SYSCONF_INSTALL_DIR -- Build files have been written to: /tmp/B.ev3pxxw8/BUILD/highway-0.14.2/build + /usr/bin/make -Otarget -j9 /usr/bin/cmake -S/tmp/B.ev3pxxw8/BUILD/highway-0.14.2 -B/tmp/B.ev3pxxw8/BUILD/highway-0.14.2/build --check-build-system CMakeFiles/Makefile.cmake 0 /usr/bin/cmake -E cmake_progress_start /tmp/B.ev3pxxw8/BUILD/highway-0.14.2/build/CMakeFiles /tmp/B.ev3pxxw8/BUILD/highway-0.14.2/build/CMakeFiles/progress.marks /usr/bin/make -f CMakeFiles/Makefile2 all /usr/bin/make -f CMakeFiles/hwy_contrib.dir/build.make CMakeFiles/hwy_contrib.dir/depend /usr/bin/make -f CMakeFiles/hwy.dir/build.make CMakeFiles/hwy.dir/depend make[2]: Entering directory '/tmp/B.ev3pxxw8/BUILD/highway-0.14.2/build' cd /tmp/B.ev3pxxw8/BUILD/highway-0.14.2/build && /usr/bin/cmake -E cmake_depends "Unix Makefiles" /tmp/B.ev3pxxw8/BUILD/highway-0.14.2 /tmp/B.ev3pxxw8/BUILD/highway-0.14.2 /tmp/B.ev3pxxw8/BUILD/highway-0.14.2/build /tmp/B.ev3pxxw8/BUILD/highway-0.14.2/build /tmp/B.ev3pxxw8/BUILD/highway-0.14.2/build/CMakeFiles/hwy.dir/DependInfo.cmake --color= Scanning dependencies of target hwy make[2]: Leaving directory '/tmp/B.ev3pxxw8/BUILD/highway-0.14.2/build' /usr/bin/make -f CMakeFiles/hwy.dir/build.make CMakeFiles/hwy.dir/build make[2]: Entering directory '/tmp/B.ev3pxxw8/BUILD/highway-0.14.2/build' cd /tmp/B.ev3pxxw8/BUILD/highway-0.14.2/build && /usr/bin/cmake -E cmake_depends "Unix Makefiles" /tmp/B.ev3pxxw8/BUILD/highway-0.14.2 /tmp/B.ev3pxxw8/BUILD/highway-0.14.2 /tmp/B.ev3pxxw8/BUILD/highway-0.14.2/build /tmp/B.ev3pxxw8/BUILD/highway-0.14.2/build /tmp/B.ev3pxxw8/BUILD/highway-0.14.2/build/CMakeFiles/hwy_contrib.dir/DependInfo.cmake --color= Scanning dependencies of target hwy_contrib make[2]: Leaving directory '/tmp/B.ev3pxxw8/BUILD/highway-0.14.2/build' /usr/bin/make -f CMakeFiles/hwy_contrib.dir/build.make CMakeFiles/hwy_contrib.dir/build make[2]: Entering directory '/tmp/B.ev3pxxw8/BUILD/highway-0.14.2/build' [ 2%] Building CXX object CMakeFiles/hwy.dir/hwy/aligned_allocator.cc.o /usr/bin/x86_64-pld-linux-gnux32-g++ -I/tmp/B.ev3pxxw8/BUILD/highway-0.14.2 -O2 -fwrapv -pipe -Wformat -Werror=format-security -Wp,-D_FORTIFY_SOURCE=2 -fstack-protector-strong --param=ssp-buffer-size=4 -Werror=trampolines -fPIC -mtune=generic -march=x86-64 -DNDEBUG -DQT_NO_DEBUG -fPIC -Wno-builtin-macro-redefined -D__DATE__=\"redacted\" -D__TIMESTAMP__=\"redacted\" -D__TIME__=\"redacted\" -fmerge-all-constants -Wall -Wextra -Wconversion -Wsign-conversion -Wvla -Wnon-virtual-dtor -fmath-errno -fno-exceptions -std=c++11 -o CMakeFiles/hwy.dir/hwy/aligned_allocator.cc.o -c /tmp/B.ev3pxxw8/BUILD/highway-0.14.2/hwy/aligned_allocator.cc make[2]: Leaving directory '/tmp/B.ev3pxxw8/BUILD/highway-0.14.2/build' make[2]: Entering directory '/tmp/B.ev3pxxw8/BUILD/highway-0.14.2/build' [ 6%] Building CXX object CMakeFiles/hwy.dir/hwy/targets.cc.o /usr/bin/x86_64-pld-linux-gnux32-g++ -I/tmp/B.ev3pxxw8/BUILD/highway-0.14.2 -O2 -fwrapv -pipe -Wformat -Werror=format-security -Wp,-D_FORTIFY_SOURCE=2 -fstack-protector-strong --param=ssp-buffer-size=4 -Werror=trampolines -fPIC -mtune=generic -march=x86-64 -DNDEBUG -DQT_NO_DEBUG -fPIC -Wno-builtin-macro-redefined -D__DATE__=\"redacted\" -D__TIMESTAMP__=\"redacted\" -D__TIME__=\"redacted\" -fmerge-all-constants -Wall -Wextra -Wconversion -Wsign-conversion -Wvla -Wnon-virtual-dtor -fmath-errno -fno-exceptions -std=c++11 -o CMakeFiles/hwy.dir/hwy/targets.cc.o -c /tmp/B.ev3pxxw8/BUILD/highway-0.14.2/hwy/targets.cc make[2]: Leaving directory '/tmp/B.ev3pxxw8/BUILD/highway-0.14.2/build' make[2]: Entering directory '/tmp/B.ev3pxxw8/BUILD/highway-0.14.2/build' [ 4%] Building CXX object CMakeFiles/hwy.dir/hwy/nanobenchmark.cc.o /usr/bin/x86_64-pld-linux-gnux32-g++ -I/tmp/B.ev3pxxw8/BUILD/highway-0.14.2 -O2 -fwrapv -pipe -Wformat -Werror=format-security -Wp,-D_FORTIFY_SOURCE=2 -fstack-protector-strong --param=ssp-buffer-size=4 -Werror=trampolines -fPIC -mtune=generic -march=x86-64 -DNDEBUG -DQT_NO_DEBUG -fPIC -Wno-builtin-macro-redefined -D__DATE__=\"redacted\" -D__TIMESTAMP__=\"redacted\" -D__TIME__=\"redacted\" -fmerge-all-constants -Wall -Wextra -Wconversion -Wsign-conversion -Wvla -Wnon-virtual-dtor -fmath-errno -fno-exceptions -std=c++11 -o CMakeFiles/hwy.dir/hwy/nanobenchmark.cc.o -c /tmp/B.ev3pxxw8/BUILD/highway-0.14.2/hwy/nanobenchmark.cc make[2]: Leaving directory '/tmp/B.ev3pxxw8/BUILD/highway-0.14.2/build' make[2]: Entering directory '/tmp/B.ev3pxxw8/BUILD/highway-0.14.2/build' [ 10%] Linking CXX static library libhwy.a /usr/bin/cmake -P CMakeFiles/hwy.dir/cmake_clean_target.cmake /usr/bin/cmake -E cmake_link_script CMakeFiles/hwy.dir/link.txt --verbose=1 /usr/bin/ar qc libhwy.a CMakeFiles/hwy.dir/hwy/aligned_allocator.cc.o CMakeFiles/hwy.dir/hwy/nanobenchmark.cc.o CMakeFiles/hwy.dir/hwy/targets.cc.o /usr/bin/ranlib libhwy.a make[2]: Leaving directory '/tmp/B.ev3pxxw8/BUILD/highway-0.14.2/build' make[1]: Entering directory '/tmp/B.ev3pxxw8/BUILD/highway-0.14.2/build' [ 10%] Built target hwy make[1]: Leaving directory '/tmp/B.ev3pxxw8/BUILD/highway-0.14.2/build' /usr/bin/make -f CMakeFiles/hwy_benchmark.dir/build.make CMakeFiles/hwy_benchmark.dir/depend /usr/bin/make -f CMakeFiles/hwy_list_targets.dir/build.make CMakeFiles/hwy_list_targets.dir/depend make[2]: Entering directory '/tmp/B.ev3pxxw8/BUILD/highway-0.14.2/build' cd /tmp/B.ev3pxxw8/BUILD/highway-0.14.2/build && /usr/bin/cmake -E cmake_depends "Unix Makefiles" /tmp/B.ev3pxxw8/BUILD/highway-0.14.2 /tmp/B.ev3pxxw8/BUILD/highway-0.14.2 /tmp/B.ev3pxxw8/BUILD/highway-0.14.2/build /tmp/B.ev3pxxw8/BUILD/highway-0.14.2/build /tmp/B.ev3pxxw8/BUILD/highway-0.14.2/build/CMakeFiles/hwy_list_targets.dir/DependInfo.cmake --color= Scanning dependencies of target hwy_list_targets make[2]: Leaving directory '/tmp/B.ev3pxxw8/BUILD/highway-0.14.2/build' /usr/bin/make -f CMakeFiles/hwy_list_targets.dir/build.make CMakeFiles/hwy_list_targets.dir/build make[2]: Entering directory '/tmp/B.ev3pxxw8/BUILD/highway-0.14.2/build' cd /tmp/B.ev3pxxw8/BUILD/highway-0.14.2/build && /usr/bin/cmake -E cmake_depends "Unix Makefiles" /tmp/B.ev3pxxw8/BUILD/highway-0.14.2 /tmp/B.ev3pxxw8/BUILD/highway-0.14.2 /tmp/B.ev3pxxw8/BUILD/highway-0.14.2/build /tmp/B.ev3pxxw8/BUILD/highway-0.14.2/build /tmp/B.ev3pxxw8/BUILD/highway-0.14.2/build/CMakeFiles/hwy_benchmark.dir/DependInfo.cmake --color= Scanning dependencies of target hwy_benchmark make[2]: Leaving directory '/tmp/B.ev3pxxw8/BUILD/highway-0.14.2/build' /usr/bin/make -f CMakeFiles/hwy_benchmark.dir/build.make CMakeFiles/hwy_benchmark.dir/build make[2]: Entering directory '/tmp/B.ev3pxxw8/BUILD/highway-0.14.2/build' [ 13%] Building CXX object CMakeFiles/hwy_list_targets.dir/hwy/tests/list_targets.cc.o /usr/bin/x86_64-pld-linux-gnux32-g++ -I/tmp/B.ev3pxxw8/BUILD/highway-0.14.2 -O2 -fwrapv -pipe -Wformat -Werror=format-security -Wp,-D_FORTIFY_SOURCE=2 -fstack-protector-strong --param=ssp-buffer-size=4 -Werror=trampolines -fPIC -mtune=generic -march=x86-64 -DNDEBUG -DQT_NO_DEBUG -fPIE -Wno-builtin-macro-redefined -D__DATE__=\"redacted\" -D__TIMESTAMP__=\"redacted\" -D__TIME__=\"redacted\" -fmerge-all-constants -Wall -Wextra -Wconversion -Wsign-conversion -Wvla -Wnon-virtual-dtor -fmath-errno -fno-exceptions -std=c++11 -o CMakeFiles/hwy_list_targets.dir/hwy/tests/list_targets.cc.o -c /tmp/B.ev3pxxw8/BUILD/highway-0.14.2/hwy/tests/list_targets.cc make[2]: Leaving directory '/tmp/B.ev3pxxw8/BUILD/highway-0.14.2/build' make[2]: Entering directory '/tmp/B.ev3pxxw8/BUILD/highway-0.14.2/build' [ 19%] Linking CXX executable hwy_list_targets /usr/bin/cmake -E cmake_link_script CMakeFiles/hwy_list_targets.dir/link.txt --verbose=1 /usr/bin/x86_64-pld-linux-gnux32-g++ -O2 -fwrapv -pipe -Wformat -Werror=format-security -Wp,-D_FORTIFY_SOURCE=2 -fstack-protector-strong --param=ssp-buffer-size=4 -Werror=trampolines -fPIC -mtune=generic -march=x86-64 -DNDEBUG -DQT_NO_DEBUG -Wl,--as-needed -Wl,--no-copy-dt-needed-entries -Wl,-z,relro -Wl,-z,combreloc -fPIE -pie CMakeFiles/hwy_list_targets.dir/hwy/tests/list_targets.cc.o -o hwy_list_targets libhwy.a ./hwy_list_targets || ( exit 0 ) Compiled HWY_TARGETS: AVX3 AVX2 SSE4 SSSE3 Scalar HWY_BASELINE_TARGETS: Scalar Current CPU supports: SSSE3 Scalar make[2]: Leaving directory '/tmp/B.ev3pxxw8/BUILD/highway-0.14.2/build' make[1]: Entering directory '/tmp/B.ev3pxxw8/BUILD/highway-0.14.2/build' [ 19%] Built target hwy_list_targets make[1]: Leaving directory '/tmp/B.ev3pxxw8/BUILD/highway-0.14.2/build' make[2]: Entering directory '/tmp/B.ev3pxxw8/BUILD/highway-0.14.2/build' [ 8%] Building CXX object CMakeFiles/hwy_contrib.dir/hwy/contrib/image/image.cc.o /usr/bin/x86_64-pld-linux-gnux32-g++ -I/tmp/B.ev3pxxw8/BUILD/highway-0.14.2 -O2 -fwrapv -pipe -Wformat -Werror=format-security -Wp,-D_FORTIFY_SOURCE=2 -fstack-protector-strong --param=ssp-buffer-size=4 -Werror=trampolines -fPIC -mtune=generic -march=x86-64 -DNDEBUG -DQT_NO_DEBUG -fPIC -Wno-builtin-macro-redefined -D__DATE__=\"redacted\" -D__TIMESTAMP__=\"redacted\" -D__TIME__=\"redacted\" -fmerge-all-constants -Wall -Wextra -Wconversion -Wsign-conversion -Wvla -Wnon-virtual-dtor -fmath-errno -fno-exceptions -std=c++11 -o CMakeFiles/hwy_contrib.dir/hwy/contrib/image/image.cc.o -c /tmp/B.ev3pxxw8/BUILD/highway-0.14.2/hwy/contrib/image/image.cc make[2]: Leaving directory '/tmp/B.ev3pxxw8/BUILD/highway-0.14.2/build' make[2]: Entering directory '/tmp/B.ev3pxxw8/BUILD/highway-0.14.2/build' [ 21%] Linking CXX static library libhwy_contrib.a /usr/bin/cmake -P CMakeFiles/hwy_contrib.dir/cmake_clean_target.cmake /usr/bin/cmake -E cmake_link_script CMakeFiles/hwy_contrib.dir/link.txt --verbose=1 /usr/bin/ar qc libhwy_contrib.a CMakeFiles/hwy_contrib.dir/hwy/contrib/image/image.cc.o /usr/bin/ranlib libhwy_contrib.a make[2]: Leaving directory '/tmp/B.ev3pxxw8/BUILD/highway-0.14.2/build' make[1]: Entering directory '/tmp/B.ev3pxxw8/BUILD/highway-0.14.2/build' [ 21%] Built target hwy_contrib make[1]: Leaving directory '/tmp/B.ev3pxxw8/BUILD/highway-0.14.2/build' /usr/bin/make -f CMakeFiles/test_util_test.dir/build.make CMakeFiles/test_util_test.dir/depend /usr/bin/make -f CMakeFiles/swizzle_test.dir/build.make CMakeFiles/swizzle_test.dir/depend /usr/bin/make -f CMakeFiles/logical_test.dir/build.make CMakeFiles/logical_test.dir/depend /usr/bin/make -f CMakeFiles/crypto_test.dir/build.make CMakeFiles/crypto_test.dir/depend /usr/bin/make -f CMakeFiles/convert_test.dir/build.make CMakeFiles/convert_test.dir/depend /usr/bin/make -f CMakeFiles/blockwise_test.dir/build.make CMakeFiles/blockwise_test.dir/depend /usr/bin/make -f CMakeFiles/targets_test.dir/build.make CMakeFiles/targets_test.dir/depend make[2]: Entering directory '/tmp/B.ev3pxxw8/BUILD/highway-0.14.2/build' cd /tmp/B.ev3pxxw8/BUILD/highway-0.14.2/build && /usr/bin/cmake -E cmake_depends "Unix Makefiles" /tmp/B.ev3pxxw8/BUILD/highway-0.14.2 /tmp/B.ev3pxxw8/BUILD/highway-0.14.2 /tmp/B.ev3pxxw8/BUILD/highway-0.14.2/build /tmp/B.ev3pxxw8/BUILD/highway-0.14.2/build /tmp/B.ev3pxxw8/BUILD/highway-0.14.2/build/CMakeFiles/test_util_test.dir/DependInfo.cmake --color= Scanning dependencies of target test_util_test make[2]: Leaving directory '/tmp/B.ev3pxxw8/BUILD/highway-0.14.2/build' make[2]: Entering directory '/tmp/B.ev3pxxw8/BUILD/highway-0.14.2/build' cd /tmp/B.ev3pxxw8/BUILD/highway-0.14.2/build && /usr/bin/cmake -E cmake_depends "Unix Makefiles" /tmp/B.ev3pxxw8/BUILD/highway-0.14.2 /tmp/B.ev3pxxw8/BUILD/highway-0.14.2 /tmp/B.ev3pxxw8/BUILD/highway-0.14.2/build /tmp/B.ev3pxxw8/BUILD/highway-0.14.2/build /tmp/B.ev3pxxw8/BUILD/highway-0.14.2/build/CMakeFiles/logical_test.dir/DependInfo.cmake --color= Scanning dependencies of target logical_test make[2]: Leaving directory '/tmp/B.ev3pxxw8/BUILD/highway-0.14.2/build' make[2]: Entering directory '/tmp/B.ev3pxxw8/BUILD/highway-0.14.2/build' cd /tmp/B.ev3pxxw8/BUILD/highway-0.14.2/build && /usr/bin/cmake -E cmake_depends "Unix Makefiles" /tmp/B.ev3pxxw8/BUILD/highway-0.14.2 /tmp/B.ev3pxxw8/BUILD/highway-0.14.2 /tmp/B.ev3pxxw8/BUILD/highway-0.14.2/build /tmp/B.ev3pxxw8/BUILD/highway-0.14.2/build /tmp/B.ev3pxxw8/BUILD/highway-0.14.2/build/CMakeFiles/swizzle_test.dir/DependInfo.cmake --color= Scanning dependencies of target swizzle_test make[2]: Leaving directory '/tmp/B.ev3pxxw8/BUILD/highway-0.14.2/build' make[2]: Entering directory '/tmp/B.ev3pxxw8/BUILD/highway-0.14.2/build' cd /tmp/B.ev3pxxw8/BUILD/highway-0.14.2/build && /usr/bin/cmake -E cmake_depends "Unix Makefiles" /tmp/B.ev3pxxw8/BUILD/highway-0.14.2 /tmp/B.ev3pxxw8/BUILD/highway-0.14.2 /tmp/B.ev3pxxw8/BUILD/highway-0.14.2/build /tmp/B.ev3pxxw8/BUILD/highway-0.14.2/build /tmp/B.ev3pxxw8/BUILD/highway-0.14.2/build/CMakeFiles/crypto_test.dir/DependInfo.cmake --color= Scanning dependencies of target crypto_test make[2]: Leaving directory '/tmp/B.ev3pxxw8/BUILD/highway-0.14.2/build' make[2]: Entering directory '/tmp/B.ev3pxxw8/BUILD/highway-0.14.2/build' cd /tmp/B.ev3pxxw8/BUILD/highway-0.14.2/build && /usr/bin/cmake -E cmake_depends "Unix Makefiles" /tmp/B.ev3pxxw8/BUILD/highway-0.14.2 /tmp/B.ev3pxxw8/BUILD/highway-0.14.2 /tmp/B.ev3pxxw8/BUILD/highway-0.14.2/build /tmp/B.ev3pxxw8/BUILD/highway-0.14.2/build /tmp/B.ev3pxxw8/BUILD/highway-0.14.2/build/CMakeFiles/blockwise_test.dir/DependInfo.cmake --color= Scanning dependencies of target blockwise_test make[2]: Leaving directory '/tmp/B.ev3pxxw8/BUILD/highway-0.14.2/build' make[2]: Entering directory '/tmp/B.ev3pxxw8/BUILD/highway-0.14.2/build' cd /tmp/B.ev3pxxw8/BUILD/highway-0.14.2/build && /usr/bin/cmake -E cmake_depends "Unix Makefiles" /tmp/B.ev3pxxw8/BUILD/highway-0.14.2 /tmp/B.ev3pxxw8/BUILD/highway-0.14.2 /tmp/B.ev3pxxw8/BUILD/highway-0.14.2/build /tmp/B.ev3pxxw8/BUILD/highway-0.14.2/build /tmp/B.ev3pxxw8/BUILD/highway-0.14.2/build/CMakeFiles/convert_test.dir/DependInfo.cmake --color= Scanning dependencies of target convert_test make[2]: Leaving directory '/tmp/B.ev3pxxw8/BUILD/highway-0.14.2/build' /usr/bin/make -f CMakeFiles/test_util_test.dir/build.make CMakeFiles/test_util_test.dir/build /usr/bin/make -f CMakeFiles/swizzle_test.dir/build.make CMakeFiles/swizzle_test.dir/build /usr/bin/make -f CMakeFiles/logical_test.dir/build.make CMakeFiles/logical_test.dir/build /usr/bin/make -f CMakeFiles/crypto_test.dir/build.make CMakeFiles/crypto_test.dir/build /usr/bin/make -f CMakeFiles/convert_test.dir/build.make CMakeFiles/convert_test.dir/build /usr/bin/make -f CMakeFiles/blockwise_test.dir/build.make CMakeFiles/blockwise_test.dir/build make[2]: Entering directory '/tmp/B.ev3pxxw8/BUILD/highway-0.14.2/build' cd /tmp/B.ev3pxxw8/BUILD/highway-0.14.2/build && /usr/bin/cmake -E cmake_depends "Unix Makefiles" /tmp/B.ev3pxxw8/BUILD/highway-0.14.2 /tmp/B.ev3pxxw8/BUILD/highway-0.14.2 /tmp/B.ev3pxxw8/BUILD/highway-0.14.2/build /tmp/B.ev3pxxw8/BUILD/highway-0.14.2/build /tmp/B.ev3pxxw8/BUILD/highway-0.14.2/build/CMakeFiles/targets_test.dir/DependInfo.cmake --color= Scanning dependencies of target targets_test make[2]: Leaving directory '/tmp/B.ev3pxxw8/BUILD/highway-0.14.2/build' /usr/bin/make -f CMakeFiles/targets_test.dir/build.make CMakeFiles/targets_test.dir/build make[2]: Entering directory '/tmp/B.ev3pxxw8/BUILD/highway-0.14.2/build' [ 17%] Building CXX object CMakeFiles/hwy_benchmark.dir/hwy/nanobenchmark.cc.o /usr/bin/x86_64-pld-linux-gnux32-g++ -I/tmp/B.ev3pxxw8/BUILD/highway-0.14.2 -O2 -fwrapv -pipe -Wformat -Werror=format-security -Wp,-D_FORTIFY_SOURCE=2 -fstack-protector-strong --param=ssp-buffer-size=4 -Werror=trampolines -fPIC -mtune=generic -march=x86-64 -DNDEBUG -DQT_NO_DEBUG -fPIE -Wno-builtin-macro-redefined -D__DATE__=\"redacted\" -D__TIMESTAMP__=\"redacted\" -D__TIME__=\"redacted\" -fmerge-all-constants -Wall -Wextra -Wconversion -Wsign-conversion -Wvla -Wnon-virtual-dtor -fmath-errno -fno-exceptions -std=c++11 -o CMakeFiles/hwy_benchmark.dir/hwy/nanobenchmark.cc.o -c /tmp/B.ev3pxxw8/BUILD/highway-0.14.2/hwy/nanobenchmark.cc make[2]: Leaving directory '/tmp/B.ev3pxxw8/BUILD/highway-0.14.2/build' /usr/bin/make -f CMakeFiles/base_test.dir/build.make CMakeFiles/base_test.dir/depend make[2]: Entering directory '/tmp/B.ev3pxxw8/BUILD/highway-0.14.2/build' cd /tmp/B.ev3pxxw8/BUILD/highway-0.14.2/build && /usr/bin/cmake -E cmake_depends "Unix Makefiles" /tmp/B.ev3pxxw8/BUILD/highway-0.14.2 /tmp/B.ev3pxxw8/BUILD/highway-0.14.2 /tmp/B.ev3pxxw8/BUILD/highway-0.14.2/build /tmp/B.ev3pxxw8/BUILD/highway-0.14.2/build /tmp/B.ev3pxxw8/BUILD/highway-0.14.2/build/CMakeFiles/base_test.dir/DependInfo.cmake --color= Scanning dependencies of target base_test make[2]: Leaving directory '/tmp/B.ev3pxxw8/BUILD/highway-0.14.2/build' /usr/bin/make -f CMakeFiles/base_test.dir/build.make CMakeFiles/base_test.dir/build make[2]: Entering directory '/tmp/B.ev3pxxw8/BUILD/highway-0.14.2/build' [ 36%] Building CXX object CMakeFiles/targets_test.dir/hwy/targets_test.cc.o /usr/bin/x86_64-pld-linux-gnux32-g++ -I/tmp/B.ev3pxxw8/BUILD/highway-0.14.2 -O2 -fwrapv -pipe -Wformat -Werror=format-security -Wp,-D_FORTIFY_SOURCE=2 -fstack-protector-strong --param=ssp-buffer-size=4 -Werror=trampolines -fPIC -mtune=generic -march=x86-64 -DNDEBUG -DQT_NO_DEBUG -fPIE -Wno-builtin-macro-redefined -D__DATE__=\"redacted\" -D__TIMESTAMP__=\"redacted\" -D__TIME__=\"redacted\" -fmerge-all-constants -Wall -Wextra -Wconversion -Wsign-conversion -Wvla -Wnon-virtual-dtor -fmath-errno -fno-exceptions -DHWY_IS_TEST=1 -std=c++11 -o CMakeFiles/targets_test.dir/hwy/targets_test.cc.o -c /tmp/B.ev3pxxw8/BUILD/highway-0.14.2/hwy/targets_test.cc make[2]: Leaving directory '/tmp/B.ev3pxxw8/BUILD/highway-0.14.2/build' make[2]: Entering directory '/tmp/B.ev3pxxw8/BUILD/highway-0.14.2/build' [ 41%] Linking CXX executable tests/targets_test /usr/bin/cmake -E cmake_link_script CMakeFiles/targets_test.dir/link.txt --verbose=1 /usr/bin/x86_64-pld-linux-gnux32-g++ -O2 -fwrapv -pipe -Wformat -Werror=format-security -Wp,-D_FORTIFY_SOURCE=2 -fstack-protector-strong --param=ssp-buffer-size=4 -Werror=trampolines -fPIC -mtune=generic -march=x86-64 -DNDEBUG -DQT_NO_DEBUG -Wl,--as-needed -Wl,--no-copy-dt-needed-entries -Wl,-z,relro -Wl,-z,combreloc -fPIE -pie CMakeFiles/targets_test.dir/hwy/targets_test.cc.o -o tests/targets_test libhwy.a libhwy_contrib.a /usr/libx32/libgtest.so /usr/libx32/libgtest_main.so /usr/libx32/libgtest.so /usr/bin/cmake -D TEST_TARGET=targets_test -D TEST_EXECUTABLE=/tmp/B.ev3pxxw8/BUILD/highway-0.14.2/build/tests/targets_test -D TEST_EXECUTOR= -D TEST_WORKING_DIR=/tmp/B.ev3pxxw8/BUILD/highway-0.14.2/build -D TEST_EXTRA_ARGS= -D TEST_PROPERTIES= -D TEST_PREFIX= -D TEST_SUFFIX= -D NO_PRETTY_TYPES=FALSE -D NO_PRETTY_VALUES=FALSE -D TEST_LIST=targets_test_TESTS -D CTEST_FILE=/tmp/B.ev3pxxw8/BUILD/highway-0.14.2/build/targets_test[1]_tests.cmake -D TEST_DISCOVERY_TIMEOUT=60 -P /usr/share/cmake/Modules/GoogleTestAddTests.cmake make[2]: Leaving directory '/tmp/B.ev3pxxw8/BUILD/highway-0.14.2/build' make[1]: Entering directory '/tmp/B.ev3pxxw8/BUILD/highway-0.14.2/build' [ 41%] Built target targets_test make[1]: Leaving directory '/tmp/B.ev3pxxw8/BUILD/highway-0.14.2/build' /usr/bin/make -f CMakeFiles/aligned_allocator_test.dir/build.make CMakeFiles/aligned_allocator_test.dir/depend make[2]: Entering directory '/tmp/B.ev3pxxw8/BUILD/highway-0.14.2/build' [ 15%] Building CXX object CMakeFiles/hwy_benchmark.dir/hwy/examples/benchmark.cc.o /usr/bin/x86_64-pld-linux-gnux32-g++ -I/tmp/B.ev3pxxw8/BUILD/highway-0.14.2 -O2 -fwrapv -pipe -Wformat -Werror=format-security -Wp,-D_FORTIFY_SOURCE=2 -fstack-protector-strong --param=ssp-buffer-size=4 -Werror=trampolines -fPIC -mtune=generic -march=x86-64 -DNDEBUG -DQT_NO_DEBUG -fPIE -Wno-builtin-macro-redefined -D__DATE__=\"redacted\" -D__TIMESTAMP__=\"redacted\" -D__TIME__=\"redacted\" -fmerge-all-constants -Wall -Wextra -Wconversion -Wsign-conversion -Wvla -Wnon-virtual-dtor -fmath-errno -fno-exceptions -std=c++11 -o CMakeFiles/hwy_benchmark.dir/hwy/examples/benchmark.cc.o -c /tmp/B.ev3pxxw8/BUILD/highway-0.14.2/hwy/examples/benchmark.cc make[2]: Leaving directory '/tmp/B.ev3pxxw8/BUILD/highway-0.14.2/build' make[2]: Entering directory '/tmp/B.ev3pxxw8/BUILD/highway-0.14.2/build' cd /tmp/B.ev3pxxw8/BUILD/highway-0.14.2/build && /usr/bin/cmake -E cmake_depends "Unix Makefiles" /tmp/B.ev3pxxw8/BUILD/highway-0.14.2 /tmp/B.ev3pxxw8/BUILD/highway-0.14.2 /tmp/B.ev3pxxw8/BUILD/highway-0.14.2/build /tmp/B.ev3pxxw8/BUILD/highway-0.14.2/build /tmp/B.ev3pxxw8/BUILD/highway-0.14.2/build/CMakeFiles/aligned_allocator_test.dir/DependInfo.cmake --color= Scanning dependencies of target aligned_allocator_test make[2]: Leaving directory '/tmp/B.ev3pxxw8/BUILD/highway-0.14.2/build' /usr/bin/make -f CMakeFiles/aligned_allocator_test.dir/build.make CMakeFiles/aligned_allocator_test.dir/build make[2]: Entering directory '/tmp/B.ev3pxxw8/BUILD/highway-0.14.2/build' [ 43%] Linking CXX executable examples/hwy_benchmark /usr/bin/cmake -E cmake_link_script CMakeFiles/hwy_benchmark.dir/link.txt --verbose=1 /usr/bin/x86_64-pld-linux-gnux32-g++ -O2 -fwrapv -pipe -Wformat -Werror=format-security -Wp,-D_FORTIFY_SOURCE=2 -fstack-protector-strong --param=ssp-buffer-size=4 -Werror=trampolines -fPIC -mtune=generic -march=x86-64 -DNDEBUG -DQT_NO_DEBUG -Wl,--as-needed -Wl,--no-copy-dt-needed-entries -Wl,-z,relro -Wl,-z,combreloc -fPIE -pie CMakeFiles/hwy_benchmark.dir/hwy/examples/benchmark.cc.o CMakeFiles/hwy_benchmark.dir/hwy/nanobenchmark.cc.o -o examples/hwy_benchmark libhwy.a make[2]: Leaving directory '/tmp/B.ev3pxxw8/BUILD/highway-0.14.2/build' make[1]: Entering directory '/tmp/B.ev3pxxw8/BUILD/highway-0.14.2/build' [ 45%] Built target hwy_benchmark make[1]: Leaving directory '/tmp/B.ev3pxxw8/BUILD/highway-0.14.2/build' /usr/bin/make -f CMakeFiles/arithmetic_test.dir/build.make CMakeFiles/arithmetic_test.dir/depend make[2]: Entering directory '/tmp/B.ev3pxxw8/BUILD/highway-0.14.2/build' cd /tmp/B.ev3pxxw8/BUILD/highway-0.14.2/build && /usr/bin/cmake -E cmake_depends "Unix Makefiles" /tmp/B.ev3pxxw8/BUILD/highway-0.14.2 /tmp/B.ev3pxxw8/BUILD/highway-0.14.2 /tmp/B.ev3pxxw8/BUILD/highway-0.14.2/build /tmp/B.ev3pxxw8/BUILD/highway-0.14.2/build /tmp/B.ev3pxxw8/BUILD/highway-0.14.2/build/CMakeFiles/arithmetic_test.dir/DependInfo.cmake --color= Scanning dependencies of target arithmetic_test make[2]: Leaving directory '/tmp/B.ev3pxxw8/BUILD/highway-0.14.2/build' /usr/bin/make -f CMakeFiles/arithmetic_test.dir/build.make CMakeFiles/arithmetic_test.dir/build make[2]: Entering directory '/tmp/B.ev3pxxw8/BUILD/highway-0.14.2/build' [ 32%] Building CXX object CMakeFiles/crypto_test.dir/hwy/tests/crypto_test.cc.o /usr/bin/x86_64-pld-linux-gnux32-g++ -I/tmp/B.ev3pxxw8/BUILD/highway-0.14.2 -O2 -fwrapv -pipe -Wformat -Werror=format-security -Wp,-D_FORTIFY_SOURCE=2 -fstack-protector-strong --param=ssp-buffer-size=4 -Werror=trampolines -fPIC -mtune=generic -march=x86-64 -DNDEBUG -DQT_NO_DEBUG -fPIE -Wno-builtin-macro-redefined -D__DATE__=\"redacted\" -D__TIMESTAMP__=\"redacted\" -D__TIME__=\"redacted\" -fmerge-all-constants -Wall -Wextra -Wconversion -Wsign-conversion -Wvla -Wnon-virtual-dtor -fmath-errno -fno-exceptions -DHWY_IS_TEST=1 -std=c++11 -o CMakeFiles/crypto_test.dir/hwy/tests/crypto_test.cc.o -c /tmp/B.ev3pxxw8/BUILD/highway-0.14.2/hwy/tests/crypto_test.cc make[2]: Leaving directory '/tmp/B.ev3pxxw8/BUILD/highway-0.14.2/build' make[2]: Entering directory '/tmp/B.ev3pxxw8/BUILD/highway-0.14.2/build' [ 45%] Building CXX object CMakeFiles/aligned_allocator_test.dir/hwy/aligned_allocator_test.cc.o /usr/bin/x86_64-pld-linux-gnux32-g++ -I/tmp/B.ev3pxxw8/BUILD/highway-0.14.2 -O2 -fwrapv -pipe -Wformat -Werror=format-security -Wp,-D_FORTIFY_SOURCE=2 -fstack-protector-strong --param=ssp-buffer-size=4 -Werror=trampolines -fPIC -mtune=generic -march=x86-64 -DNDEBUG -DQT_NO_DEBUG -fPIE -Wno-builtin-macro-redefined -D__DATE__=\"redacted\" -D__TIMESTAMP__=\"redacted\" -D__TIME__=\"redacted\" -fmerge-all-constants -Wall -Wextra -Wconversion -Wsign-conversion -Wvla -Wnon-virtual-dtor -fmath-errno -fno-exceptions -DHWY_IS_TEST=1 -std=c++11 -o CMakeFiles/aligned_allocator_test.dir/hwy/aligned_allocator_test.cc.o -c /tmp/B.ev3pxxw8/BUILD/highway-0.14.2/hwy/aligned_allocator_test.cc make[2]: Leaving directory '/tmp/B.ev3pxxw8/BUILD/highway-0.14.2/build' make[2]: Entering directory '/tmp/B.ev3pxxw8/BUILD/highway-0.14.2/build' [ 50%] Linking CXX executable tests/crypto_test /usr/bin/cmake -E cmake_link_script CMakeFiles/crypto_test.dir/link.txt --verbose=1 /usr/bin/x86_64-pld-linux-gnux32-g++ -O2 -fwrapv -pipe -Wformat -Werror=format-security -Wp,-D_FORTIFY_SOURCE=2 -fstack-protector-strong --param=ssp-buffer-size=4 -Werror=trampolines -fPIC -mtune=generic -march=x86-64 -DNDEBUG -DQT_NO_DEBUG -Wl,--as-needed -Wl,--no-copy-dt-needed-entries -Wl,-z,relro -Wl,-z,combreloc -fPIE -pie CMakeFiles/crypto_test.dir/hwy/tests/crypto_test.cc.o -o tests/crypto_test libhwy.a libhwy_contrib.a /usr/libx32/libgtest.so /usr/libx32/libgtest_main.so /usr/libx32/libgtest.so /usr/bin/cmake -D TEST_TARGET=crypto_test -D TEST_EXECUTABLE=/tmp/B.ev3pxxw8/BUILD/highway-0.14.2/build/tests/crypto_test -D TEST_EXECUTOR= -D TEST_WORKING_DIR=/tmp/B.ev3pxxw8/BUILD/highway-0.14.2/build -D TEST_EXTRA_ARGS= -D TEST_PROPERTIES= -D TEST_PREFIX= -D TEST_SUFFIX= -D NO_PRETTY_TYPES=FALSE -D NO_PRETTY_VALUES=FALSE -D TEST_LIST=crypto_test_TESTS -D CTEST_FILE=/tmp/B.ev3pxxw8/BUILD/highway-0.14.2/build/crypto_test[1]_tests.cmake -D TEST_DISCOVERY_TIMEOUT=60 -P /usr/share/cmake/Modules/GoogleTestAddTests.cmake make[2]: Leaving directory '/tmp/B.ev3pxxw8/BUILD/highway-0.14.2/build' make[1]: Entering directory '/tmp/B.ev3pxxw8/BUILD/highway-0.14.2/build' [ 52%] Built target crypto_test make[1]: Leaving directory '/tmp/B.ev3pxxw8/BUILD/highway-0.14.2/build' /usr/bin/make -f CMakeFiles/memory_test.dir/build.make CMakeFiles/memory_test.dir/depend make[2]: Entering directory '/tmp/B.ev3pxxw8/BUILD/highway-0.14.2/build' cd /tmp/B.ev3pxxw8/BUILD/highway-0.14.2/build && /usr/bin/cmake -E cmake_depends "Unix Makefiles" /tmp/B.ev3pxxw8/BUILD/highway-0.14.2 /tmp/B.ev3pxxw8/BUILD/highway-0.14.2 /tmp/B.ev3pxxw8/BUILD/highway-0.14.2/build /tmp/B.ev3pxxw8/BUILD/highway-0.14.2/build /tmp/B.ev3pxxw8/BUILD/highway-0.14.2/build/CMakeFiles/memory_test.dir/DependInfo.cmake --color= Scanning dependencies of target memory_test make[2]: Leaving directory '/tmp/B.ev3pxxw8/BUILD/highway-0.14.2/build' /usr/bin/make -f CMakeFiles/memory_test.dir/build.make CMakeFiles/memory_test.dir/build make[2]: Entering directory '/tmp/B.ev3pxxw8/BUILD/highway-0.14.2/build' [ 52%] Linking CXX executable tests/aligned_allocator_test /usr/bin/cmake -E cmake_link_script CMakeFiles/aligned_allocator_test.dir/link.txt --verbose=1 /usr/bin/x86_64-pld-linux-gnux32-g++ -O2 -fwrapv -pipe -Wformat -Werror=format-security -Wp,-D_FORTIFY_SOURCE=2 -fstack-protector-strong --param=ssp-buffer-size=4 -Werror=trampolines -fPIC -mtune=generic -march=x86-64 -DNDEBUG -DQT_NO_DEBUG -Wl,--as-needed -Wl,--no-copy-dt-needed-entries -Wl,-z,relro -Wl,-z,combreloc -fPIE -pie CMakeFiles/aligned_allocator_test.dir/hwy/aligned_allocator_test.cc.o -o tests/aligned_allocator_test libhwy.a libhwy_contrib.a /usr/libx32/libgtest.so /usr/libx32/libgtest_main.so /usr/libx32/libgtest.so /usr/bin/cmake -D TEST_TARGET=aligned_allocator_test -D TEST_EXECUTABLE=/tmp/B.ev3pxxw8/BUILD/highway-0.14.2/build/tests/aligned_allocator_test -D TEST_EXECUTOR= -D TEST_WORKING_DIR=/tmp/B.ev3pxxw8/BUILD/highway-0.14.2/build -D TEST_EXTRA_ARGS= -D TEST_PROPERTIES= -D TEST_PREFIX= -D TEST_SUFFIX= -D NO_PRETTY_TYPES=FALSE -D NO_PRETTY_VALUES=FALSE -D TEST_LIST=aligned_allocator_test_TESTS -D CTEST_FILE=/tmp/B.ev3pxxw8/BUILD/highway-0.14.2/build/aligned_allocator_test[1]_tests.cmake -D TEST_DISCOVERY_TIMEOUT=60 -P /usr/share/cmake/Modules/GoogleTestAddTests.cmake make[2]: Leaving directory '/tmp/B.ev3pxxw8/BUILD/highway-0.14.2/build' make[1]: Entering directory '/tmp/B.ev3pxxw8/BUILD/highway-0.14.2/build' [ 54%] Built target aligned_allocator_test make[1]: Leaving directory '/tmp/B.ev3pxxw8/BUILD/highway-0.14.2/build' /usr/bin/make -f CMakeFiles/skeleton_test.dir/build.make CMakeFiles/skeleton_test.dir/depend make[2]: Entering directory '/tmp/B.ev3pxxw8/BUILD/highway-0.14.2/build' cd /tmp/B.ev3pxxw8/BUILD/highway-0.14.2/build && /usr/bin/cmake -E cmake_depends "Unix Makefiles" /tmp/B.ev3pxxw8/BUILD/highway-0.14.2 /tmp/B.ev3pxxw8/BUILD/highway-0.14.2 /tmp/B.ev3pxxw8/BUILD/highway-0.14.2/build /tmp/B.ev3pxxw8/BUILD/highway-0.14.2/build /tmp/B.ev3pxxw8/BUILD/highway-0.14.2/build/CMakeFiles/skeleton_test.dir/DependInfo.cmake --color= Scanning dependencies of target skeleton_test make[2]: Leaving directory '/tmp/B.ev3pxxw8/BUILD/highway-0.14.2/build' /usr/bin/make -f CMakeFiles/skeleton_test.dir/build.make CMakeFiles/skeleton_test.dir/build make[2]: Entering directory '/tmp/B.ev3pxxw8/BUILD/highway-0.14.2/build' [ 39%] Building CXX object CMakeFiles/base_test.dir/hwy/base_test.cc.o /usr/bin/x86_64-pld-linux-gnux32-g++ -I/tmp/B.ev3pxxw8/BUILD/highway-0.14.2 -O2 -fwrapv -pipe -Wformat -Werror=format-security -Wp,-D_FORTIFY_SOURCE=2 -fstack-protector-strong --param=ssp-buffer-size=4 -Werror=trampolines -fPIC -mtune=generic -march=x86-64 -DNDEBUG -DQT_NO_DEBUG -fPIE -Wno-builtin-macro-redefined -D__DATE__=\"redacted\" -D__TIMESTAMP__=\"redacted\" -D__TIME__=\"redacted\" -fmerge-all-constants -Wall -Wextra -Wconversion -Wsign-conversion -Wvla -Wnon-virtual-dtor -fmath-errno -fno-exceptions -DHWY_IS_TEST=1 -std=c++11 -o CMakeFiles/base_test.dir/hwy/base_test.cc.o -c /tmp/B.ev3pxxw8/BUILD/highway-0.14.2/hwy/base_test.cc make[2]: Leaving directory '/tmp/B.ev3pxxw8/BUILD/highway-0.14.2/build' make[2]: Entering directory '/tmp/B.ev3pxxw8/BUILD/highway-0.14.2/build' [ 58%] Linking CXX executable tests/base_test /usr/bin/cmake -E cmake_link_script CMakeFiles/base_test.dir/link.txt --verbose=1 /usr/bin/x86_64-pld-linux-gnux32-g++ -O2 -fwrapv -pipe -Wformat -Werror=format-security -Wp,-D_FORTIFY_SOURCE=2 -fstack-protector-strong --param=ssp-buffer-size=4 -Werror=trampolines -fPIC -mtune=generic -march=x86-64 -DNDEBUG -DQT_NO_DEBUG -Wl,--as-needed -Wl,--no-copy-dt-needed-entries -Wl,-z,relro -Wl,-z,combreloc -fPIE -pie CMakeFiles/base_test.dir/hwy/base_test.cc.o -o tests/base_test libhwy.a libhwy_contrib.a /usr/libx32/libgtest.so /usr/libx32/libgtest_main.so /usr/libx32/libgtest.so /usr/bin/cmake -D TEST_TARGET=base_test -D TEST_EXECUTABLE=/tmp/B.ev3pxxw8/BUILD/highway-0.14.2/build/tests/base_test -D TEST_EXECUTOR= -D TEST_WORKING_DIR=/tmp/B.ev3pxxw8/BUILD/highway-0.14.2/build -D TEST_EXTRA_ARGS= -D TEST_PROPERTIES= -D TEST_PREFIX= -D TEST_SUFFIX= -D NO_PRETTY_TYPES=FALSE -D NO_PRETTY_VALUES=FALSE -D TEST_LIST=base_test_TESTS -D CTEST_FILE=/tmp/B.ev3pxxw8/BUILD/highway-0.14.2/build/base_test[1]_tests.cmake -D TEST_DISCOVERY_TIMEOUT=60 -P /usr/share/cmake/Modules/GoogleTestAddTests.cmake make[2]: Leaving directory '/tmp/B.ev3pxxw8/BUILD/highway-0.14.2/build' make[1]: Entering directory '/tmp/B.ev3pxxw8/BUILD/highway-0.14.2/build' [ 58%] Built target base_test make[1]: Leaving directory '/tmp/B.ev3pxxw8/BUILD/highway-0.14.2/build' /usr/bin/make -f CMakeFiles/compare_test.dir/build.make CMakeFiles/compare_test.dir/depend make[2]: Entering directory '/tmp/B.ev3pxxw8/BUILD/highway-0.14.2/build' cd /tmp/B.ev3pxxw8/BUILD/highway-0.14.2/build && /usr/bin/cmake -E cmake_depends "Unix Makefiles" /tmp/B.ev3pxxw8/BUILD/highway-0.14.2 /tmp/B.ev3pxxw8/BUILD/highway-0.14.2 /tmp/B.ev3pxxw8/BUILD/highway-0.14.2/build /tmp/B.ev3pxxw8/BUILD/highway-0.14.2/build /tmp/B.ev3pxxw8/BUILD/highway-0.14.2/build/CMakeFiles/compare_test.dir/DependInfo.cmake --color= Scanning dependencies of target compare_test make[2]: Leaving directory '/tmp/B.ev3pxxw8/BUILD/highway-0.14.2/build' /usr/bin/make -f CMakeFiles/compare_test.dir/build.make CMakeFiles/compare_test.dir/build make[2]: Entering directory '/tmp/B.ev3pxxw8/BUILD/highway-0.14.2/build' [ 26%] Building CXX object CMakeFiles/test_util_test.dir/hwy/tests/test_util_test.cc.o /usr/bin/x86_64-pld-linux-gnux32-g++ -I/tmp/B.ev3pxxw8/BUILD/highway-0.14.2 -O2 -fwrapv -pipe -Wformat -Werror=format-security -Wp,-D_FORTIFY_SOURCE=2 -fstack-protector-strong --param=ssp-buffer-size=4 -Werror=trampolines -fPIC -mtune=generic -march=x86-64 -DNDEBUG -DQT_NO_DEBUG -fPIE -Wno-builtin-macro-redefined -D__DATE__=\"redacted\" -D__TIMESTAMP__=\"redacted\" -D__TIME__=\"redacted\" -fmerge-all-constants -Wall -Wextra -Wconversion -Wsign-conversion -Wvla -Wnon-virtual-dtor -fmath-errno -fno-exceptions -DHWY_IS_TEST=1 -std=c++11 -o CMakeFiles/test_util_test.dir/hwy/tests/test_util_test.cc.o -c /tmp/B.ev3pxxw8/BUILD/highway-0.14.2/hwy/tests/test_util_test.cc make[2]: Leaving directory '/tmp/B.ev3pxxw8/BUILD/highway-0.14.2/build' make[2]: Entering directory '/tmp/B.ev3pxxw8/BUILD/highway-0.14.2/build' [ 63%] Linking CXX executable tests/test_util_test /usr/bin/cmake -E cmake_link_script CMakeFiles/test_util_test.dir/link.txt --verbose=1 /usr/bin/x86_64-pld-linux-gnux32-g++ -O2 -fwrapv -pipe -Wformat -Werror=format-security -Wp,-D_FORTIFY_SOURCE=2 -fstack-protector-strong --param=ssp-buffer-size=4 -Werror=trampolines -fPIC -mtune=generic -march=x86-64 -DNDEBUG -DQT_NO_DEBUG -Wl,--as-needed -Wl,--no-copy-dt-needed-entries -Wl,-z,relro -Wl,-z,combreloc -fPIE -pie CMakeFiles/test_util_test.dir/hwy/tests/test_util_test.cc.o -o tests/test_util_test libhwy.a libhwy_contrib.a /usr/libx32/libgtest.so /usr/libx32/libgtest_main.so /usr/libx32/libgtest.so /usr/bin/cmake -D TEST_TARGET=test_util_test -D TEST_EXECUTABLE=/tmp/B.ev3pxxw8/BUILD/highway-0.14.2/build/tests/test_util_test -D TEST_EXECUTOR= -D TEST_WORKING_DIR=/tmp/B.ev3pxxw8/BUILD/highway-0.14.2/build -D TEST_EXTRA_ARGS= -D TEST_PROPERTIES= -D TEST_PREFIX= -D TEST_SUFFIX= -D NO_PRETTY_TYPES=FALSE -D NO_PRETTY_VALUES=FALSE -D TEST_LIST=test_util_test_TESTS -D CTEST_FILE=/tmp/B.ev3pxxw8/BUILD/highway-0.14.2/build/test_util_test[1]_tests.cmake -D TEST_DISCOVERY_TIMEOUT=60 -P /usr/share/cmake/Modules/GoogleTestAddTests.cmake make[2]: Leaving directory '/tmp/B.ev3pxxw8/BUILD/highway-0.14.2/build' make[1]: Entering directory '/tmp/B.ev3pxxw8/BUILD/highway-0.14.2/build' [ 63%] Built target test_util_test make[1]: Leaving directory '/tmp/B.ev3pxxw8/BUILD/highway-0.14.2/build' make[2]: Entering directory '/tmp/B.ev3pxxw8/BUILD/highway-0.14.2/build' [ 65%] Building CXX object CMakeFiles/skeleton_test.dir/hwy/examples/skeleton.cc.o /usr/bin/x86_64-pld-linux-gnux32-g++ -I/tmp/B.ev3pxxw8/BUILD/highway-0.14.2 -O2 -fwrapv -pipe -Wformat -Werror=format-security -Wp,-D_FORTIFY_SOURCE=2 -fstack-protector-strong --param=ssp-buffer-size=4 -Werror=trampolines -fPIC -mtune=generic -march=x86-64 -DNDEBUG -DQT_NO_DEBUG -fPIE -Wno-builtin-macro-redefined -D__DATE__=\"redacted\" -D__TIMESTAMP__=\"redacted\" -D__TIME__=\"redacted\" -fmerge-all-constants -Wall -Wextra -Wconversion -Wsign-conversion -Wvla -Wnon-virtual-dtor -fmath-errno -fno-exceptions -DHWY_IS_TEST=1 -std=c++11 -o CMakeFiles/skeleton_test.dir/hwy/examples/skeleton.cc.o -c /tmp/B.ev3pxxw8/BUILD/highway-0.14.2/hwy/examples/skeleton.cc make[2]: Leaving directory '/tmp/B.ev3pxxw8/BUILD/highway-0.14.2/build' /usr/bin/make -f CMakeFiles/combine_test.dir/build.make CMakeFiles/combine_test.dir/depend make[2]: Entering directory '/tmp/B.ev3pxxw8/BUILD/highway-0.14.2/build' cd /tmp/B.ev3pxxw8/BUILD/highway-0.14.2/build && /usr/bin/cmake -E cmake_depends "Unix Makefiles" /tmp/B.ev3pxxw8/BUILD/highway-0.14.2 /tmp/B.ev3pxxw8/BUILD/highway-0.14.2 /tmp/B.ev3pxxw8/BUILD/highway-0.14.2/build /tmp/B.ev3pxxw8/BUILD/highway-0.14.2/build /tmp/B.ev3pxxw8/BUILD/highway-0.14.2/build/CMakeFiles/combine_test.dir/DependInfo.cmake --color= Scanning dependencies of target combine_test make[2]: Leaving directory '/tmp/B.ev3pxxw8/BUILD/highway-0.14.2/build' /usr/bin/make -f CMakeFiles/combine_test.dir/build.make CMakeFiles/combine_test.dir/build make[2]: Entering directory '/tmp/B.ev3pxxw8/BUILD/highway-0.14.2/build' [ 56%] Building CXX object CMakeFiles/skeleton_test.dir/hwy/examples/skeleton_test.cc.o /usr/bin/x86_64-pld-linux-gnux32-g++ -I/tmp/B.ev3pxxw8/BUILD/highway-0.14.2 -O2 -fwrapv -pipe -Wformat -Werror=format-security -Wp,-D_FORTIFY_SOURCE=2 -fstack-protector-strong --param=ssp-buffer-size=4 -Werror=trampolines -fPIC -mtune=generic -march=x86-64 -DNDEBUG -DQT_NO_DEBUG -fPIE -Wno-builtin-macro-redefined -D__DATE__=\"redacted\" -D__TIMESTAMP__=\"redacted\" -D__TIME__=\"redacted\" -fmerge-all-constants -Wall -Wextra -Wconversion -Wsign-conversion -Wvla -Wnon-virtual-dtor -fmath-errno -fno-exceptions -DHWY_IS_TEST=1 -std=c++11 -o CMakeFiles/skeleton_test.dir/hwy/examples/skeleton_test.cc.o -c /tmp/B.ev3pxxw8/BUILD/highway-0.14.2/hwy/examples/skeleton_test.cc make[2]: Leaving directory '/tmp/B.ev3pxxw8/BUILD/highway-0.14.2/build' make[2]: Entering directory '/tmp/B.ev3pxxw8/BUILD/highway-0.14.2/build' [ 69%] Linking CXX executable tests/skeleton_test /usr/bin/cmake -E cmake_link_script CMakeFiles/skeleton_test.dir/link.txt --verbose=1 /usr/bin/x86_64-pld-linux-gnux32-g++ -O2 -fwrapv -pipe -Wformat -Werror=format-security -Wp,-D_FORTIFY_SOURCE=2 -fstack-protector-strong --param=ssp-buffer-size=4 -Werror=trampolines -fPIC -mtune=generic -march=x86-64 -DNDEBUG -DQT_NO_DEBUG -Wl,--as-needed -Wl,--no-copy-dt-needed-entries -Wl,-z,relro -Wl,-z,combreloc -fPIE -pie CMakeFiles/skeleton_test.dir/hwy/examples/skeleton_test.cc.o CMakeFiles/skeleton_test.dir/hwy/examples/skeleton.cc.o -o tests/skeleton_test libhwy.a libhwy_contrib.a /usr/libx32/libgtest.so /usr/libx32/libgtest_main.so /usr/libx32/libgtest.so /usr/bin/cmake -D TEST_TARGET=skeleton_test -D TEST_EXECUTABLE=/tmp/B.ev3pxxw8/BUILD/highway-0.14.2/build/tests/skeleton_test -D TEST_EXECUTOR= -D TEST_WORKING_DIR=/tmp/B.ev3pxxw8/BUILD/highway-0.14.2/build -D TEST_EXTRA_ARGS= -D TEST_PROPERTIES= -D TEST_PREFIX= -D TEST_SUFFIX= -D NO_PRETTY_TYPES=FALSE -D NO_PRETTY_VALUES=FALSE -D TEST_LIST=skeleton_test_TESTS -D CTEST_FILE=/tmp/B.ev3pxxw8/BUILD/highway-0.14.2/build/skeleton_test[1]_tests.cmake -D TEST_DISCOVERY_TIMEOUT=60 -P /usr/share/cmake/Modules/GoogleTestAddTests.cmake make[2]: Leaving directory '/tmp/B.ev3pxxw8/BUILD/highway-0.14.2/build' make[1]: Entering directory '/tmp/B.ev3pxxw8/BUILD/highway-0.14.2/build' [ 69%] Built target skeleton_test make[1]: Leaving directory '/tmp/B.ev3pxxw8/BUILD/highway-0.14.2/build' /usr/bin/make -f CMakeFiles/highway_test.dir/build.make CMakeFiles/highway_test.dir/depend make[2]: Entering directory '/tmp/B.ev3pxxw8/BUILD/highway-0.14.2/build' cd /tmp/B.ev3pxxw8/BUILD/highway-0.14.2/build && /usr/bin/cmake -E cmake_depends "Unix Makefiles" /tmp/B.ev3pxxw8/BUILD/highway-0.14.2 /tmp/B.ev3pxxw8/BUILD/highway-0.14.2 /tmp/B.ev3pxxw8/BUILD/highway-0.14.2/build /tmp/B.ev3pxxw8/BUILD/highway-0.14.2/build /tmp/B.ev3pxxw8/BUILD/highway-0.14.2/build/CMakeFiles/highway_test.dir/DependInfo.cmake --color= Scanning dependencies of target highway_test make[2]: Leaving directory '/tmp/B.ev3pxxw8/BUILD/highway-0.14.2/build' /usr/bin/make -f CMakeFiles/highway_test.dir/build.make CMakeFiles/highway_test.dir/build make[2]: Entering directory '/tmp/B.ev3pxxw8/BUILD/highway-0.14.2/build' [ 28%] Building CXX object CMakeFiles/logical_test.dir/hwy/tests/logical_test.cc.o /usr/bin/x86_64-pld-linux-gnux32-g++ -I/tmp/B.ev3pxxw8/BUILD/highway-0.14.2 -O2 -fwrapv -pipe -Wformat -Werror=format-security -Wp,-D_FORTIFY_SOURCE=2 -fstack-protector-strong --param=ssp-buffer-size=4 -Werror=trampolines -fPIC -mtune=generic -march=x86-64 -DNDEBUG -DQT_NO_DEBUG -fPIE -Wno-builtin-macro-redefined -D__DATE__=\"redacted\" -D__TIMESTAMP__=\"redacted\" -D__TIME__=\"redacted\" -fmerge-all-constants -Wall -Wextra -Wconversion -Wsign-conversion -Wvla -Wnon-virtual-dtor -fmath-errno -fno-exceptions -DHWY_IS_TEST=1 -std=c++11 -o CMakeFiles/logical_test.dir/hwy/tests/logical_test.cc.o -c /tmp/B.ev3pxxw8/BUILD/highway-0.14.2/hwy/tests/logical_test.cc make[2]: Leaving directory '/tmp/B.ev3pxxw8/BUILD/highway-0.14.2/build' make[2]: Entering directory '/tmp/B.ev3pxxw8/BUILD/highway-0.14.2/build' [ 73%] Linking CXX executable tests/logical_test /usr/bin/cmake -E cmake_link_script CMakeFiles/logical_test.dir/link.txt --verbose=1 /usr/bin/x86_64-pld-linux-gnux32-g++ -O2 -fwrapv -pipe -Wformat -Werror=format-security -Wp,-D_FORTIFY_SOURCE=2 -fstack-protector-strong --param=ssp-buffer-size=4 -Werror=trampolines -fPIC -mtune=generic -march=x86-64 -DNDEBUG -DQT_NO_DEBUG -Wl,--as-needed -Wl,--no-copy-dt-needed-entries -Wl,-z,relro -Wl,-z,combreloc -fPIE -pie CMakeFiles/logical_test.dir/hwy/tests/logical_test.cc.o -o tests/logical_test libhwy.a libhwy_contrib.a /usr/libx32/libgtest.so /usr/libx32/libgtest_main.so /usr/libx32/libgtest.so /usr/bin/cmake -D TEST_TARGET=logical_test -D TEST_EXECUTABLE=/tmp/B.ev3pxxw8/BUILD/highway-0.14.2/build/tests/logical_test -D TEST_EXECUTOR= -D TEST_WORKING_DIR=/tmp/B.ev3pxxw8/BUILD/highway-0.14.2/build -D TEST_EXTRA_ARGS= -D TEST_PROPERTIES= -D TEST_PREFIX= -D TEST_SUFFIX= -D NO_PRETTY_TYPES=FALSE -D NO_PRETTY_VALUES=FALSE -D TEST_LIST=logical_test_TESTS -D CTEST_FILE=/tmp/B.ev3pxxw8/BUILD/highway-0.14.2/build/logical_test[1]_tests.cmake -D TEST_DISCOVERY_TIMEOUT=60 -P /usr/share/cmake/Modules/GoogleTestAddTests.cmake make[2]: Leaving directory '/tmp/B.ev3pxxw8/BUILD/highway-0.14.2/build' make[1]: Entering directory '/tmp/B.ev3pxxw8/BUILD/highway-0.14.2/build' [ 73%] Built target logical_test make[1]: Leaving directory '/tmp/B.ev3pxxw8/BUILD/highway-0.14.2/build' /usr/bin/make -f CMakeFiles/image_test.dir/build.make CMakeFiles/image_test.dir/depend make[2]: Entering directory '/tmp/B.ev3pxxw8/BUILD/highway-0.14.2/build' cd /tmp/B.ev3pxxw8/BUILD/highway-0.14.2/build && /usr/bin/cmake -E cmake_depends "Unix Makefiles" /tmp/B.ev3pxxw8/BUILD/highway-0.14.2 /tmp/B.ev3pxxw8/BUILD/highway-0.14.2 /tmp/B.ev3pxxw8/BUILD/highway-0.14.2/build /tmp/B.ev3pxxw8/BUILD/highway-0.14.2/build /tmp/B.ev3pxxw8/BUILD/highway-0.14.2/build/CMakeFiles/image_test.dir/DependInfo.cmake --color= Scanning dependencies of target image_test make[2]: Leaving directory '/tmp/B.ev3pxxw8/BUILD/highway-0.14.2/build' /usr/bin/make -f CMakeFiles/image_test.dir/build.make CMakeFiles/image_test.dir/build make[2]: Entering directory '/tmp/B.ev3pxxw8/BUILD/highway-0.14.2/build' [ 26%] Building CXX object CMakeFiles/swizzle_test.dir/hwy/tests/swizzle_test.cc.o /usr/bin/x86_64-pld-linux-gnux32-g++ -I/tmp/B.ev3pxxw8/BUILD/highway-0.14.2 -O2 -fwrapv -pipe -Wformat -Werror=format-security -Wp,-D_FORTIFY_SOURCE=2 -fstack-protector-strong --param=ssp-buffer-size=4 -Werror=trampolines -fPIC -mtune=generic -march=x86-64 -DNDEBUG -DQT_NO_DEBUG -fPIE -Wno-builtin-macro-redefined -D__DATE__=\"redacted\" -D__TIMESTAMP__=\"redacted\" -D__TIME__=\"redacted\" -fmerge-all-constants -Wall -Wextra -Wconversion -Wsign-conversion -Wvla -Wnon-virtual-dtor -fmath-errno -fno-exceptions -DHWY_IS_TEST=1 -std=c++11 -o CMakeFiles/swizzle_test.dir/hwy/tests/swizzle_test.cc.o -c /tmp/B.ev3pxxw8/BUILD/highway-0.14.2/hwy/tests/swizzle_test.cc make[2]: Leaving directory '/tmp/B.ev3pxxw8/BUILD/highway-0.14.2/build' make[2]: Entering directory '/tmp/B.ev3pxxw8/BUILD/highway-0.14.2/build' [ 78%] Linking CXX executable tests/swizzle_test /usr/bin/cmake -E cmake_link_script CMakeFiles/swizzle_test.dir/link.txt --verbose=1 /usr/bin/x86_64-pld-linux-gnux32-g++ -O2 -fwrapv -pipe -Wformat -Werror=format-security -Wp,-D_FORTIFY_SOURCE=2 -fstack-protector-strong --param=ssp-buffer-size=4 -Werror=trampolines -fPIC -mtune=generic -march=x86-64 -DNDEBUG -DQT_NO_DEBUG -Wl,--as-needed -Wl,--no-copy-dt-needed-entries -Wl,-z,relro -Wl,-z,combreloc -fPIE -pie CMakeFiles/swizzle_test.dir/hwy/tests/swizzle_test.cc.o -o tests/swizzle_test libhwy.a libhwy_contrib.a /usr/libx32/libgtest.so /usr/libx32/libgtest_main.so /usr/libx32/libgtest.so /usr/bin/cmake -D TEST_TARGET=swizzle_test -D TEST_EXECUTABLE=/tmp/B.ev3pxxw8/BUILD/highway-0.14.2/build/tests/swizzle_test -D TEST_EXECUTOR= -D TEST_WORKING_DIR=/tmp/B.ev3pxxw8/BUILD/highway-0.14.2/build -D TEST_EXTRA_ARGS= -D TEST_PROPERTIES= -D TEST_PREFIX= -D TEST_SUFFIX= -D NO_PRETTY_TYPES=FALSE -D NO_PRETTY_VALUES=FALSE -D TEST_LIST=swizzle_test_TESTS -D CTEST_FILE=/tmp/B.ev3pxxw8/BUILD/highway-0.14.2/build/swizzle_test[1]_tests.cmake -D TEST_DISCOVERY_TIMEOUT=60 -P /usr/share/cmake/Modules/GoogleTestAddTests.cmake make[2]: Leaving directory '/tmp/B.ev3pxxw8/BUILD/highway-0.14.2/build' make[1]: Entering directory '/tmp/B.ev3pxxw8/BUILD/highway-0.14.2/build' [ 78%] Built target swizzle_test make[1]: Leaving directory '/tmp/B.ev3pxxw8/BUILD/highway-0.14.2/build' /usr/bin/make -f CMakeFiles/mask_test.dir/build.make CMakeFiles/mask_test.dir/depend make[2]: Entering directory '/tmp/B.ev3pxxw8/BUILD/highway-0.14.2/build' cd /tmp/B.ev3pxxw8/BUILD/highway-0.14.2/build && /usr/bin/cmake -E cmake_depends "Unix Makefiles" /tmp/B.ev3pxxw8/BUILD/highway-0.14.2 /tmp/B.ev3pxxw8/BUILD/highway-0.14.2 /tmp/B.ev3pxxw8/BUILD/highway-0.14.2/build /tmp/B.ev3pxxw8/BUILD/highway-0.14.2/build /tmp/B.ev3pxxw8/BUILD/highway-0.14.2/build/CMakeFiles/mask_test.dir/DependInfo.cmake --color= Scanning dependencies of target mask_test make[2]: Leaving directory '/tmp/B.ev3pxxw8/BUILD/highway-0.14.2/build' /usr/bin/make -f CMakeFiles/mask_test.dir/build.make CMakeFiles/mask_test.dir/build make[2]: Entering directory '/tmp/B.ev3pxxw8/BUILD/highway-0.14.2/build' [ 76%] Building CXX object CMakeFiles/image_test.dir/hwy/contrib/image/image_test.cc.o /usr/bin/x86_64-pld-linux-gnux32-g++ -I/tmp/B.ev3pxxw8/BUILD/highway-0.14.2 -O2 -fwrapv -pipe -Wformat -Werror=format-security -Wp,-D_FORTIFY_SOURCE=2 -fstack-protector-strong --param=ssp-buffer-size=4 -Werror=trampolines -fPIC -mtune=generic -march=x86-64 -DNDEBUG -DQT_NO_DEBUG -fPIE -Wno-builtin-macro-redefined -D__DATE__=\"redacted\" -D__TIMESTAMP__=\"redacted\" -D__TIME__=\"redacted\" -fmerge-all-constants -Wall -Wextra -Wconversion -Wsign-conversion -Wvla -Wnon-virtual-dtor -fmath-errno -fno-exceptions -DHWY_IS_TEST=1 -std=c++11 -o CMakeFiles/image_test.dir/hwy/contrib/image/image_test.cc.o -c /tmp/B.ev3pxxw8/BUILD/highway-0.14.2/hwy/contrib/image/image_test.cc make[2]: Leaving directory '/tmp/B.ev3pxxw8/BUILD/highway-0.14.2/build' make[2]: Entering directory '/tmp/B.ev3pxxw8/BUILD/highway-0.14.2/build' [ 82%] Linking CXX executable tests/image_test /usr/bin/cmake -E cmake_link_script CMakeFiles/image_test.dir/link.txt --verbose=1 /usr/bin/x86_64-pld-linux-gnux32-g++ -O2 -fwrapv -pipe -Wformat -Werror=format-security -Wp,-D_FORTIFY_SOURCE=2 -fstack-protector-strong --param=ssp-buffer-size=4 -Werror=trampolines -fPIC -mtune=generic -march=x86-64 -DNDEBUG -DQT_NO_DEBUG -Wl,--as-needed -Wl,--no-copy-dt-needed-entries -Wl,-z,relro -Wl,-z,combreloc -fPIE -pie CMakeFiles/image_test.dir/hwy/contrib/image/image_test.cc.o -o tests/image_test libhwy.a libhwy_contrib.a /usr/libx32/libgtest.so /usr/libx32/libgtest_main.so /usr/libx32/libgtest.so /usr/bin/cmake -D TEST_TARGET=image_test -D TEST_EXECUTABLE=/tmp/B.ev3pxxw8/BUILD/highway-0.14.2/build/tests/image_test -D TEST_EXECUTOR= -D TEST_WORKING_DIR=/tmp/B.ev3pxxw8/BUILD/highway-0.14.2/build -D TEST_EXTRA_ARGS= -D TEST_PROPERTIES= -D TEST_PREFIX= -D TEST_SUFFIX= -D NO_PRETTY_TYPES=FALSE -D NO_PRETTY_VALUES=FALSE -D TEST_LIST=image_test_TESTS -D CTEST_FILE=/tmp/B.ev3pxxw8/BUILD/highway-0.14.2/build/image_test[1]_tests.cmake -D TEST_DISCOVERY_TIMEOUT=60 -P /usr/share/cmake/Modules/GoogleTestAddTests.cmake make[2]: Leaving directory '/tmp/B.ev3pxxw8/BUILD/highway-0.14.2/build' make[1]: Entering directory '/tmp/B.ev3pxxw8/BUILD/highway-0.14.2/build' [ 82%] Built target image_test make[1]: Leaving directory '/tmp/B.ev3pxxw8/BUILD/highway-0.14.2/build' make[2]: Entering directory '/tmp/B.ev3pxxw8/BUILD/highway-0.14.2/build' [ 60%] Building CXX object CMakeFiles/compare_test.dir/hwy/tests/compare_test.cc.o /usr/bin/x86_64-pld-linux-gnux32-g++ -I/tmp/B.ev3pxxw8/BUILD/highway-0.14.2 -O2 -fwrapv -pipe -Wformat -Werror=format-security -Wp,-D_FORTIFY_SOURCE=2 -fstack-protector-strong --param=ssp-buffer-size=4 -Werror=trampolines -fPIC -mtune=generic -march=x86-64 -DNDEBUG -DQT_NO_DEBUG -fPIE -Wno-builtin-macro-redefined -D__DATE__=\"redacted\" -D__TIMESTAMP__=\"redacted\" -D__TIME__=\"redacted\" -fmerge-all-constants -Wall -Wextra -Wconversion -Wsign-conversion -Wvla -Wnon-virtual-dtor -fmath-errno -fno-exceptions -DHWY_IS_TEST=1 -std=c++11 -o CMakeFiles/compare_test.dir/hwy/tests/compare_test.cc.o -c /tmp/B.ev3pxxw8/BUILD/highway-0.14.2/hwy/tests/compare_test.cc make[2]: Leaving directory '/tmp/B.ev3pxxw8/BUILD/highway-0.14.2/build' make[2]: Entering directory '/tmp/B.ev3pxxw8/BUILD/highway-0.14.2/build' [ 84%] Linking CXX executable tests/compare_test /usr/bin/cmake -E cmake_link_script CMakeFiles/compare_test.dir/link.txt --verbose=1 /usr/bin/x86_64-pld-linux-gnux32-g++ -O2 -fwrapv -pipe -Wformat -Werror=format-security -Wp,-D_FORTIFY_SOURCE=2 -fstack-protector-strong --param=ssp-buffer-size=4 -Werror=trampolines -fPIC -mtune=generic -march=x86-64 -DNDEBUG -DQT_NO_DEBUG -Wl,--as-needed -Wl,--no-copy-dt-needed-entries -Wl,-z,relro -Wl,-z,combreloc -fPIE -pie CMakeFiles/compare_test.dir/hwy/tests/compare_test.cc.o -o tests/compare_test libhwy.a libhwy_contrib.a /usr/libx32/libgtest.so /usr/libx32/libgtest_main.so /usr/libx32/libgtest.so /usr/bin/cmake -D TEST_TARGET=compare_test -D TEST_EXECUTABLE=/tmp/B.ev3pxxw8/BUILD/highway-0.14.2/build/tests/compare_test -D TEST_EXECUTOR= -D TEST_WORKING_DIR=/tmp/B.ev3pxxw8/BUILD/highway-0.14.2/build -D TEST_EXTRA_ARGS= -D TEST_PROPERTIES= -D TEST_PREFIX= -D TEST_SUFFIX= -D NO_PRETTY_TYPES=FALSE -D NO_PRETTY_VALUES=FALSE -D TEST_LIST=compare_test_TESTS -D CTEST_FILE=/tmp/B.ev3pxxw8/BUILD/highway-0.14.2/build/compare_test[1]_tests.cmake -D TEST_DISCOVERY_TIMEOUT=60 -P /usr/share/cmake/Modules/GoogleTestAddTests.cmake make[2]: Leaving directory '/tmp/B.ev3pxxw8/BUILD/highway-0.14.2/build' make[1]: Entering directory '/tmp/B.ev3pxxw8/BUILD/highway-0.14.2/build' [ 84%] Built target compare_test make[1]: Leaving directory '/tmp/B.ev3pxxw8/BUILD/highway-0.14.2/build' make[2]: Entering directory '/tmp/B.ev3pxxw8/BUILD/highway-0.14.2/build' [ 71%] Building CXX object CMakeFiles/highway_test.dir/hwy/highway_test.cc.o /usr/bin/x86_64-pld-linux-gnux32-g++ -I/tmp/B.ev3pxxw8/BUILD/highway-0.14.2 -O2 -fwrapv -pipe -Wformat -Werror=format-security -Wp,-D_FORTIFY_SOURCE=2 -fstack-protector-strong --param=ssp-buffer-size=4 -Werror=trampolines -fPIC -mtune=generic -march=x86-64 -DNDEBUG -DQT_NO_DEBUG -fPIE -Wno-builtin-macro-redefined -D__DATE__=\"redacted\" -D__TIMESTAMP__=\"redacted\" -D__TIME__=\"redacted\" -fmerge-all-constants -Wall -Wextra -Wconversion -Wsign-conversion -Wvla -Wnon-virtual-dtor -fmath-errno -fno-exceptions -DHWY_IS_TEST=1 -std=c++11 -o CMakeFiles/highway_test.dir/hwy/highway_test.cc.o -c /tmp/B.ev3pxxw8/BUILD/highway-0.14.2/hwy/highway_test.cc make[2]: Leaving directory '/tmp/B.ev3pxxw8/BUILD/highway-0.14.2/build' make[2]: *** Deleting file 'tests/highway_test' make[2]: Entering directory '/tmp/B.ev3pxxw8/BUILD/highway-0.14.2/build' [ 86%] Linking CXX executable tests/highway_test /usr/bin/cmake -E cmake_link_script CMakeFiles/highway_test.dir/link.txt --verbose=1 /usr/bin/x86_64-pld-linux-gnux32-g++ -O2 -fwrapv -pipe -Wformat -Werror=format-security -Wp,-D_FORTIFY_SOURCE=2 -fstack-protector-strong --param=ssp-buffer-size=4 -Werror=trampolines -fPIC -mtune=generic -march=x86-64 -DNDEBUG -DQT_NO_DEBUG -Wl,--as-needed -Wl,--no-copy-dt-needed-entries -Wl,-z,relro -Wl,-z,combreloc -fPIE -pie CMakeFiles/highway_test.dir/hwy/highway_test.cc.o -o tests/highway_test libhwy.a libhwy_contrib.a /usr/libx32/libgtest.so /usr/libx32/libgtest_main.so /usr/libx32/libgtest.so /usr/bin/cmake -D TEST_TARGET=highway_test -D TEST_EXECUTABLE=/tmp/B.ev3pxxw8/BUILD/highway-0.14.2/build/tests/highway_test -D TEST_EXECUTOR= -D TEST_WORKING_DIR=/tmp/B.ev3pxxw8/BUILD/highway-0.14.2/build -D TEST_EXTRA_ARGS= -D TEST_PROPERTIES= -D TEST_PREFIX= -D TEST_SUFFIX= -D NO_PRETTY_TYPES=FALSE -D NO_PRETTY_VALUES=FALSE -D TEST_LIST=highway_test_TESTS -D CTEST_FILE=/tmp/B.ev3pxxw8/BUILD/highway-0.14.2/build/highway_test[1]_tests.cmake -D TEST_DISCOVERY_TIMEOUT=60 -P /usr/share/cmake/Modules/GoogleTestAddTests.cmake CMake Error at /usr/share/cmake/Modules/GoogleTestAddTests.cmake:40 (message): Error running test executable. Path: '/tmp/B.ev3pxxw8/BUILD/highway-0.14.2/build/tests/highway_test' Result: Illegal instruction Output: make[2]: *** [CMakeFiles/highway_test.dir/build.make:113: tests/highway_test] Error 1 make[2]: Leaving directory '/tmp/B.ev3pxxw8/BUILD/highway-0.14.2/build' make[1]: *** [CMakeFiles/Makefile2:1046: CMakeFiles/highway_test.dir/all] Error 2 make[1]: *** Waiting for unfinished jobs.... make[2]: Entering directory '/tmp/B.ev3pxxw8/BUILD/highway-0.14.2/build' [ 54%] Building CXX object CMakeFiles/memory_test.dir/hwy/tests/memory_test.cc.o /usr/bin/x86_64-pld-linux-gnux32-g++ -I/tmp/B.ev3pxxw8/BUILD/highway-0.14.2 -O2 -fwrapv -pipe -Wformat -Werror=format-security -Wp,-D_FORTIFY_SOURCE=2 -fstack-protector-strong --param=ssp-buffer-size=4 -Werror=trampolines -fPIC -mtune=generic -march=x86-64 -DNDEBUG -DQT_NO_DEBUG -fPIE -Wno-builtin-macro-redefined -D__DATE__=\"redacted\" -D__TIMESTAMP__=\"redacted\" -D__TIME__=\"redacted\" -fmerge-all-constants -Wall -Wextra -Wconversion -Wsign-conversion -Wvla -Wnon-virtual-dtor -fmath-errno -fno-exceptions -DHWY_IS_TEST=1 -std=c++11 -o CMakeFiles/memory_test.dir/hwy/tests/memory_test.cc.o -c /tmp/B.ev3pxxw8/BUILD/highway-0.14.2/hwy/tests/memory_test.cc make[2]: Leaving directory '/tmp/B.ev3pxxw8/BUILD/highway-0.14.2/build' make[2]: Entering directory '/tmp/B.ev3pxxw8/BUILD/highway-0.14.2/build' [ 89%] Linking CXX executable tests/memory_test /usr/bin/cmake -E cmake_link_script CMakeFiles/memory_test.dir/link.txt --verbose=1 /usr/bin/x86_64-pld-linux-gnux32-g++ -O2 -fwrapv -pipe -Wformat -Werror=format-security -Wp,-D_FORTIFY_SOURCE=2 -fstack-protector-strong --param=ssp-buffer-size=4 -Werror=trampolines -fPIC -mtune=generic -march=x86-64 -DNDEBUG -DQT_NO_DEBUG -Wl,--as-needed -Wl,--no-copy-dt-needed-entries -Wl,-z,relro -Wl,-z,combreloc -fPIE -pie CMakeFiles/memory_test.dir/hwy/tests/memory_test.cc.o -o tests/memory_test libhwy.a libhwy_contrib.a /usr/libx32/libgtest.so /usr/libx32/libgtest_main.so /usr/libx32/libgtest.so /usr/bin/cmake -D TEST_TARGET=memory_test -D TEST_EXECUTABLE=/tmp/B.ev3pxxw8/BUILD/highway-0.14.2/build/tests/memory_test -D TEST_EXECUTOR= -D TEST_WORKING_DIR=/tmp/B.ev3pxxw8/BUILD/highway-0.14.2/build -D TEST_EXTRA_ARGS= -D TEST_PROPERTIES= -D TEST_PREFIX= -D TEST_SUFFIX= -D NO_PRETTY_TYPES=FALSE -D NO_PRETTY_VALUES=FALSE -D TEST_LIST=memory_test_TESTS -D CTEST_FILE=/tmp/B.ev3pxxw8/BUILD/highway-0.14.2/build/memory_test[1]_tests.cmake -D TEST_DISCOVERY_TIMEOUT=60 -P /usr/share/cmake/Modules/GoogleTestAddTests.cmake make[2]: Leaving directory '/tmp/B.ev3pxxw8/BUILD/highway-0.14.2/build' make[1]: Entering directory '/tmp/B.ev3pxxw8/BUILD/highway-0.14.2/build' [ 89%] Built target memory_test make[1]: Leaving directory '/tmp/B.ev3pxxw8/BUILD/highway-0.14.2/build' make[2]: Entering directory '/tmp/B.ev3pxxw8/BUILD/highway-0.14.2/build' [ 32%] Building CXX object CMakeFiles/convert_test.dir/hwy/tests/convert_test.cc.o /usr/bin/x86_64-pld-linux-gnux32-g++ -I/tmp/B.ev3pxxw8/BUILD/highway-0.14.2 -O2 -fwrapv -pipe -Wformat -Werror=format-security -Wp,-D_FORTIFY_SOURCE=2 -fstack-protector-strong --param=ssp-buffer-size=4 -Werror=trampolines -fPIC -mtune=generic -march=x86-64 -DNDEBUG -DQT_NO_DEBUG -fPIE -Wno-builtin-macro-redefined -D__DATE__=\"redacted\" -D__TIMESTAMP__=\"redacted\" -D__TIME__=\"redacted\" -fmerge-all-constants -Wall -Wextra -Wconversion -Wsign-conversion -Wvla -Wnon-virtual-dtor -fmath-errno -fno-exceptions -DHWY_IS_TEST=1 -std=c++11 -o CMakeFiles/convert_test.dir/hwy/tests/convert_test.cc.o -c /tmp/B.ev3pxxw8/BUILD/highway-0.14.2/hwy/tests/convert_test.cc make[2]: Leaving directory '/tmp/B.ev3pxxw8/BUILD/highway-0.14.2/build' make[2]: Entering directory '/tmp/B.ev3pxxw8/BUILD/highway-0.14.2/build' [ 91%] Linking CXX executable tests/convert_test /usr/bin/cmake -E cmake_link_script CMakeFiles/convert_test.dir/link.txt --verbose=1 /usr/bin/x86_64-pld-linux-gnux32-g++ -O2 -fwrapv -pipe -Wformat -Werror=format-security -Wp,-D_FORTIFY_SOURCE=2 -fstack-protector-strong --param=ssp-buffer-size=4 -Werror=trampolines -fPIC -mtune=generic -march=x86-64 -DNDEBUG -DQT_NO_DEBUG -Wl,--as-needed -Wl,--no-copy-dt-needed-entries -Wl,-z,relro -Wl,-z,combreloc -fPIE -pie CMakeFiles/convert_test.dir/hwy/tests/convert_test.cc.o -o tests/convert_test libhwy.a libhwy_contrib.a /usr/libx32/libgtest.so /usr/libx32/libgtest_main.so /usr/libx32/libgtest.so /usr/bin/cmake -D TEST_TARGET=convert_test -D TEST_EXECUTABLE=/tmp/B.ev3pxxw8/BUILD/highway-0.14.2/build/tests/convert_test -D TEST_EXECUTOR= -D TEST_WORKING_DIR=/tmp/B.ev3pxxw8/BUILD/highway-0.14.2/build -D TEST_EXTRA_ARGS= -D TEST_PROPERTIES= -D TEST_PREFIX= -D TEST_SUFFIX= -D NO_PRETTY_TYPES=FALSE -D NO_PRETTY_VALUES=FALSE -D TEST_LIST=convert_test_TESTS -D CTEST_FILE=/tmp/B.ev3pxxw8/BUILD/highway-0.14.2/build/convert_test[1]_tests.cmake -D TEST_DISCOVERY_TIMEOUT=60 -P /usr/share/cmake/Modules/GoogleTestAddTests.cmake make[2]: Leaving directory '/tmp/B.ev3pxxw8/BUILD/highway-0.14.2/build' make[1]: Entering directory '/tmp/B.ev3pxxw8/BUILD/highway-0.14.2/build' [ 91%] Built target convert_test make[1]: Leaving directory '/tmp/B.ev3pxxw8/BUILD/highway-0.14.2/build' make[2]: Entering directory '/tmp/B.ev3pxxw8/BUILD/highway-0.14.2/build' [ 67%] Building CXX object CMakeFiles/combine_test.dir/hwy/tests/combine_test.cc.o /usr/bin/x86_64-pld-linux-gnux32-g++ -I/tmp/B.ev3pxxw8/BUILD/highway-0.14.2 -O2 -fwrapv -pipe -Wformat -Werror=format-security -Wp,-D_FORTIFY_SOURCE=2 -fstack-protector-strong --param=ssp-buffer-size=4 -Werror=trampolines -fPIC -mtune=generic -march=x86-64 -DNDEBUG -DQT_NO_DEBUG -fPIE -Wno-builtin-macro-redefined -D__DATE__=\"redacted\" -D__TIMESTAMP__=\"redacted\" -D__TIME__=\"redacted\" -fmerge-all-constants -Wall -Wextra -Wconversion -Wsign-conversion -Wvla -Wnon-virtual-dtor -fmath-errno -fno-exceptions -DHWY_IS_TEST=1 -std=c++11 -o CMakeFiles/combine_test.dir/hwy/tests/combine_test.cc.o -c /tmp/B.ev3pxxw8/BUILD/highway-0.14.2/hwy/tests/combine_test.cc make[2]: Leaving directory '/tmp/B.ev3pxxw8/BUILD/highway-0.14.2/build' make[2]: Entering directory '/tmp/B.ev3pxxw8/BUILD/highway-0.14.2/build' [ 93%] Linking CXX executable tests/combine_test /usr/bin/cmake -E cmake_link_script CMakeFiles/combine_test.dir/link.txt --verbose=1 /usr/bin/x86_64-pld-linux-gnux32-g++ -O2 -fwrapv -pipe -Wformat -Werror=format-security -Wp,-D_FORTIFY_SOURCE=2 -fstack-protector-strong --param=ssp-buffer-size=4 -Werror=trampolines -fPIC -mtune=generic -march=x86-64 -DNDEBUG -DQT_NO_DEBUG -Wl,--as-needed -Wl,--no-copy-dt-needed-entries -Wl,-z,relro -Wl,-z,combreloc -fPIE -pie CMakeFiles/combine_test.dir/hwy/tests/combine_test.cc.o -o tests/combine_test libhwy.a libhwy_contrib.a /usr/libx32/libgtest.so /usr/libx32/libgtest_main.so /usr/libx32/libgtest.so /usr/bin/cmake -D TEST_TARGET=combine_test -D TEST_EXECUTABLE=/tmp/B.ev3pxxw8/BUILD/highway-0.14.2/build/tests/combine_test -D TEST_EXECUTOR= -D TEST_WORKING_DIR=/tmp/B.ev3pxxw8/BUILD/highway-0.14.2/build -D TEST_EXTRA_ARGS= -D TEST_PROPERTIES= -D TEST_PREFIX= -D TEST_SUFFIX= -D NO_PRETTY_TYPES=FALSE -D NO_PRETTY_VALUES=FALSE -D TEST_LIST=combine_test_TESTS -D CTEST_FILE=/tmp/B.ev3pxxw8/BUILD/highway-0.14.2/build/combine_test[1]_tests.cmake -D TEST_DISCOVERY_TIMEOUT=60 -P /usr/share/cmake/Modules/GoogleTestAddTests.cmake make[2]: Leaving directory '/tmp/B.ev3pxxw8/BUILD/highway-0.14.2/build' make[1]: Entering directory '/tmp/B.ev3pxxw8/BUILD/highway-0.14.2/build' [ 93%] Built target combine_test make[1]: Leaving directory '/tmp/B.ev3pxxw8/BUILD/highway-0.14.2/build' make[2]: Entering directory '/tmp/B.ev3pxxw8/BUILD/highway-0.14.2/build' [ 47%] Building CXX object CMakeFiles/arithmetic_test.dir/hwy/tests/arithmetic_test.cc.o /usr/bin/x86_64-pld-linux-gnux32-g++ -I/tmp/B.ev3pxxw8/BUILD/highway-0.14.2 -O2 -fwrapv -pipe -Wformat -Werror=format-security -Wp,-D_FORTIFY_SOURCE=2 -fstack-protector-strong --param=ssp-buffer-size=4 -Werror=trampolines -fPIC -mtune=generic -march=x86-64 -DNDEBUG -DQT_NO_DEBUG -fPIE -Wno-builtin-macro-redefined -D__DATE__=\"redacted\" -D__TIMESTAMP__=\"redacted\" -D__TIME__=\"redacted\" -fmerge-all-constants -Wall -Wextra -Wconversion -Wsign-conversion -Wvla -Wnon-virtual-dtor -fmath-errno -fno-exceptions -DHWY_IS_TEST=1 -std=c++11 -o CMakeFiles/arithmetic_test.dir/hwy/tests/arithmetic_test.cc.o -c /tmp/B.ev3pxxw8/BUILD/highway-0.14.2/hwy/tests/arithmetic_test.cc make[2]: Leaving directory '/tmp/B.ev3pxxw8/BUILD/highway-0.14.2/build' make[2]: Entering directory '/tmp/B.ev3pxxw8/BUILD/highway-0.14.2/build' [ 95%] Linking CXX executable tests/arithmetic_test /usr/bin/cmake -E cmake_link_script CMakeFiles/arithmetic_test.dir/link.txt --verbose=1 /usr/bin/x86_64-pld-linux-gnux32-g++ -O2 -fwrapv -pipe -Wformat -Werror=format-security -Wp,-D_FORTIFY_SOURCE=2 -fstack-protector-strong --param=ssp-buffer-size=4 -Werror=trampolines -fPIC -mtune=generic -march=x86-64 -DNDEBUG -DQT_NO_DEBUG -Wl,--as-needed -Wl,--no-copy-dt-needed-entries -Wl,-z,relro -Wl,-z,combreloc -fPIE -pie CMakeFiles/arithmetic_test.dir/hwy/tests/arithmetic_test.cc.o -o tests/arithmetic_test libhwy.a libhwy_contrib.a /usr/libx32/libgtest.so /usr/libx32/libgtest_main.so /usr/libx32/libgtest.so /usr/bin/cmake -D TEST_TARGET=arithmetic_test -D TEST_EXECUTABLE=/tmp/B.ev3pxxw8/BUILD/highway-0.14.2/build/tests/arithmetic_test -D TEST_EXECUTOR= -D TEST_WORKING_DIR=/tmp/B.ev3pxxw8/BUILD/highway-0.14.2/build -D TEST_EXTRA_ARGS= -D TEST_PROPERTIES= -D TEST_PREFIX= -D TEST_SUFFIX= -D NO_PRETTY_TYPES=FALSE -D NO_PRETTY_VALUES=FALSE -D TEST_LIST=arithmetic_test_TESTS -D CTEST_FILE=/tmp/B.ev3pxxw8/BUILD/highway-0.14.2/build/arithmetic_test[1]_tests.cmake -D TEST_DISCOVERY_TIMEOUT=60 -P /usr/share/cmake/Modules/GoogleTestAddTests.cmake make[2]: Leaving directory '/tmp/B.ev3pxxw8/BUILD/highway-0.14.2/build' make[1]: Entering directory '/tmp/B.ev3pxxw8/BUILD/highway-0.14.2/build' [ 95%] Built target arithmetic_test make[1]: Leaving directory '/tmp/B.ev3pxxw8/BUILD/highway-0.14.2/build' make[2]: Entering directory '/tmp/B.ev3pxxw8/BUILD/highway-0.14.2/build' [ 34%] Building CXX object CMakeFiles/blockwise_test.dir/hwy/tests/blockwise_test.cc.o /usr/bin/x86_64-pld-linux-gnux32-g++ -I/tmp/B.ev3pxxw8/BUILD/highway-0.14.2 -O2 -fwrapv -pipe -Wformat -Werror=format-security -Wp,-D_FORTIFY_SOURCE=2 -fstack-protector-strong --param=ssp-buffer-size=4 -Werror=trampolines -fPIC -mtune=generic -march=x86-64 -DNDEBUG -DQT_NO_DEBUG -fPIE -Wno-builtin-macro-redefined -D__DATE__=\"redacted\" -D__TIMESTAMP__=\"redacted\" -D__TIME__=\"redacted\" -fmerge-all-constants -Wall -Wextra -Wconversion -Wsign-conversion -Wvla -Wnon-virtual-dtor -fmath-errno -fno-exceptions -DHWY_IS_TEST=1 -std=c++11 -o CMakeFiles/blockwise_test.dir/hwy/tests/blockwise_test.cc.o -c /tmp/B.ev3pxxw8/BUILD/highway-0.14.2/hwy/tests/blockwise_test.cc make[2]: Leaving directory '/tmp/B.ev3pxxw8/BUILD/highway-0.14.2/build' make[2]: Entering directory '/tmp/B.ev3pxxw8/BUILD/highway-0.14.2/build' [ 97%] Linking CXX executable tests/blockwise_test /usr/bin/cmake -E cmake_link_script CMakeFiles/blockwise_test.dir/link.txt --verbose=1 /usr/bin/x86_64-pld-linux-gnux32-g++ -O2 -fwrapv -pipe -Wformat -Werror=format-security -Wp,-D_FORTIFY_SOURCE=2 -fstack-protector-strong --param=ssp-buffer-size=4 -Werror=trampolines -fPIC -mtune=generic -march=x86-64 -DNDEBUG -DQT_NO_DEBUG -Wl,--as-needed -Wl,--no-copy-dt-needed-entries -Wl,-z,relro -Wl,-z,combreloc -fPIE -pie CMakeFiles/blockwise_test.dir/hwy/tests/blockwise_test.cc.o -o tests/blockwise_test libhwy.a libhwy_contrib.a /usr/libx32/libgtest.so /usr/libx32/libgtest_main.so /usr/libx32/libgtest.so /usr/bin/cmake -D TEST_TARGET=blockwise_test -D TEST_EXECUTABLE=/tmp/B.ev3pxxw8/BUILD/highway-0.14.2/build/tests/blockwise_test -D TEST_EXECUTOR= -D TEST_WORKING_DIR=/tmp/B.ev3pxxw8/BUILD/highway-0.14.2/build -D TEST_EXTRA_ARGS= -D TEST_PROPERTIES= -D TEST_PREFIX= -D TEST_SUFFIX= -D NO_PRETTY_TYPES=FALSE -D NO_PRETTY_VALUES=FALSE -D TEST_LIST=blockwise_test_TESTS -D CTEST_FILE=/tmp/B.ev3pxxw8/BUILD/highway-0.14.2/build/blockwise_test[1]_tests.cmake -D TEST_DISCOVERY_TIMEOUT=60 -P /usr/share/cmake/Modules/GoogleTestAddTests.cmake make[2]: Leaving directory '/tmp/B.ev3pxxw8/BUILD/highway-0.14.2/build' make[1]: Entering directory '/tmp/B.ev3pxxw8/BUILD/highway-0.14.2/build' [ 97%] Built target blockwise_test make[1]: Leaving directory '/tmp/B.ev3pxxw8/BUILD/highway-0.14.2/build' make[2]: Entering directory '/tmp/B.ev3pxxw8/BUILD/highway-0.14.2/build' [ 80%] Building CXX object CMakeFiles/mask_test.dir/hwy/tests/mask_test.cc.o /usr/bin/x86_64-pld-linux-gnux32-g++ -I/tmp/B.ev3pxxw8/BUILD/highway-0.14.2 -O2 -fwrapv -pipe -Wformat -Werror=format-security -Wp,-D_FORTIFY_SOURCE=2 -fstack-protector-strong --param=ssp-buffer-size=4 -Werror=trampolines -fPIC -mtune=generic -march=x86-64 -DNDEBUG -DQT_NO_DEBUG -fPIE -Wno-builtin-macro-redefined -D__DATE__=\"redacted\" -D__TIMESTAMP__=\"redacted\" -D__TIME__=\"redacted\" -fmerge-all-constants -Wall -Wextra -Wconversion -Wsign-conversion -Wvla -Wnon-virtual-dtor -fmath-errno -fno-exceptions -DHWY_IS_TEST=1 -std=c++11 -o CMakeFiles/mask_test.dir/hwy/tests/mask_test.cc.o -c /tmp/B.ev3pxxw8/BUILD/highway-0.14.2/hwy/tests/mask_test.cc make[2]: Leaving directory '/tmp/B.ev3pxxw8/BUILD/highway-0.14.2/build' make[2]: Entering directory '/tmp/B.ev3pxxw8/BUILD/highway-0.14.2/build' [100%] Linking CXX executable tests/mask_test /usr/bin/cmake -E cmake_link_script CMakeFiles/mask_test.dir/link.txt --verbose=1 /usr/bin/x86_64-pld-linux-gnux32-g++ -O2 -fwrapv -pipe -Wformat -Werror=format-security -Wp,-D_FORTIFY_SOURCE=2 -fstack-protector-strong --param=ssp-buffer-size=4 -Werror=trampolines -fPIC -mtune=generic -march=x86-64 -DNDEBUG -DQT_NO_DEBUG -Wl,--as-needed -Wl,--no-copy-dt-needed-entries -Wl,-z,relro -Wl,-z,combreloc -fPIE -pie CMakeFiles/mask_test.dir/hwy/tests/mask_test.cc.o -o tests/mask_test libhwy.a libhwy_contrib.a /usr/libx32/libgtest.so /usr/libx32/libgtest_main.so /usr/libx32/libgtest.so /usr/bin/cmake -D TEST_TARGET=mask_test -D TEST_EXECUTABLE=/tmp/B.ev3pxxw8/BUILD/highway-0.14.2/build/tests/mask_test -D TEST_EXECUTOR= -D TEST_WORKING_DIR=/tmp/B.ev3pxxw8/BUILD/highway-0.14.2/build -D TEST_EXTRA_ARGS= -D TEST_PROPERTIES= -D TEST_PREFIX= -D TEST_SUFFIX= -D NO_PRETTY_TYPES=FALSE -D NO_PRETTY_VALUES=FALSE -D TEST_LIST=mask_test_TESTS -D CTEST_FILE=/tmp/B.ev3pxxw8/BUILD/highway-0.14.2/build/mask_test[1]_tests.cmake -D TEST_DISCOVERY_TIMEOUT=60 -P /usr/share/cmake/Modules/GoogleTestAddTests.cmake make[2]: Leaving directory '/tmp/B.ev3pxxw8/BUILD/highway-0.14.2/build' make[1]: Entering directory '/tmp/B.ev3pxxw8/BUILD/highway-0.14.2/build' [100%] Built target mask_test make[1]: Leaving directory '/tmp/B.ev3pxxw8/BUILD/highway-0.14.2/build' make: *** [Makefile:164: all] Error 2 error: Bad exit status from /tmp/B.ev3pxxw8/BUILD/tmp/rpm-tmp.SSaGeR (%build) RPM build errors: Bad exit status from /tmp/B.ev3pxxw8/BUILD/tmp/rpm-tmp.SSaGeR (%build) ended at: Tue Oct 5 22:17:11 2021, done in 0:01:56.531214 error: No files produced. + chmod -R u+rwX /tmp/B.ev3pxxw8/BUILD + rm -rf /tmp/B.ev3pxxw8/tmp /tmp/B.ev3pxxw8/BUILD + rm -rf /tmp/B.ev3pxxw8 Begin-PLD-Builder-Info Build-Time: user:512.67s sys:11.74s real:118.53s (faults io:95 non-io:2078460) End-PLD-Builder-Info
[Back to list of logs] [View rpm -qa of builder]