FailedOk

th/SRPMS[OK]
th/x32[OK]
th/i686[OK]
th/x86_64[OK]

ac/SRPMS[OK]
ac/i386[OK]
ac/i586[OK]
ac/i686[OK]
ac/alpha[OK]
ac/amd64[OK]
ac/athlon[OK]
ac/ppc[OK]
ac/sparc[OK]
ac/sparc64[OK]

Advanced Search
main()
Powered by PLD Linux
(c) 2002-2021 PLD Team
$Revision: 1.37 $
Powered by BOFH.
Your IP: 3.234.211.61

highway 63dfa59e-c8d7-449e-ace3-96dc022ade6e

Status:Failed
Source URL:https://buildlogs.pld-linux.org/pld/th/x32/FAIL/highway,63dfa59e-c8d7-449e-ace3-96dc022ade6e.bz2
text/plain URL:View!
full text:View!
rpm -qa of builder:View!
Date:2021/10/05 22:17:11
Runtime:0:01:56.531214

Toc:

  • error 1
  • make[2]: *** [CMakeFiles/highway_test.dir/build.make:113: tests/highway_test] Error 1
  • error 2
  • make[1]: *** [CMakeFiles/Makefile2:1046: CMakeFiles/highway_test.dir/all] Error 2
  • error 3
  • error: Bad exit status from /tmp/B.ev3pxxw8/BUILD/tmp/rpm-tmp.SSaGeR (%build)
  • error 4
  • RPM build errors:
  • error 5
  • error: No files produced.

Content:

make[2]: Entering directory '/tmp/B.ev3pxxw8/BUILD/highway-0.14.2/build'
[ 69%] Linking CXX executable tests/skeleton_test
/usr/bin/cmake -E cmake_link_script CMakeFiles/skeleton_test.dir/link.txt --verbose=1
/usr/bin/x86_64-pld-linux-gnux32-g++  -O2 -fwrapv -pipe -Wformat -Werror=format-security -Wp,-D_FORTIFY_SOURCE=2 -fstack-protector-strong --param=ssp-buffer-size=4 -Werror=trampolines -fPIC -mtune=generic -march=x86-64  -DNDEBUG -DQT_NO_DEBUG  -Wl,--as-needed -Wl,--no-copy-dt-needed-entries -Wl,-z,relro -Wl,-z,combreloc -fPIE -pie CMakeFiles/skeleton_test.dir/hwy/examples/skeleton_test.cc.o CMakeFiles/skeleton_test.dir/hwy/examples/skeleton.cc.o  -o tests/skeleton_test  libhwy.a libhwy_contrib.a /usr/libx32/libgtest.so /usr/libx32/libgtest_main.so /usr/libx32/libgtest.so 
/usr/bin/cmake -D TEST_TARGET=skeleton_test -D TEST_EXECUTABLE=/tmp/B.ev3pxxw8/BUILD/highway-0.14.2/build/tests/skeleton_test -D TEST_EXECUTOR= -D TEST_WORKING_DIR=/tmp/B.ev3pxxw8/BUILD/highway-0.14.2/build -D TEST_EXTRA_ARGS= -D TEST_PROPERTIES= -D TEST_PREFIX= -D TEST_SUFFIX= -D NO_PRETTY_TYPES=FALSE -D NO_PRETTY_VALUES=FALSE -D TEST_LIST=skeleton_test_TESTS -D CTEST_FILE=/tmp/B.ev3pxxw8/BUILD/highway-0.14.2/build/skeleton_test[1]_tests.cmake -D TEST_DISCOVERY_TIMEOUT=60 -P /usr/share/cmake/Modules/GoogleTestAddTests.cmake
make[2]: Leaving directory '/tmp/B.ev3pxxw8/BUILD/highway-0.14.2/build'
make[1]: Entering directory '/tmp/B.ev3pxxw8/BUILD/highway-0.14.2/build'
[ 69%] Built target skeleton_test
make[1]: Leaving directory '/tmp/B.ev3pxxw8/BUILD/highway-0.14.2/build'
/usr/bin/make  -f CMakeFiles/highway_test.dir/build.make CMakeFiles/highway_test.dir/depend
make[2]: Entering directory '/tmp/B.ev3pxxw8/BUILD/highway-0.14.2/build'
cd /tmp/B.ev3pxxw8/BUILD/highway-0.14.2/build && /usr/bin/cmake -E cmake_depends "Unix Makefiles" /tmp/B.ev3pxxw8/BUILD/highway-0.14.2 /tmp/B.ev3pxxw8/BUILD/highway-0.14.2 /tmp/B.ev3pxxw8/BUILD/highway-0.14.2/build /tmp/B.ev3pxxw8/BUILD/highway-0.14.2/build /tmp/B.ev3pxxw8/BUILD/highway-0.14.2/build/CMakeFiles/highway_test.dir/DependInfo.cmake --color=
Scanning dependencies of target highway_test
make[2]: Leaving directory '/tmp/B.ev3pxxw8/BUILD/highway-0.14.2/build'
/usr/bin/make  -f CMakeFiles/highway_test.dir/build.make CMakeFiles/highway_test.dir/build
make[2]: Entering directory '/tmp/B.ev3pxxw8/BUILD/highway-0.14.2/build'
[ 28%] Building CXX object CMakeFiles/logical_test.dir/hwy/tests/logical_test.cc.o
/usr/bin/x86_64-pld-linux-gnux32-g++   -I/tmp/B.ev3pxxw8/BUILD/highway-0.14.2  -O2 -fwrapv -pipe -Wformat -Werror=format-security -Wp,-D_FORTIFY_SOURCE=2 -fstack-protector-strong --param=ssp-buffer-size=4 -Werror=trampolines -fPIC -mtune=generic -march=x86-64  -DNDEBUG -DQT_NO_DEBUG -fPIE   -Wno-builtin-macro-redefined -D__DATE__=\"redacted\" -D__TIMESTAMP__=\"redacted\" -D__TIME__=\"redacted\" -fmerge-all-constants -Wall -Wextra -Wconversion -Wsign-conversion -Wvla -Wnon-virtual-dtor -fmath-errno -fno-exceptions -DHWY_IS_TEST=1 -std=c++11 -o CMakeFiles/logical_test.dir/hwy/tests/logical_test.cc.o -c /tmp/B.ev3pxxw8/BUILD/highway-0.14.2/hwy/tests/logical_test.cc
make[2]: Leaving directory '/tmp/B.ev3pxxw8/BUILD/highway-0.14.2/build'
make[2]: Entering directory '/tmp/B.ev3pxxw8/BUILD/highway-0.14.2/build'
[ 73%] Linking CXX executable tests/logical_test
/usr/bin/cmake -E cmake_link_script CMakeFiles/logical_test.dir/link.txt --verbose=1
/usr/bin/x86_64-pld-linux-gnux32-g++  -O2 -fwrapv -pipe -Wformat -Werror=format-security -Wp,-D_FORTIFY_SOURCE=2 -fstack-protector-strong --param=ssp-buffer-size=4 -Werror=trampolines -fPIC -mtune=generic -march=x86-64  -DNDEBUG -DQT_NO_DEBUG  -Wl,--as-needed -Wl,--no-copy-dt-needed-entries -Wl,-z,relro -Wl,-z,combreloc -fPIE -pie CMakeFiles/logical_test.dir/hwy/tests/logical_test.cc.o  -o tests/logical_test  libhwy.a libhwy_contrib.a /usr/libx32/libgtest.so /usr/libx32/libgtest_main.so /usr/libx32/libgtest.so 
/usr/bin/cmake -D TEST_TARGET=logical_test -D TEST_EXECUTABLE=/tmp/B.ev3pxxw8/BUILD/highway-0.14.2/build/tests/logical_test -D TEST_EXECUTOR= -D TEST_WORKING_DIR=/tmp/B.ev3pxxw8/BUILD/highway-0.14.2/build -D TEST_EXTRA_ARGS= -D TEST_PROPERTIES= -D TEST_PREFIX= -D TEST_SUFFIX= -D NO_PRETTY_TYPES=FALSE -D NO_PRETTY_VALUES=FALSE -D TEST_LIST=logical_test_TESTS -D CTEST_FILE=/tmp/B.ev3pxxw8/BUILD/highway-0.14.2/build/logical_test[1]_tests.cmake -D TEST_DISCOVERY_TIMEOUT=60 -P /usr/share/cmake/Modules/GoogleTestAddTests.cmake
make[2]: Leaving directory '/tmp/B.ev3pxxw8/BUILD/highway-0.14.2/build'
make[1]: Entering directory '/tmp/B.ev3pxxw8/BUILD/highway-0.14.2/build'
[ 73%] Built target logical_test
make[1]: Leaving directory '/tmp/B.ev3pxxw8/BUILD/highway-0.14.2/build'
/usr/bin/make  -f CMakeFiles/image_test.dir/build.make CMakeFiles/image_test.dir/depend
make[2]: Entering directory '/tmp/B.ev3pxxw8/BUILD/highway-0.14.2/build'
cd /tmp/B.ev3pxxw8/BUILD/highway-0.14.2/build && /usr/bin/cmake -E cmake_depends "Unix Makefiles" /tmp/B.ev3pxxw8/BUILD/highway-0.14.2 /tmp/B.ev3pxxw8/BUILD/highway-0.14.2 /tmp/B.ev3pxxw8/BUILD/highway-0.14.2/build /tmp/B.ev3pxxw8/BUILD/highway-0.14.2/build /tmp/B.ev3pxxw8/BUILD/highway-0.14.2/build/CMakeFiles/image_test.dir/DependInfo.cmake --color=
Scanning dependencies of target image_test
make[2]: Leaving directory '/tmp/B.ev3pxxw8/BUILD/highway-0.14.2/build'
/usr/bin/make  -f CMakeFiles/image_test.dir/build.make CMakeFiles/image_test.dir/build
make[2]: Entering directory '/tmp/B.ev3pxxw8/BUILD/highway-0.14.2/build'
[ 26%] Building CXX object CMakeFiles/swizzle_test.dir/hwy/tests/swizzle_test.cc.o
/usr/bin/x86_64-pld-linux-gnux32-g++   -I/tmp/B.ev3pxxw8/BUILD/highway-0.14.2  -O2 -fwrapv -pipe -Wformat -Werror=format-security -Wp,-D_FORTIFY_SOURCE=2 -fstack-protector-strong --param=ssp-buffer-size=4 -Werror=trampolines -fPIC -mtune=generic -march=x86-64  -DNDEBUG -DQT_NO_DEBUG -fPIE   -Wno-builtin-macro-redefined -D__DATE__=\"redacted\" -D__TIMESTAMP__=\"redacted\" -D__TIME__=\"redacted\" -fmerge-all-constants -Wall -Wextra -Wconversion -Wsign-conversion -Wvla -Wnon-virtual-dtor -fmath-errno -fno-exceptions -DHWY_IS_TEST=1 -std=c++11 -o CMakeFiles/swizzle_test.dir/hwy/tests/swizzle_test.cc.o -c /tmp/B.ev3pxxw8/BUILD/highway-0.14.2/hwy/tests/swizzle_test.cc
make[2]: Leaving directory '/tmp/B.ev3pxxw8/BUILD/highway-0.14.2/build'
make[2]: Entering directory '/tmp/B.ev3pxxw8/BUILD/highway-0.14.2/build'
[ 78%] Linking CXX executable tests/swizzle_test
/usr/bin/cmake -E cmake_link_script CMakeFiles/swizzle_test.dir/link.txt --verbose=1
/usr/bin/x86_64-pld-linux-gnux32-g++  -O2 -fwrapv -pipe -Wformat -Werror=format-security -Wp,-D_FORTIFY_SOURCE=2 -fstack-protector-strong --param=ssp-buffer-size=4 -Werror=trampolines -fPIC -mtune=generic -march=x86-64  -DNDEBUG -DQT_NO_DEBUG  -Wl,--as-needed -Wl,--no-copy-dt-needed-entries -Wl,-z,relro -Wl,-z,combreloc -fPIE -pie CMakeFiles/swizzle_test.dir/hwy/tests/swizzle_test.cc.o  -o tests/swizzle_test  libhwy.a libhwy_contrib.a /usr/libx32/libgtest.so /usr/libx32/libgtest_main.so /usr/libx32/libgtest.so 
/usr/bin/cmake -D TEST_TARGET=swizzle_test -D TEST_EXECUTABLE=/tmp/B.ev3pxxw8/BUILD/highway-0.14.2/build/tests/swizzle_test -D TEST_EXECUTOR= -D TEST_WORKING_DIR=/tmp/B.ev3pxxw8/BUILD/highway-0.14.2/build -D TEST_EXTRA_ARGS= -D TEST_PROPERTIES= -D TEST_PREFIX= -D TEST_SUFFIX= -D NO_PRETTY_TYPES=FALSE -D NO_PRETTY_VALUES=FALSE -D TEST_LIST=swizzle_test_TESTS -D CTEST_FILE=/tmp/B.ev3pxxw8/BUILD/highway-0.14.2/build/swizzle_test[1]_tests.cmake -D TEST_DISCOVERY_TIMEOUT=60 -P /usr/share/cmake/Modules/GoogleTestAddTests.cmake
make[2]: Leaving directory '/tmp/B.ev3pxxw8/BUILD/highway-0.14.2/build'
make[1]: Entering directory '/tmp/B.ev3pxxw8/BUILD/highway-0.14.2/build'
[ 78%] Built target swizzle_test
make[1]: Leaving directory '/tmp/B.ev3pxxw8/BUILD/highway-0.14.2/build'
/usr/bin/make  -f CMakeFiles/mask_test.dir/build.make CMakeFiles/mask_test.dir/depend
make[2]: Entering directory '/tmp/B.ev3pxxw8/BUILD/highway-0.14.2/build'
cd /tmp/B.ev3pxxw8/BUILD/highway-0.14.2/build && /usr/bin/cmake -E cmake_depends "Unix Makefiles" /tmp/B.ev3pxxw8/BUILD/highway-0.14.2 /tmp/B.ev3pxxw8/BUILD/highway-0.14.2 /tmp/B.ev3pxxw8/BUILD/highway-0.14.2/build /tmp/B.ev3pxxw8/BUILD/highway-0.14.2/build /tmp/B.ev3pxxw8/BUILD/highway-0.14.2/build/CMakeFiles/mask_test.dir/DependInfo.cmake --color=
Scanning dependencies of target mask_test
make[2]: Leaving directory '/tmp/B.ev3pxxw8/BUILD/highway-0.14.2/build'
/usr/bin/make  -f CMakeFiles/mask_test.dir/build.make CMakeFiles/mask_test.dir/build
make[2]: Entering directory '/tmp/B.ev3pxxw8/BUILD/highway-0.14.2/build'
[ 76%] Building CXX object CMakeFiles/image_test.dir/hwy/contrib/image/image_test.cc.o
/usr/bin/x86_64-pld-linux-gnux32-g++   -I/tmp/B.ev3pxxw8/BUILD/highway-0.14.2  -O2 -fwrapv -pipe -Wformat -Werror=format-security -Wp,-D_FORTIFY_SOURCE=2 -fstack-protector-strong --param=ssp-buffer-size=4 -Werror=trampolines -fPIC -mtune=generic -march=x86-64  -DNDEBUG -DQT_NO_DEBUG -fPIE   -Wno-builtin-macro-redefined -D__DATE__=\"redacted\" -D__TIMESTAMP__=\"redacted\" -D__TIME__=\"redacted\" -fmerge-all-constants -Wall -Wextra -Wconversion -Wsign-conversion -Wvla -Wnon-virtual-dtor -fmath-errno -fno-exceptions -DHWY_IS_TEST=1 -std=c++11 -o CMakeFiles/image_test.dir/hwy/contrib/image/image_test.cc.o -c /tmp/B.ev3pxxw8/BUILD/highway-0.14.2/hwy/contrib/image/image_test.cc
make[2]: Leaving directory '/tmp/B.ev3pxxw8/BUILD/highway-0.14.2/build'
make[2]: Entering directory '/tmp/B.ev3pxxw8/BUILD/highway-0.14.2/build'
[ 82%] Linking CXX executable tests/image_test
/usr/bin/cmake -E cmake_link_script CMakeFiles/image_test.dir/link.txt --verbose=1
/usr/bin/x86_64-pld-linux-gnux32-g++  -O2 -fwrapv -pipe -Wformat -Werror=format-security -Wp,-D_FORTIFY_SOURCE=2 -fstack-protector-strong --param=ssp-buffer-size=4 -Werror=trampolines -fPIC -mtune=generic -march=x86-64  -DNDEBUG -DQT_NO_DEBUG  -Wl,--as-needed -Wl,--no-copy-dt-needed-entries -Wl,-z,relro -Wl,-z,combreloc -fPIE -pie CMakeFiles/image_test.dir/hwy/contrib/image/image_test.cc.o  -o tests/image_test  libhwy.a libhwy_contrib.a /usr/libx32/libgtest.so /usr/libx32/libgtest_main.so /usr/libx32/libgtest.so 
/usr/bin/cmake -D TEST_TARGET=image_test -D TEST_EXECUTABLE=/tmp/B.ev3pxxw8/BUILD/highway-0.14.2/build/tests/image_test -D TEST_EXECUTOR= -D TEST_WORKING_DIR=/tmp/B.ev3pxxw8/BUILD/highway-0.14.2/build -D TEST_EXTRA_ARGS= -D TEST_PROPERTIES= -D TEST_PREFIX= -D TEST_SUFFIX= -D NO_PRETTY_TYPES=FALSE -D NO_PRETTY_VALUES=FALSE -D TEST_LIST=image_test_TESTS -D CTEST_FILE=/tmp/B.ev3pxxw8/BUILD/highway-0.14.2/build/image_test[1]_tests.cmake -D TEST_DISCOVERY_TIMEOUT=60 -P /usr/share/cmake/Modules/GoogleTestAddTests.cmake
make[2]: Leaving directory '/tmp/B.ev3pxxw8/BUILD/highway-0.14.2/build'
make[1]: Entering directory '/tmp/B.ev3pxxw8/BUILD/highway-0.14.2/build'
[ 82%] Built target image_test
make[1]: Leaving directory '/tmp/B.ev3pxxw8/BUILD/highway-0.14.2/build'
make[2]: Entering directory '/tmp/B.ev3pxxw8/BUILD/highway-0.14.2/build'
[ 60%] Building CXX object CMakeFiles/compare_test.dir/hwy/tests/compare_test.cc.o
/usr/bin/x86_64-pld-linux-gnux32-g++   -I/tmp/B.ev3pxxw8/BUILD/highway-0.14.2  -O2 -fwrapv -pipe -Wformat -Werror=format-security -Wp,-D_FORTIFY_SOURCE=2 -fstack-protector-strong --param=ssp-buffer-size=4 -Werror=trampolines -fPIC -mtune=generic -march=x86-64  -DNDEBUG -DQT_NO_DEBUG -fPIE   -Wno-builtin-macro-redefined -D__DATE__=\"redacted\" -D__TIMESTAMP__=\"redacted\" -D__TIME__=\"redacted\" -fmerge-all-constants -Wall -Wextra -Wconversion -Wsign-conversion -Wvla -Wnon-virtual-dtor -fmath-errno -fno-exceptions -DHWY_IS_TEST=1 -std=c++11 -o CMakeFiles/compare_test.dir/hwy/tests/compare_test.cc.o -c /tmp/B.ev3pxxw8/BUILD/highway-0.14.2/hwy/tests/compare_test.cc
make[2]: Leaving directory '/tmp/B.ev3pxxw8/BUILD/highway-0.14.2/build'
make[2]: Entering directory '/tmp/B.ev3pxxw8/BUILD/highway-0.14.2/build'
[ 84%] Linking CXX executable tests/compare_test
/usr/bin/cmake -E cmake_link_script CMakeFiles/compare_test.dir/link.txt --verbose=1
/usr/bin/x86_64-pld-linux-gnux32-g++  -O2 -fwrapv -pipe -Wformat -Werror=format-security -Wp,-D_FORTIFY_SOURCE=2 -fstack-protector-strong --param=ssp-buffer-size=4 -Werror=trampolines -fPIC -mtune=generic -march=x86-64  -DNDEBUG -DQT_NO_DEBUG  -Wl,--as-needed -Wl,--no-copy-dt-needed-entries -Wl,-z,relro -Wl,-z,combreloc -fPIE -pie CMakeFiles/compare_test.dir/hwy/tests/compare_test.cc.o  -o tests/compare_test  libhwy.a libhwy_contrib.a /usr/libx32/libgtest.so /usr/libx32/libgtest_main.so /usr/libx32/libgtest.so 
/usr/bin/cmake -D TEST_TARGET=compare_test -D TEST_EXECUTABLE=/tmp/B.ev3pxxw8/BUILD/highway-0.14.2/build/tests/compare_test -D TEST_EXECUTOR= -D TEST_WORKING_DIR=/tmp/B.ev3pxxw8/BUILD/highway-0.14.2/build -D TEST_EXTRA_ARGS= -D TEST_PROPERTIES= -D TEST_PREFIX= -D TEST_SUFFIX= -D NO_PRETTY_TYPES=FALSE -D NO_PRETTY_VALUES=FALSE -D TEST_LIST=compare_test_TESTS -D CTEST_FILE=/tmp/B.ev3pxxw8/BUILD/highway-0.14.2/build/compare_test[1]_tests.cmake -D TEST_DISCOVERY_TIMEOUT=60 -P /usr/share/cmake/Modules/GoogleTestAddTests.cmake
make[2]: Leaving directory '/tmp/B.ev3pxxw8/BUILD/highway-0.14.2/build'
make[1]: Entering directory '/tmp/B.ev3pxxw8/BUILD/highway-0.14.2/build'
[ 84%] Built target compare_test
make[1]: Leaving directory '/tmp/B.ev3pxxw8/BUILD/highway-0.14.2/build'
make[2]: Entering directory '/tmp/B.ev3pxxw8/BUILD/highway-0.14.2/build'
[ 71%] Building CXX object CMakeFiles/highway_test.dir/hwy/highway_test.cc.o
/usr/bin/x86_64-pld-linux-gnux32-g++   -I/tmp/B.ev3pxxw8/BUILD/highway-0.14.2  -O2 -fwrapv -pipe -Wformat -Werror=format-security -Wp,-D_FORTIFY_SOURCE=2 -fstack-protector-strong --param=ssp-buffer-size=4 -Werror=trampolines -fPIC -mtune=generic -march=x86-64  -DNDEBUG -DQT_NO_DEBUG -fPIE   -Wno-builtin-macro-redefined -D__DATE__=\"redacted\" -D__TIMESTAMP__=\"redacted\" -D__TIME__=\"redacted\" -fmerge-all-constants -Wall -Wextra -Wconversion -Wsign-conversion -Wvla -Wnon-virtual-dtor -fmath-errno -fno-exceptions -DHWY_IS_TEST=1 -std=c++11 -o CMakeFiles/highway_test.dir/hwy/highway_test.cc.o -c /tmp/B.ev3pxxw8/BUILD/highway-0.14.2/hwy/highway_test.cc
make[2]: Leaving directory '/tmp/B.ev3pxxw8/BUILD/highway-0.14.2/build'
make[2]: *** Deleting file 'tests/highway_test'
make[2]: Entering directory '/tmp/B.ev3pxxw8/BUILD/highway-0.14.2/build'
[ 86%] Linking CXX executable tests/highway_test
/usr/bin/cmake -E cmake_link_script CMakeFiles/highway_test.dir/link.txt --verbose=1
/usr/bin/x86_64-pld-linux-gnux32-g++  -O2 -fwrapv -pipe -Wformat -Werror=format-security -Wp,-D_FORTIFY_SOURCE=2 -fstack-protector-strong --param=ssp-buffer-size=4 -Werror=trampolines -fPIC -mtune=generic -march=x86-64  -DNDEBUG -DQT_NO_DEBUG  -Wl,--as-needed -Wl,--no-copy-dt-needed-entries -Wl,-z,relro -Wl,-z,combreloc -fPIE -pie CMakeFiles/highway_test.dir/hwy/highway_test.cc.o  -o tests/highway_test  libhwy.a libhwy_contrib.a /usr/libx32/libgtest.so /usr/libx32/libgtest_main.so /usr/libx32/libgtest.so 
/usr/bin/cmake -D TEST_TARGET=highway_test -D TEST_EXECUTABLE=/tmp/B.ev3pxxw8/BUILD/highway-0.14.2/build/tests/highway_test -D TEST_EXECUTOR= -D TEST_WORKING_DIR=/tmp/B.ev3pxxw8/BUILD/highway-0.14.2/build -D TEST_EXTRA_ARGS= -D TEST_PROPERTIES= -D TEST_PREFIX= -D TEST_SUFFIX= -D NO_PRETTY_TYPES=FALSE -D NO_PRETTY_VALUES=FALSE -D TEST_LIST=highway_test_TESTS -D CTEST_FILE=/tmp/B.ev3pxxw8/BUILD/highway-0.14.2/build/highway_test[1]_tests.cmake -D TEST_DISCOVERY_TIMEOUT=60 -P /usr/share/cmake/Modules/GoogleTestAddTests.cmake
CMake Error at /usr/share/cmake/Modules/GoogleTestAddTests.cmake:40 (message):
  Error running test executable.

    Path: '/tmp/B.ev3pxxw8/BUILD/highway-0.14.2/build/tests/highway_test'
    Result: Illegal instruction
    Output:
      



make[2]: *** [CMakeFiles/highway_test.dir/build.make:113: tests/highway_test] Error 1
make[2]: Leaving directory '/tmp/B.ev3pxxw8/BUILD/highway-0.14.2/build'
make[1]: *** [CMakeFiles/Makefile2:1046: CMakeFiles/highway_test.dir/all] Error 2
make[1]: *** Waiting for unfinished jobs....
make[2]: Entering directory '/tmp/B.ev3pxxw8/BUILD/highway-0.14.2/build'
[ 54%] Building CXX object CMakeFiles/memory_test.dir/hwy/tests/memory_test.cc.o
/usr/bin/x86_64-pld-linux-gnux32-g++   -I/tmp/B.ev3pxxw8/BUILD/highway-0.14.2  -O2 -fwrapv -pipe -Wformat -Werror=format-security -Wp,-D_FORTIFY_SOURCE=2 -fstack-protector-strong --param=ssp-buffer-size=4 -Werror=trampolines -fPIC -mtune=generic -march=x86-64  -DNDEBUG -DQT_NO_DEBUG -fPIE   -Wno-builtin-macro-redefined -D__DATE__=\"redacted\" -D__TIMESTAMP__=\"redacted\" -D__TIME__=\"redacted\" -fmerge-all-constants -Wall -Wextra -Wconversion -Wsign-conversion -Wvla -Wnon-virtual-dtor -fmath-errno -fno-exceptions -DHWY_IS_TEST=1 -std=c++11 -o CMakeFiles/memory_test.dir/hwy/tests/memory_test.cc.o -c /tmp/B.ev3pxxw8/BUILD/highway-0.14.2/hwy/tests/memory_test.cc
make[2]: Leaving directory '/tmp/B.ev3pxxw8/BUILD/highway-0.14.2/build'
make[2]: Entering directory '/tmp/B.ev3pxxw8/BUILD/highway-0.14.2/build'
[ 89%] Linking CXX executable tests/memory_test
/usr/bin/cmake -E cmake_link_script CMakeFiles/memory_test.dir/link.txt --verbose=1
/usr/bin/x86_64-pld-linux-gnux32-g++  -O2 -fwrapv -pipe -Wformat -Werror=format-security -Wp,-D_FORTIFY_SOURCE=2 -fstack-protector-strong --param=ssp-buffer-size=4 -Werror=trampolines -fPIC -mtune=generic -march=x86-64  -DNDEBUG -DQT_NO_DEBUG  -Wl,--as-needed -Wl,--no-copy-dt-needed-entries -Wl,-z,relro -Wl,-z,combreloc -fPIE -pie CMakeFiles/memory_test.dir/hwy/tests/memory_test.cc.o  -o tests/memory_test  libhwy.a libhwy_contrib.a /usr/libx32/libgtest.so /usr/libx32/libgtest_main.so /usr/libx32/libgtest.so 
/usr/bin/cmake -D TEST_TARGET=memory_test -D TEST_EXECUTABLE=/tmp/B.ev3pxxw8/BUILD/highway-0.14.2/build/tests/memory_test -D TEST_EXECUTOR= -D TEST_WORKING_DIR=/tmp/B.ev3pxxw8/BUILD/highway-0.14.2/build -D TEST_EXTRA_ARGS= -D TEST_PROPERTIES= -D TEST_PREFIX= -D TEST_SUFFIX= -D NO_PRETTY_TYPES=FALSE -D NO_PRETTY_VALUES=FALSE -D TEST_LIST=memory_test_TESTS -D CTEST_FILE=/tmp/B.ev3pxxw8/BUILD/highway-0.14.2/build/memory_test[1]_tests.cmake -D TEST_DISCOVERY_TIMEOUT=60 -P /usr/share/cmake/Modules/GoogleTestAddTests.cmake
make[2]: Leaving directory '/tmp/B.ev3pxxw8/BUILD/highway-0.14.2/build'
make[1]: Entering directory '/tmp/B.ev3pxxw8/BUILD/highway-0.14.2/build'
[ 89%] Built target memory_test
make[1]: Leaving directory '/tmp/B.ev3pxxw8/BUILD/highway-0.14.2/build'
make[2]: Entering directory '/tmp/B.ev3pxxw8/BUILD/highway-0.14.2/build'
[ 32%] Building CXX object CMakeFiles/convert_test.dir/hwy/tests/convert_test.cc.o
/usr/bin/x86_64-pld-linux-gnux32-g++   -I/tmp/B.ev3pxxw8/BUILD/highway-0.14.2  -O2 -fwrapv -pipe -Wformat -Werror=format-security -Wp,-D_FORTIFY_SOURCE=2 -fstack-protector-strong --param=ssp-buffer-size=4 -Werror=trampolines -fPIC -mtune=generic -march=x86-64  -DNDEBUG -DQT_NO_DEBUG -fPIE   -Wno-builtin-macro-redefined -D__DATE__=\"redacted\" -D__TIMESTAMP__=\"redacted\" -D__TIME__=\"redacted\" -fmerge-all-constants -Wall -Wextra -Wconversion -Wsign-conversion -Wvla -Wnon-virtual-dtor -fmath-errno -fno-exceptions -DHWY_IS_TEST=1 -std=c++11 -o CMakeFiles/convert_test.dir/hwy/tests/convert_test.cc.o -c /tmp/B.ev3pxxw8/BUILD/highway-0.14.2/hwy/tests/convert_test.cc
make[2]: Leaving directory '/tmp/B.ev3pxxw8/BUILD/highway-0.14.2/build'
make[2]: Entering directory '/tmp/B.ev3pxxw8/BUILD/highway-0.14.2/build'
[ 91%] Linking CXX executable tests/convert_test
/usr/bin/cmake -E cmake_link_script CMakeFiles/convert_test.dir/link.txt --verbose=1
/usr/bin/x86_64-pld-linux-gnux32-g++  -O2 -fwrapv -pipe -Wformat -Werror=format-security -Wp,-D_FORTIFY_SOURCE=2 -fstack-protector-strong --param=ssp-buffer-size=4 -Werror=trampolines -fPIC -mtune=generic -march=x86-64  -DNDEBUG -DQT_NO_DEBUG  -Wl,--as-needed -Wl,--no-copy-dt-needed-entries -Wl,-z,relro -Wl,-z,combreloc -fPIE -pie CMakeFiles/convert_test.dir/hwy/tests/convert_test.cc.o  -o tests/convert_test  libhwy.a libhwy_contrib.a /usr/libx32/libgtest.so /usr/libx32/libgtest_main.so /usr/libx32/libgtest.so 
/usr/bin/cmake -D TEST_TARGET=convert_test -D TEST_EXECUTABLE=/tmp/B.ev3pxxw8/BUILD/highway-0.14.2/build/tests/convert_test -D TEST_EXECUTOR= -D TEST_WORKING_DIR=/tmp/B.ev3pxxw8/BUILD/highway-0.14.2/build -D TEST_EXTRA_ARGS= -D TEST_PROPERTIES= -D TEST_PREFIX= -D TEST_SUFFIX= -D NO_PRETTY_TYPES=FALSE -D NO_PRETTY_VALUES=FALSE -D TEST_LIST=convert_test_TESTS -D CTEST_FILE=/tmp/B.ev3pxxw8/BUILD/highway-0.14.2/build/convert_test[1]_tests.cmake -D TEST_DISCOVERY_TIMEOUT=60 -P /usr/share/cmake/Modules/GoogleTestAddTests.cmake
make[2]: Leaving directory '/tmp/B.ev3pxxw8/BUILD/highway-0.14.2/build'
make[1]: Entering directory '/tmp/B.ev3pxxw8/BUILD/highway-0.14.2/build'
[ 91%] Built target convert_test
make[1]: Leaving directory '/tmp/B.ev3pxxw8/BUILD/highway-0.14.2/build'
make[2]: Entering directory '/tmp/B.ev3pxxw8/BUILD/highway-0.14.2/build'
[ 67%] Building CXX object CMakeFiles/combine_test.dir/hwy/tests/combine_test.cc.o
/usr/bin/x86_64-pld-linux-gnux32-g++   -I/tmp/B.ev3pxxw8/BUILD/highway-0.14.2  -O2 -fwrapv -pipe -Wformat -Werror=format-security -Wp,-D_FORTIFY_SOURCE=2 -fstack-protector-strong --param=ssp-buffer-size=4 -Werror=trampolines -fPIC -mtune=generic -march=x86-64  -DNDEBUG -DQT_NO_DEBUG -fPIE   -Wno-builtin-macro-redefined -D__DATE__=\"redacted\" -D__TIMESTAMP__=\"redacted\" -D__TIME__=\"redacted\" -fmerge-all-constants -Wall -Wextra -Wconversion -Wsign-conversion -Wvla -Wnon-virtual-dtor -fmath-errno -fno-exceptions -DHWY_IS_TEST=1 -std=c++11 -o CMakeFiles/combine_test.dir/hwy/tests/combine_test.cc.o -c /tmp/B.ev3pxxw8/BUILD/highway-0.14.2/hwy/tests/combine_test.cc
make[2]: Leaving directory '/tmp/B.ev3pxxw8/BUILD/highway-0.14.2/build'
make[2]: Entering directory '/tmp/B.ev3pxxw8/BUILD/highway-0.14.2/build'
[ 93%] Linking CXX executable tests/combine_test
/usr/bin/cmake -E cmake_link_script CMakeFiles/combine_test.dir/link.txt --verbose=1
/usr/bin/x86_64-pld-linux-gnux32-g++  -O2 -fwrapv -pipe -Wformat -Werror=format-security -Wp,-D_FORTIFY_SOURCE=2 -fstack-protector-strong --param=ssp-buffer-size=4 -Werror=trampolines -fPIC -mtune=generic -march=x86-64  -DNDEBUG -DQT_NO_DEBUG  -Wl,--as-needed -Wl,--no-copy-dt-needed-entries -Wl,-z,relro -Wl,-z,combreloc -fPIE -pie CMakeFiles/combine_test.dir/hwy/tests/combine_test.cc.o  -o tests/combine_test  libhwy.a libhwy_contrib.a /usr/libx32/libgtest.so /usr/libx32/libgtest_main.so /usr/libx32/libgtest.so 
/usr/bin/cmake -D TEST_TARGET=combine_test -D TEST_EXECUTABLE=/tmp/B.ev3pxxw8/BUILD/highway-0.14.2/build/tests/combine_test -D TEST_EXECUTOR= -D TEST_WORKING_DIR=/tmp/B.ev3pxxw8/BUILD/highway-0.14.2/build -D TEST_EXTRA_ARGS= -D TEST_PROPERTIES= -D TEST_PREFIX= -D TEST_SUFFIX= -D NO_PRETTY_TYPES=FALSE -D NO_PRETTY_VALUES=FALSE -D TEST_LIST=combine_test_TESTS -D CTEST_FILE=/tmp/B.ev3pxxw8/BUILD/highway-0.14.2/build/combine_test[1]_tests.cmake -D TEST_DISCOVERY_TIMEOUT=60 -P /usr/share/cmake/Modules/GoogleTestAddTests.cmake
make[2]: Leaving directory '/tmp/B.ev3pxxw8/BUILD/highway-0.14.2/build'
make[1]: Entering directory '/tmp/B.ev3pxxw8/BUILD/highway-0.14.2/build'
[ 93%] Built target combine_test
make[1]: Leaving directory '/tmp/B.ev3pxxw8/BUILD/highway-0.14.2/build'
make[2]: Entering directory '/tmp/B.ev3pxxw8/BUILD/highway-0.14.2/build'
[ 47%] Building CXX object CMakeFiles/arithmetic_test.dir/hwy/tests/arithmetic_test.cc.o
/usr/bin/x86_64-pld-linux-gnux32-g++   -I/tmp/B.ev3pxxw8/BUILD/highway-0.14.2  -O2 -fwrapv -pipe -Wformat -Werror=format-security -Wp,-D_FORTIFY_SOURCE=2 -fstack-protector-strong --param=ssp-buffer-size=4 -Werror=trampolines -fPIC -mtune=generic -march=x86-64  -DNDEBUG -DQT_NO_DEBUG -fPIE   -Wno-builtin-macro-redefined -D__DATE__=\"redacted\" -D__TIMESTAMP__=\"redacted\" -D__TIME__=\"redacted\" -fmerge-all-constants -Wall -Wextra -Wconversion -Wsign-conversion -Wvla -Wnon-virtual-dtor -fmath-errno -fno-exceptions -DHWY_IS_TEST=1 -std=c++11 -o CMakeFiles/arithmetic_test.dir/hwy/tests/arithmetic_test.cc.o -c /tmp/B.ev3pxxw8/BUILD/highway-0.14.2/hwy/tests/arithmetic_test.cc
make[2]: Leaving directory '/tmp/B.ev3pxxw8/BUILD/highway-0.14.2/build'
make[2]: Entering directory '/tmp/B.ev3pxxw8/BUILD/highway-0.14.2/build'
[ 95%] Linking CXX executable tests/arithmetic_test
/usr/bin/cmake -E cmake_link_script CMakeFiles/arithmetic_test.dir/link.txt --verbose=1
/usr/bin/x86_64-pld-linux-gnux32-g++  -O2 -fwrapv -pipe -Wformat -Werror=format-security -Wp,-D_FORTIFY_SOURCE=2 -fstack-protector-strong --param=ssp-buffer-size=4 -Werror=trampolines -fPIC -mtune=generic -march=x86-64  -DNDEBUG -DQT_NO_DEBUG  -Wl,--as-needed -Wl,--no-copy-dt-needed-entries -Wl,-z,relro -Wl,-z,combreloc -fPIE -pie CMakeFiles/arithmetic_test.dir/hwy/tests/arithmetic_test.cc.o  -o tests/arithmetic_test  libhwy.a libhwy_contrib.a /usr/libx32/libgtest.so /usr/libx32/libgtest_main.so /usr/libx32/libgtest.so 
/usr/bin/cmake -D TEST_TARGET=arithmetic_test -D TEST_EXECUTABLE=/tmp/B.ev3pxxw8/BUILD/highway-0.14.2/build/tests/arithmetic_test -D TEST_EXECUTOR= -D TEST_WORKING_DIR=/tmp/B.ev3pxxw8/BUILD/highway-0.14.2/build -D TEST_EXTRA_ARGS= -D TEST_PROPERTIES= -D TEST_PREFIX= -D TEST_SUFFIX= -D NO_PRETTY_TYPES=FALSE -D NO_PRETTY_VALUES=FALSE -D TEST_LIST=arithmetic_test_TESTS -D CTEST_FILE=/tmp/B.ev3pxxw8/BUILD/highway-0.14.2/build/arithmetic_test[1]_tests.cmake -D TEST_DISCOVERY_TIMEOUT=60 -P /usr/share/cmake/Modules/GoogleTestAddTests.cmake
make[2]: Leaving directory '/tmp/B.ev3pxxw8/BUILD/highway-0.14.2/build'
make[1]: Entering directory '/tmp/B.ev3pxxw8/BUILD/highway-0.14.2/build'
[ 95%] Built target arithmetic_test
make[1]: Leaving directory '/tmp/B.ev3pxxw8/BUILD/highway-0.14.2/build'
make[2]: Entering directory '/tmp/B.ev3pxxw8/BUILD/highway-0.14.2/build'
[ 34%] Building CXX object CMakeFiles/blockwise_test.dir/hwy/tests/blockwise_test.cc.o
/usr/bin/x86_64-pld-linux-gnux32-g++   -I/tmp/B.ev3pxxw8/BUILD/highway-0.14.2  -O2 -fwrapv -pipe -Wformat -Werror=format-security -Wp,-D_FORTIFY_SOURCE=2 -fstack-protector-strong --param=ssp-buffer-size=4 -Werror=trampolines -fPIC -mtune=generic -march=x86-64  -DNDEBUG -DQT_NO_DEBUG -fPIE   -Wno-builtin-macro-redefined -D__DATE__=\"redacted\" -D__TIMESTAMP__=\"redacted\" -D__TIME__=\"redacted\" -fmerge-all-constants -Wall -Wextra -Wconversion -Wsign-conversion -Wvla -Wnon-virtual-dtor -fmath-errno -fno-exceptions -DHWY_IS_TEST=1 -std=c++11 -o CMakeFiles/blockwise_test.dir/hwy/tests/blockwise_test.cc.o -c /tmp/B.ev3pxxw8/BUILD/highway-0.14.2/hwy/tests/blockwise_test.cc
make[2]: Leaving directory '/tmp/B.ev3pxxw8/BUILD/highway-0.14.2/build'
make[2]: Entering directory '/tmp/B.ev3pxxw8/BUILD/highway-0.14.2/build'
[ 97%] Linking CXX executable tests/blockwise_test
/usr/bin/cmake -E cmake_link_script CMakeFiles/blockwise_test.dir/link.txt --verbose=1
/usr/bin/x86_64-pld-linux-gnux32-g++  -O2 -fwrapv -pipe -Wformat -Werror=format-security -Wp,-D_FORTIFY_SOURCE=2 -fstack-protector-strong --param=ssp-buffer-size=4 -Werror=trampolines -fPIC -mtune=generic -march=x86-64  -DNDEBUG -DQT_NO_DEBUG  -Wl,--as-needed -Wl,--no-copy-dt-needed-entries -Wl,-z,relro -Wl,-z,combreloc -fPIE -pie CMakeFiles/blockwise_test.dir/hwy/tests/blockwise_test.cc.o  -o tests/blockwise_test  libhwy.a libhwy_contrib.a /usr/libx32/libgtest.so /usr/libx32/libgtest_main.so /usr/libx32/libgtest.so 
/usr/bin/cmake -D TEST_TARGET=blockwise_test -D TEST_EXECUTABLE=/tmp/B.ev3pxxw8/BUILD/highway-0.14.2/build/tests/blockwise_test -D TEST_EXECUTOR= -D TEST_WORKING_DIR=/tmp/B.ev3pxxw8/BUILD/highway-0.14.2/build -D TEST_EXTRA_ARGS= -D TEST_PROPERTIES= -D TEST_PREFIX= -D TEST_SUFFIX= -D NO_PRETTY_TYPES=FALSE -D NO_PRETTY_VALUES=FALSE -D TEST_LIST=blockwise_test_TESTS -D CTEST_FILE=/tmp/B.ev3pxxw8/BUILD/highway-0.14.2/build/blockwise_test[1]_tests.cmake -D TEST_DISCOVERY_TIMEOUT=60 -P /usr/share/cmake/Modules/GoogleTestAddTests.cmake
make[2]: Leaving directory '/tmp/B.ev3pxxw8/BUILD/highway-0.14.2/build'
make[1]: Entering directory '/tmp/B.ev3pxxw8/BUILD/highway-0.14.2/build'
[ 97%] Built target blockwise_test
make[1]: Leaving directory '/tmp/B.ev3pxxw8/BUILD/highway-0.14.2/build'
make[2]: Entering directory '/tmp/B.ev3pxxw8/BUILD/highway-0.14.2/build'
[ 80%] Building CXX object CMakeFiles/mask_test.dir/hwy/tests/mask_test.cc.o
/usr/bin/x86_64-pld-linux-gnux32-g++   -I/tmp/B.ev3pxxw8/BUILD/highway-0.14.2  -O2 -fwrapv -pipe -Wformat -Werror=format-security -Wp,-D_FORTIFY_SOURCE=2 -fstack-protector-strong --param=ssp-buffer-size=4 -Werror=trampolines -fPIC -mtune=generic -march=x86-64  -DNDEBUG -DQT_NO_DEBUG -fPIE   -Wno-builtin-macro-redefined -D__DATE__=\"redacted\" -D__TIMESTAMP__=\"redacted\" -D__TIME__=\"redacted\" -fmerge-all-constants -Wall -Wextra -Wconversion -Wsign-conversion -Wvla -Wnon-virtual-dtor -fmath-errno -fno-exceptions -DHWY_IS_TEST=1 -std=c++11 -o CMakeFiles/mask_test.dir/hwy/tests/mask_test.cc.o -c /tmp/B.ev3pxxw8/BUILD/highway-0.14.2/hwy/tests/mask_test.cc
make[2]: Leaving directory '/tmp/B.ev3pxxw8/BUILD/highway-0.14.2/build'
make[2]: Entering directory '/tmp/B.ev3pxxw8/BUILD/highway-0.14.2/build'
[100%] Linking CXX executable tests/mask_test
/usr/bin/cmake -E cmake_link_script CMakeFiles/mask_test.dir/link.txt --verbose=1
/usr/bin/x86_64-pld-linux-gnux32-g++  -O2 -fwrapv -pipe -Wformat -Werror=format-security -Wp,-D_FORTIFY_SOURCE=2 -fstack-protector-strong --param=ssp-buffer-size=4 -Werror=trampolines -fPIC -mtune=generic -march=x86-64  -DNDEBUG -DQT_NO_DEBUG  -Wl,--as-needed -Wl,--no-copy-dt-needed-entries -Wl,-z,relro -Wl,-z,combreloc -fPIE -pie CMakeFiles/mask_test.dir/hwy/tests/mask_test.cc.o  -o tests/mask_test  libhwy.a libhwy_contrib.a /usr/libx32/libgtest.so /usr/libx32/libgtest_main.so /usr/libx32/libgtest.so 
/usr/bin/cmake -D TEST_TARGET=mask_test -D TEST_EXECUTABLE=/tmp/B.ev3pxxw8/BUILD/highway-0.14.2/build/tests/mask_test -D TEST_EXECUTOR= -D TEST_WORKING_DIR=/tmp/B.ev3pxxw8/BUILD/highway-0.14.2/build -D TEST_EXTRA_ARGS= -D TEST_PROPERTIES= -D TEST_PREFIX= -D TEST_SUFFIX= -D NO_PRETTY_TYPES=FALSE -D NO_PRETTY_VALUES=FALSE -D TEST_LIST=mask_test_TESTS -D CTEST_FILE=/tmp/B.ev3pxxw8/BUILD/highway-0.14.2/build/mask_test[1]_tests.cmake -D TEST_DISCOVERY_TIMEOUT=60 -P /usr/share/cmake/Modules/GoogleTestAddTests.cmake
make[2]: Leaving directory '/tmp/B.ev3pxxw8/BUILD/highway-0.14.2/build'
make[1]: Entering directory '/tmp/B.ev3pxxw8/BUILD/highway-0.14.2/build'
[100%] Built target mask_test
make[1]: Leaving directory '/tmp/B.ev3pxxw8/BUILD/highway-0.14.2/build'
make: *** [Makefile:164: all] Error 2
error: Bad exit status from /tmp/B.ev3pxxw8/BUILD/tmp/rpm-tmp.SSaGeR (%build)


RPM build errors:
    Bad exit status from /tmp/B.ev3pxxw8/BUILD/tmp/rpm-tmp.SSaGeR (%build)
ended at: Tue Oct  5 22:17:11 2021, done in 0:01:56.531214
error: No files produced.
+ chmod -R u+rwX /tmp/B.ev3pxxw8/BUILD
+ rm -rf /tmp/B.ev3pxxw8/tmp /tmp/B.ev3pxxw8/BUILD
+ rm -rf /tmp/B.ev3pxxw8
Begin-PLD-Builder-Info
Build-Time: user:512.67s sys:11.74s real:118.53s (faults io:95 non-io:2078460)

End-PLD-Builder-Info
[Back to list of logs] [View rpm -qa of builder]