FailedOk

th/SRPMS[OK]
th/x32[OK]
th/i686[OK]
th/x86_64[OK]

ac/SRPMS[OK]
ac/i386[OK]
ac/i586[OK]
ac/i686[OK]
ac/alpha[OK]
ac/amd64[OK]
ac/athlon[OK]
ac/ppc[OK]
ac/sparc[OK]
ac/sparc64[OK]

Advanced Search
main()
Powered by PLD Linux
(c) 2002-2021 PLD Team
$Revision: 1.37 $
Powered by Przewodniczacego Lepper-a.
Your IP: 3.238.204.31

highway fa111982-2aa5-47f4-b538-d4806b627711

Status:Failed
Source URL:https://buildlogs.pld-linux.org/pld/th/x32/FAIL/highway,fa111982-2aa5-47f4-b538-d4806b627711.bz2
text/plain URL:View!
full text:View!
rpm -qa of builder:View!
Date:2021/10/03 08:32:29
Runtime:0:00:01.853515

Toc:

  • error 1
  • gmake[2]: *** [CMakeFiles/googletest.dir/build.make:112: googletest-prefix/src/googletest-stamp/googletest-download] Error 1
  • error 2
  • gmake[1]: *** [CMakeFiles/Makefile2:96: CMakeFiles/googletest.dir/all] Error 2
  • error 3
  • error: Bad exit status from /tmp/B.usw_fo_5/BUILD/tmp/rpm-tmp.sNqMHO (%build)
  • error 4
  • RPM build errors:
  • error 5
  • error: No files produced.

Content:

sending signal 9 to pid -1
cleaning up /tmp
fetching https://srcbuilder.pld-linux.org/th//srpms/fa111982-2aa5-47f4-b538-d4806b627711/highway-0.14.2-1.src.rpm
fetched 1554284 bytes, 3016.9 K/s
installing srpm: highway-0.14.2-1.src.rpm
+ install -d /tmp/B.usw_fo_5/BUILD /tmp/B.usw_fo_5/RPMS
+ LC_ALL=en_US.UTF-8
+ rpm -qp --changelog highway-0.14.2-1.src.rpm
* Sun Oct 03 2021 PLD Linux Team <feedback@pld-linux.org>
- For complete changelog see: http://git.pld-linux.org/?p=packages/highway.git;a=log;h=master
* Sat Oct 02 2021 Jakub Bogusz <qboosh@pld-linux.org> a15f126
- new + rpm -Uhv --nodeps --define '_topdir /tmp/B.usw_fo_5' --define '_specdir %{_topdir}' --define '_sourcedir %{_specdir}' --define '_rpmdir %{_topdir}/RPMS' --define '_builddir %{_topdir}/BUILD' highway-0.14.2-1.src.rpm Updating / installing... highway-0.14.2-1 ######################################## + rm -f highway-0.14.2-1.src.rpm + install -m 700 -d /tmp/B.usw_fo_5/BUILD/tmp + TMPDIR=/tmp/B.usw_fo_5/BUILD/tmp + exec nice -n 0 rpmbuild -bp --short-circuit --nodeps --define '_topdir /tmp/B.usw_fo_5' --define '_specdir %{_topdir}' --define '_sourcedir %{_specdir}' --define '_rpmdir %{_topdir}/RPMS' --define '_builddir %{_topdir}/BUILD' --target x32-pld-linux --define 'prep exit 0' /tmp/B.usw_fo_5/highway.spec warning: Could not canonicalize hostname: naiad Building target platforms: x32-pld-linux Building for target x32-pld-linux checking BuildConflict-ing packages rpm: warning: Could not canonicalize hostname: naiad rpm: Building target platforms: x32-pld-linux rpm: Building for target x32-pld-linux no BuildConflicts found checking BR rpm: warning: Could not canonicalize hostname: naiad rpm: Building target platforms: x32-pld-linux rpm: Building for target x32-pld-linux no BR needed building RPM using: set -ex; : build-id: fa111982-2aa5-47f4-b538-d4806b627711; TMPDIR=/tmp/B.usw_fo_5/BUILD/tmp exec nice -n 0 rpmbuild -bb --define '_smp_mflags -j9' --define '_make_opts -Otarget' --define '_pld_builder 1' --define '_topdir /tmp/B.usw_fo_5' --define '_specdir %{_topdir}' --define '_sourcedir %{_specdir}' --define '_rpmdir %{_topdir}/RPMS' --define '_builddir %{_topdir}/BUILD' --target x32-pld-linux /tmp/B.usw_fo_5/highway.spec + : build-id: fa111982-2aa5-47f4-b538-d4806b627711 + TMPDIR=/tmp/B.usw_fo_5/BUILD/tmp + exec nice -n 0 rpmbuild -bb --define '_smp_mflags -j9' --define '_make_opts -Otarget' --define '_pld_builder 1' --define '_topdir /tmp/B.usw_fo_5' --define '_specdir %{_topdir}' --define '_sourcedir %{_specdir}' --define '_rpmdir %{_topdir}/RPMS' --define '_builddir %{_topdir}/BUILD' --target x32-pld-linux /tmp/B.usw_fo_5/highway.spec warning: Could not canonicalize hostname: naiad Building target platforms: x32-pld-linux Building for target x32-pld-linux Executing(%prep): /bin/sh -e /tmp/B.usw_fo_5/BUILD/tmp/rpm-tmp.IUPVtY + umask 022 + cd /tmp/B.usw_fo_5/BUILD + cd /tmp/B.usw_fo_5/BUILD + rm -rf highway-0.14.2 + /bin/gzip -dc /tmp/B.usw_fo_5/highway-0.14.2.tar.gz + /bin/tar -xof - + STATUS=0 + '[' 0 -ne 0 ']' + cd highway-0.14.2 + /bin/chmod -Rf a+rX,u+w,g-w,o-w . + RPM_EC=0 + jobs -p + exit 0 Executing(%build): /bin/sh -e /tmp/B.usw_fo_5/BUILD/tmp/rpm-tmp.sNqMHO HOME=/home/users/builder PATH=/home/users/builder/GNUstep/Tools:/bin:/usr/bin:/usr/local/bin TMPDIR=/tmp/B.usw_fo_5/BUILD/tmp + umask 022 + cd /tmp/B.usw_fo_5/BUILD + cd highway-0.14.2 + install -d build + cd build + CC=x86_64-pld-linux-gnux32-gcc CXX=x86_64-pld-linux-gnux32-g++ CPPFLAGS='' /usr/bin/cmake '-DCMAKE_VERBOSE_MAKEFILE:BOOL=ON' '-DCMAKE_BUILD_TYPE=PLD' '-DCMAKE_INSTALL_BINDIR:PATH=/usr/bin' '-DCMAKE_INSTALL_SBINDIR:PATH=/usr/sbin' '-DCMAKE_INSTALL_LIBEXECDIR:PATH=/usr/libexec' '-DCMAKE_INSTALL_SYSCONFDIR:PATH=/etc' '-DCMAKE_INSTALL_SHAREDSTATEDIRPATH:PATH=/var/lib' '-DCMAKE_INSTALL_LOCALSTATEDIRPATH:PATH=/var' '-DCMAKE_INSTALL_LIBDIR:PATH=/usr/libx32' '-DCMAKE_INSTALL_INCLUDEDIR:PATH=/usr/include' '-DCMAKE_INSTALL_OLDINCLUDEDIR:PATH=/usr/include' '-DCMAKE_INSTALL_DATAROOTDIR:PATH=/usr/share' '-DCMAKE_INSTALL_DATADIR:PATH=/usr/share' '-DCMAKE_INSTALL_INFODIR:PATH=/usr/share/info' '-DCMAKE_INSTALL_LOCALEDIR:PATH=/usr/share/locale' '-DCMAKE_INSTALL_MANDIR:PATH=/usr/share/man' '-DCMAKE_INSTALL_DOCDIR:PATH=/usr/share/doc' '-DCMAKE_INSTALL_PREFIX:PATH=/usr' '-DSYSCONF_INSTALL_DIR:PATH=/etc' '-DCMAKE_CXX_FLAGS_PLD=-O2 -fwrapv -pipe -Wformat -Werror=format-security -gdwarf-4 -fno-debug-types-section -fvar-tracking-assignments -g2 -Wp,-D_FORTIFY_SOURCE=2 -fstack-protector-strong --param=ssp-buffer-size=4 -Werror=trampolines -fPIC -mtune=generic -march=x86-64 -gdwarf-4 -fno-debug-types-section -fvar-tracking-assignments -g2 -DNDEBUG -DQT_NO_DEBUG' '-DCMAKE_C_FLAGS_PLD=-O2 -fwrapv -pipe -Wformat -Werror=format-security -gdwarf-4 -fno-debug-types-section -fvar-tracking-assignments -g2 -Wp,-D_FORTIFY_SOURCE=2 -fstack-protector-strong --param=ssp-buffer-size=4 -Werror=trampolines -fPIC -mtune=generic -march=x86-64 -gdwarf-4 -fno-debug-types-section -fvar-tracking-assignments -g2 -DNDEBUG -DQT_NO_DEBUG' '-DCMAKE_Fortran_FLAGS_PLD=-O2 -fwrapv -pipe -Wformat -Werror=format-security -gdwarf-4 -fno-debug-types-section -fvar-tracking-assignments -g2 -Wp,-D_FORTIFY_SOURCE=2 -fstack-protector-strong --param=ssp-buffer-size=4 -Werror=trampolines -fPIC -mtune=generic -march=x86-64 -gdwarf-4 -fno-debug-types-section -fvar-tracking-assignments -g2 -DNDEBUG -DQT_NO_DEBUG' '-DCMAKE_EXE_LINKER_FLAGS_PLD=-Wl,--as-needed -Wl,--no-copy-dt-needed-entries -Wl,-z,relro -Wl,-z,combreloc ' '-DCMAKE_SHARED_LINKER_FLAGS_PLD=-Wl,--as-needed -Wl,--no-copy-dt-needed-entries -Wl,-z,relro -Wl,-z,combreloc ' '-DCMAKE_MODULE_LINKER_FLAGS_PLD=-Wl,--as-needed -Wl,--no-copy-dt-needed-entries -Wl,-z,relro -Wl,-z,combreloc ' '-DLIB_SUFFIX=x32' '-DBUILD_SHARED_LIBS:BOOL=ON' .. '-DCMAKE_INSTALL_INCLUDEDIR=include' '-DCMAKE_INSTALL_LIBDIR=libx32' -- The C compiler identification is GNU 11.2.0 -- The CXX compiler identification is GNU 11.2.0 -- Check for working C compiler: /usr/bin/x86_64-pld-linux-gnux32-gcc -- Check for working C compiler: /usr/bin/x86_64-pld-linux-gnux32-gcc - works -- Detecting C compiler ABI info -- Detecting C compiler ABI info - done -- Detecting C compile features -- Detecting C compile features - done -- Check for working CXX compiler: /usr/bin/x86_64-pld-linux-gnux32-g++ -- Check for working CXX compiler: /usr/bin/x86_64-pld-linux-gnux32-g++ - works -- Detecting CXX compiler ABI info -- Detecting CXX compiler ABI info - done -- Detecting CXX compile features -- Detecting CXX compile features - done -- Performing Test HWY_EMSCRIPTEN -- Performing Test HWY_EMSCRIPTEN - Failed -- Configuring done -- Generating done -- Build files have been written to: /tmp/B.usw_fo_5/BUILD/highway-0.14.2/build/googletest-download Scanning dependencies of target googletest [ 11%] Creating directories for 'googletest' [ 22%] Performing download step (git clone) for 'googletest' Cloning into 'googletest-src'... fatal: unable to access 'https://github.com/google/googletest.git/': Could not resolve host: github.com Cloning into 'googletest-src'... fatal: unable to access 'https://github.com/google/googletest.git/': Could not resolve host: github.com Cloning into 'googletest-src'... fatal: unable to access 'https://github.com/google/googletest.git/': Could not resolve host: github.com -- Had to git clone more than once: 3 times. CMake Error at googletest-download/googletest-prefix/tmp/googletest-gitclone.cmake:31 (message): Failed to clone repository: 'https://github.com/google/googletest.git' gmake[2]: *** [CMakeFiles/googletest.dir/build.make:112: googletest-prefix/src/googletest-stamp/googletest-download] Error 1 gmake[1]: *** [CMakeFiles/Makefile2:96: CMakeFiles/googletest.dir/all] Error 2 gmake: *** [Makefile:104: all] Error 2 CMake Error at CMakeLists.txt:292 (message): Build step for googletest failed: 2 -- Configuring incomplete, errors occurred! See also "/tmp/B.usw_fo_5/BUILD/highway-0.14.2/build/CMakeFiles/CMakeOutput.log". See also "/tmp/B.usw_fo_5/BUILD/highway-0.14.2/build/CMakeFiles/CMakeError.log". error: Bad exit status from /tmp/B.usw_fo_5/BUILD/tmp/rpm-tmp.sNqMHO (%build) RPM build errors: Could not canonicalize hostname: naiad Bad exit status from /tmp/B.usw_fo_5/BUILD/tmp/rpm-tmp.sNqMHO (%build) ended at: Sun Oct 3 08:32:29 2021, done in 0:00:01.853515 error: No files produced. + chmod -R u+rwX /tmp/B.usw_fo_5/BUILD + rm -rf /tmp/B.usw_fo_5/tmp /tmp/B.usw_fo_5/BUILD + rm -rf /tmp/B.usw_fo_5 Begin-PLD-Builder-Info Build-Time: user:2.27s sys:1.08s real:3.85s (faults io:6 non-io:191215) End-PLD-Builder-Info
[Back to list of logs] [View rpm -qa of builder]