FailedOk

th/SRPMS[OK]
th/x32[OK]
th/i686[OK]
th/x86_64[OK]

ac/SRPMS[OK]
ac/i386[OK]
ac/i586[OK]
ac/i686[OK]
ac/alpha[OK]
ac/amd64[OK]
ac/athlon[OK]
ac/ppc[OK]
ac/sparc[OK]
ac/sparc64[OK]

Advanced Search
main()
Powered by PLD Linux
(c) 2002-2024 PLD Team
$Revision: 1.37 $
Powered by Ken.
Your IP: 44.213.60.33

lal-detchar 6b8a801a-c4da-48fc-aa52-8c7cdc2a7c66

Status:Failed
Source URL:https://buildlogs.pld-linux.org/pld/th/x32/FAIL/lal-detchar,6b8a801a-c4da-48fc-aa52-8c7cdc2a7c66.bz2
text/plain URL:View!
full text:View!
rpm -qa of builder:View!
Date:2024/06/09 18:01:46
Runtime:0:00:29.334184

Toc:

  • error 1
  • rpm: error: Failed build dependencies:
  • error 2
  • rpm: error: Failed build dependencies:
  • error 3
  • rpm: error: Failed build dependencies:
  • prep
  • Executing(%prep): /bin/sh -e /tmp/B.gf3vzowf/BUILD/tmp/rpm-tmp.ZCLHQs
  • build
  • Executing(%build): /bin/sh -e /tmp/B.gf3vzowf/BUILD/tmp/rpm-tmp.oqriZ0
  • error 4
  • ../include/lal/LALDetCharHvetoUtils.h:26:10: fatal error: lal/LIGOLwXMLBurstRead.h: No such file or directory
  • error 5
  • compilation terminated.
  • error 6
  • make[3]: *** [Makefile:934: LALDetCharHvetoUtils.lo] Error 1
  • error 7
  • LALDetCharGlibTypes.c:58:45: error: 'XLALDestroySnglBurst' undeclared (first use in this function); did you mean 'XLALSortSnglBurst'?
  • error 8
  • make[3]: *** [Makefile:934: LALDetCharGlibTypes.lo] Error 1
  • error 9
  • ../include/lal/LALDetCharHveto.h:30:10: fatal error: lal/LIGOLwXMLBurstRead.h: No such file or directory
  • error 10
  • compilation terminated.
  • error 11
  • make[3]: *** [Makefile:934: LALDetCharHveto.lo] Error 1
  • error 12
  • make[2]: *** [Makefile:703: all] Error 2
  • error 13
  • make[1]: *** [Makefile:615: all-recursive] Error 1
  • error 14
  • error: Bad exit status from /tmp/B.gf3vzowf/BUILD/tmp/rpm-tmp.oqriZ0 (%build)
  • error 15
  • RPM build errors:
  • error 16
  • error: No files produced.

Content:

checking if we should skip the build
started at: Sun Jun  9 18:01:05 2024
killing old processes on a builder
sending signal 9 to pid -1
cleaning up /tmp
fetching https://srcbuilder.pld-linux.org/th//srpms/6b8a801a-c4da-48fc-aa52-8c7cdc2a7c66/lal-detchar-0.3.5-3.src.rpm
fetched 499548 bytes, 1301.7 K/s
installing srpm: lal-detchar-0.3.5-3.src.rpm
+ install -d /tmp/B.gf3vzowf/BUILD /tmp/B.gf3vzowf/RPMS
+ LC_ALL=en_US.UTF-8
+ rpm -qp --changelog lal-detchar-0.3.5-3.src.rpm
* Sun Jun 09 2024 PLD Linux Team <feedback@pld-linux.org>
- For complete changelog see: http://git.pld-linux.org/?p=packages/lal-detchar.git;a=log;h=master
* Sun Jan 22 2023 Jakub Bogusz <qboosh@pld-linux.org> 7d395b5
- added lal-swig,octave patches (adjust to swig types from lal 7.2.x, fix octave install dir) - disable python2 module by default (no longer fulfillable dependencies) - release 3 * Sun Nov 03 2019 Jan Rękorajski <baggins@pld-linux.org> 76502b5
- rebuild with updated framework - rel 2 * Fri Jul 07 2017 Jakub Bogusz <qboosh@pld-linux.org> a3e3280
- new + rpm -Uhv --nodeps --define '_topdir /tmp/B.gf3vzowf' --define '_specdir %{_topdir}' --define '_sourcedir %{_specdir}' --define '_rpmdir %{_topdir}/RPMS' --define '_builddir %{_topdir}/BUILD' lal-detchar-0.3.5-3.src.rpm Updating / installing... lal-detchar-0.3.5-3 ######################################## + rm -f lal-detchar-0.3.5-3.src.rpm + install -m 700 -d /tmp/B.gf3vzowf/BUILD/tmp + TMPDIR=/tmp/B.gf3vzowf/BUILD/tmp + exec nice -n 0 rpmbuild -bp --short-circuit --nodeps --define '_topdir /tmp/B.gf3vzowf' --define '_specdir %{_topdir}' --define '_sourcedir %{_specdir}' --define '_rpmdir %{_topdir}/RPMS' --define '_builddir %{_topdir}/BUILD' --target x32-pld-linux --define 'prep exit 0' /tmp/B.gf3vzowf/lal-detchar.spec Building target platforms: x32-pld-linux Building for target x32-pld-linux checking BuildConflict-ing packages rpm: error: Failed build dependencies: rpm: lal-burst-devel >= 1.4.4 is needed by lal-detchar-0.3.5-3.x32 rpm: Building target platforms: x32-pld-linux rpm: Building for target x32-pld-linux no BuildConflicts found checking BR rpm: error: Failed build dependencies: rpm: lal-burst-devel >= 1.4.4 is needed by lal-detchar-0.3.5-3.x32 rpm: Building target platforms: x32-pld-linux rpm: Building for target x32-pld-linux updating poldek cache... ready is up to date th is up to date th is up to date th-ready is up to date th-ready is up to date th-test is up to date Retrieving th-test::packages.ndir.diff.toc.gz..............................................done Retrieving diff::packages.ndir.2024.06.09-15.17.01.gz......................................done Loading [pndir]th-test... Applying packages.ndir.2024.06.09-15.17.01.gz... Writing /root/.cache/poldek/[...]/packages.ndir.gz... checking conflicting packages in BRed packages poldek: Loading [pndir]ready... poldek: Loading [pndir]th-test... poldek: Loading [pndir]th-test... poldek: Loading [pndir]th-ready... poldek: Loading [pndir]th-ready... poldek: Loading [pndir]th... poldek: Loading [pndir]th... poldek: 30730 packages read poldek: Removed 1761 duplicate packages from available set poldek: Processing dependencies... poldek: lal-burst-devel-2.0.4-1.x32 marks lal-burst-2.0.4-1.x32 (cap lal-burst = 2.0.4-1) poldek: There are 2 packages to install (1 marked by dependencies): poldek: A lal-burst-2.0.4-1.x32 lal-burst-devel-2.0.4-1.x32 poldek: This operation will use 87.3KB of disk space. poldek: Need to get 44.0KB of archives. poldek: lal-burst-2.0.4-1.x32.rpm: digests OK poldek: lal-burst-devel-2.0.4-1.x32.rpm: digests OK poldek: Executing pm-command.sh --upgrade -vh --test --root / --define _check_dirname_deps 0... poldek: Verifying... ######################################## poldek: Preparing... ######################################## no conflicts found checking BR rpm: error: Failed build dependencies: rpm: lal-burst-devel >= 1.4.4 is needed by lal-detchar-0.3.5-3.x32 rpm: Building target platforms: x32-pld-linux rpm: Building for target x32-pld-linux installing BR: lal\-burst\-devel + poldek --noask --caplookup -Q -v '--ignore=hhvm-*' '--ignore=php4-*' '--ignore=php52-*' '--ignore=php54-*' '--ignore=php55-*' '--ignore=php56-*' '--ignore=php70-*' '--ignore=php71-*' '--ignore=php72-*' '--ignore=php73-*' '--ignore=php74-*' '--ignore=php80-*' '--ignore=php81-*' '--ignore=php82-*' --upgrade lal-burst-devel Loading [pndir]ready... Loading [pndir]th-test... Loading [pndir]th-test... Loading [pndir]th-ready... Loading [pndir]th-ready... Loading [pndir]th... Loading [pndir]th... 30730 packages read Removed 1761 duplicate packages from available set Processing dependencies... lal-burst-devel-2.0.4-1.x32 marks lal-burst-2.0.4-1.x32 (cap lal-burst = 2.0.4-1) There are 2 packages to install (1 marked by dependencies): A lal-burst-2.0.4-1.x32 lal-burst-devel-2.0.4-1.x32 This operation will use 87.3KB of disk space. Need to get 44.0KB of archives. lal-burst-2.0.4-1.x32.rpm: digests OK lal-burst-devel-2.0.4-1.x32.rpm: digests OK Executing pm-command.sh --upgrade -vh --root / --define _check_dirname_deps 0... Verifying... ######################################## Preparing... ######################################## Updating / installing... lal-burst-2.0.4-1 ######################################## lal-burst-devel-2.0.4-1 ######################################## building RPM using: set -ex; : build-id: 6b8a801a-c4da-48fc-aa52-8c7cdc2a7c66; TMPDIR=/tmp/B.gf3vzowf/BUILD/tmp exec nice -n 0 rpmbuild -bb --define '__jobs 28' --define '_smp_mflags -j28' --define '_make_opts -Otarget' --define '_pld_builder 1' --define '_topdir /tmp/B.gf3vzowf' --define '_specdir %{_topdir}' --define '_sourcedir %{_specdir}' --define '_rpmdir %{_topdir}/RPMS' --define '_builddir %{_topdir}/BUILD' --target x32-pld-linux /tmp/B.gf3vzowf/lal-detchar.spec + : build-id: 6b8a801a-c4da-48fc-aa52-8c7cdc2a7c66 + TMPDIR=/tmp/B.gf3vzowf/BUILD/tmp + exec nice -n 0 rpmbuild -bb --define '__jobs 28' --define '_smp_mflags -j28' --define '_make_opts -Otarget' --define '_pld_builder 1' --define '_topdir /tmp/B.gf3vzowf' --define '_specdir %{_topdir}' --define '_sourcedir %{_specdir}' --define '_rpmdir %{_topdir}/RPMS' --define '_builddir %{_topdir}/BUILD' --target x32-pld-linux /tmp/B.gf3vzowf/lal-detchar.spec Building target platforms: x32-pld-linux Building for target x32-pld-linux Executing(%prep): /bin/sh -e /tmp/B.gf3vzowf/BUILD/tmp/rpm-tmp.ZCLHQs + umask 022 + cd /tmp/B.gf3vzowf/BUILD + cd /tmp/B.gf3vzowf/BUILD + rm -rf laldetchar-0.3.5 + /usr/bin/xz -dc /tmp/B.gf3vzowf/laldetchar-0.3.5.tar.xz + /bin/tar -xof - + STATUS=0 + '[' 0 -ne 0 ']' + cd laldetchar-0.3.5 + /bin/chmod -Rf a+rX,u+w,g-w,o-w . + echo 'Patch #0 (lal-detchar-env.patch):' Patch #0 (lal-detchar-env.patch): + </tmp/B.gf3vzowf/lal-detchar-env.patch + /usr/bin/patch -s -f -p1 '--fuzz=0' + echo 'Patch #1 (lal-metaio-detect.patch):' Patch #1 (lal-metaio-detect.patch): + </tmp/B.gf3vzowf/lal-metaio-detect.patch + /usr/bin/patch -s -f -p1 '--fuzz=0' + echo 'Patch #2 (lal-detchar-lal-swig.patch):' Patch #2 (lal-detchar-lal-swig.patch): + </tmp/B.gf3vzowf/lal-detchar-lal-swig.patch + /usr/bin/patch -s -f -p1 '--fuzz=0' + echo 'Patch #3 (lal-detchar-octave.patch):' Patch #3 (lal-detchar-octave.patch): + </tmp/B.gf3vzowf/lal-detchar-octave.patch + /usr/bin/patch -s -f -p1 '--fuzz=0' + RPM_EC=0 + jobs -p + exit 0 Executing(%build): /bin/sh -e /tmp/B.gf3vzowf/BUILD/tmp/rpm-tmp.oqriZ0 HOME=/home/users/builder PATH=/home/users/builder/GNUstep/Tools:/bin:/usr/bin:/usr/local/bin TMPDIR=/tmp/B.gf3vzowf/BUILD/tmp + umask 022 + cd /tmp/B.gf3vzowf/BUILD + cd laldetchar-0.3.5 + libtoolize --copy --force --install libtoolize: putting auxiliary files in AC_CONFIG_AUX_DIR, 'gnuscripts'. libtoolize: copying file 'gnuscripts/config.guess' libtoolize: copying file 'gnuscripts/config.sub' libtoolize: copying file 'gnuscripts/install-sh' libtoolize: copying file 'gnuscripts/ltmain.sh' libtoolize: putting macros in AC_CONFIG_MACRO_DIRS, 'gnuscripts'. libtoolize: copying file 'gnuscripts/libtool.m4' libtoolize: copying file 'gnuscripts/ltoptions.m4' libtoolize: copying file 'gnuscripts/ltsugar.m4' libtoolize: copying file 'gnuscripts/ltversion.m4' libtoolize: copying file 'gnuscripts/lt~obsolete.m4' libtoolize: Remember to add 'LT_INIT' to configure.ac. + aclocal -I gnuscripts + autoconf configure.ac:78: warning: The macro 'AC_HELP_STRING' is obsolete. configure.ac:78: You should run autoupdate. ./lib/autoconf/general.m4:204: AC_HELP_STRING is expanded from... gnuscripts/lalsuite_build.m4:714: LALSUITE_ENABLE_NIGHTLY is expanded from... configure.ac:78: the top level configure.ac:81: warning: The macro 'AC_HELP_STRING' is obsolete. configure.ac:81: You should run autoupdate. ./lib/autoconf/general.m4:204: AC_HELP_STRING is expanded from... gnuscripts/lalsuite_gccflags.m4:6: LALSUITE_ENABLE_GCC_FLAGS is expanded from... configure.ac:81: the top level configure.ac:84: warning: The macro 'AC_HELP_STRING' is obsolete. configure.ac:84: You should run autoupdate. ./lib/autoconf/general.m4:204: AC_HELP_STRING is expanded from... gnuscripts/lalsuite_swig.m4:21: LALSUITE_ENABLE_SWIG is expanded from... configure.ac:84: the top level configure.ac:84: warning: The macro 'AC_HELP_STRING' is obsolete. configure.ac:84: You should run autoupdate. ./lib/autoconf/general.m4:204: AC_HELP_STRING is expanded from... gnuscripts/lalsuite_swig.m4:68: LALSUITE_ENABLE_SWIG_LANGUAGE is expanded from... gnuscripts/lalsuite_swig.m4:21: LALSUITE_ENABLE_SWIG is expanded from... configure.ac:84: the top level configure.ac:87: warning: The macro 'AC_HELP_STRING' is obsolete. configure.ac:87: You should run autoupdate. ./lib/autoconf/general.m4:204: AC_HELP_STRING is expanded from... gnuscripts/lalsuite_build.m4:729: LALSUITE_ENABLE_ALL_LAL is expanded from... gnuscripts/lalsuite_build.m4:741: LALSUITE_ENABLE_LALFRAME is expanded from... configure.ac:87: the top level configure.ac:87: warning: The macro 'AC_HELP_STRING' is obsolete. configure.ac:87: You should run autoupdate. ./lib/autoconf/general.m4:204: AC_HELP_STRING is expanded from... gnuscripts/lalsuite_build.m4:741: LALSUITE_ENABLE_LALFRAME is expanded from... configure.ac:87: the top level configure.ac:90: warning: The macro 'AC_HELP_STRING' is obsolete. configure.ac:90: You should run autoupdate. ./lib/autoconf/general.m4:204: AC_HELP_STRING is expanded from... gnuscripts/lalsuite_build.m4:1104: LALSUITE_ENABLE_DOXYGEN is expanded from... configure.ac:90: the top level configure.ac:93: warning: The macro 'AC_HELP_STRING' is obsolete. configure.ac:93: You should run autoupdate. ./lib/autoconf/general.m4:204: AC_HELP_STRING is expanded from... gnuscripts/lalsuite_build.m4:1406: LALSUITE_ENABLE_HELP2MAN is expanded from... configure.ac:93: the top level configure.ac:105: warning: The macro 'AC_PROG_CC_C99' is obsolete. configure.ac:105: You should run autoupdate. ./lib/autoconf/c.m4:1662: AC_PROG_CC_C99 is expanded from... gnuscripts/lalsuite_build.m4:337: LALSUITE_PROG_COMPILERS is expanded from... configure.ac:105: the top level configure.ac:112: warning: The macro 'AC_HELP_STRING' is obsolete. configure.ac:112: You should run autoupdate. ./lib/autoconf/general.m4:204: AC_HELP_STRING is expanded from... gnuscripts/lalsuite_build.m4:419: LALSUITE_CHECK_PYTHON is expanded from... configure.ac:112: the top level configure.ac:115: warning: The macro 'AC_HELP_STRING' is obsolete. configure.ac:115: You should run autoupdate. ./lib/autoconf/general.m4:204: AC_HELP_STRING is expanded from... gnuscripts/lalsuite_build.m4:1053: LALSUITE_ENABLE_OSX_VERSION_CHECK is expanded from... gnuscripts/lalsuite_build.m4:1064: LALSUITE_OSX_VERSION_CHECK is expanded from... configure.ac:115: the top level configure.ac:121: warning: The macro 'AC_HEADER_STDC' is obsolete. configure.ac:121: You should run autoupdate. ./lib/autoconf/headers.m4:663: AC_HEADER_STDC is expanded from... configure.ac:121: the top level configure.ac:131: warning: The macro 'AC_TRY_RUN' is obsolete. configure.ac:131: You should run autoupdate. ./lib/autoconf/general.m4:2995: AC_TRY_RUN is expanded from... gnuscripts/lalsuite_build.m4:996: LALSUITE_CHECK_GSL_VERSION is expanded from... configure.ac:131: the top level configure.ac:132: warning: The macro 'AC_HELP_STRING' is obsolete. configure.ac:132: You should run autoupdate. ./lib/autoconf/general.m4:204: AC_HELP_STRING is expanded from... gnuscripts/lalsuite_build.m4:1035: LALSUITE_ENABLE_FAST_GSL is expanded from... configure.ac:132: the top level configure.ac:159: warning: The macro 'AC_HELP_STRING' is obsolete. configure.ac:159: You should run autoupdate. ./lib/autoconf/general.m4:204: AC_HELP_STRING is expanded from... gnuscripts/lalsuite_build.m4:1124: LALSUITE_USE_DOXYGEN is expanded from... configure.ac:159: the top level + autoheader + automake -a -c -f --foreign configure.ac:105: installing 'gnuscripts/compile' configure.ac:30: installing 'gnuscripts/missing' src/Makefile.am: installing 'gnuscripts/depcomp' + ./configure 'LDFLAGS=-Wl,--as-needed -Wl,--no-copy-dt-needed-entries -Wl,-z,relro -Wl,-z,combreloc ' 'CFLAGS=-O2 -fwrapv -pipe -Wformat -Werror=format-security -gdwarf-4 -fno-debug-types-section -fvar-tracking-assignments -g2 -Wp,-D_FORTIFY_SOURCE=2 -fstack-protector-strong --param=ssp-buffer-size=4 -Werror=trampolines -fPIC -mtune=generic -march=x86-64 -gdwarf-4 -fno-debug-types-section -fvar-tracking-assignments -g2 ' 'CXXFLAGS=-O2 -fwrapv -pipe -Wformat -Werror=format-security -gdwarf-4 -fno-debug-types-section -fvar-tracking-assignments -g2 -Wp,-D_FORTIFY_SOURCE=2 -fstack-protector-strong --param=ssp-buffer-size=4 -Werror=trampolines -fPIC -mtune=generic -march=x86-64 -gdwarf-4 -fno-debug-types-section -fvar-tracking-assignments -g2 ' 'FFLAGS=-O2 -fwrapv -pipe -Wformat -Werror=format-security -gdwarf-4 -fno-debug-types-section -fvar-tracking-assignments -g2 -Wp,-D_FORTIFY_SOURCE=2 -fstack-protector-strong --param=ssp-buffer-size=4 -Werror=trampolines -fPIC -mtune=generic -march=x86-64 -gdwarf-4 -fno-debug-types-section -fvar-tracking-assignments -g2 ' 'FCFLAGS=-O2 -fwrapv -pipe -Wformat -Werror=format-security -gdwarf-4 -fno-debug-types-section -fvar-tracking-assignments -g2 -Wp,-D_FORTIFY_SOURCE=2 -fstack-protector-strong --param=ssp-buffer-size=4 -Werror=trampolines -fPIC -mtune=generic -march=x86-64 -gdwarf-4 -fno-debug-types-section -fvar-tracking-assignments -g2 ' 'CPPFLAGS=' 'CC=x86_64-pld-linux-gnux32-gcc' 'CXX=x86_64-pld-linux-gnux32-g++' '--host=x86_64-pld-linux-gnux32' '--build=x86_64-pld-linux-gnux32' '--prefix=/usr' '--exec-prefix=/usr' '--bindir=/usr/bin' '--sbindir=/usr/sbin' '--sysconfdir=/etc' '--datadir=/usr/share' '--includedir=/usr/include' '--libdir=/usr/libx32' '--libexecdir=/usr/libexec' '--localstatedir=/var' '--sharedstatedir=/var/lib' '--mandir=/usr/share/man' '--infodir=/usr/share/info' '--x-libraries=/usr/libx32' 'PYTHON=/usr/bin/python2' --disable-dependency-tracking --disable-python --disable-silent-rules --enable-swig --disable-swig-python checking for a BSD-compatible install... /usr/bin/install -c checking whether build environment is sane... yes checking for a race-free mkdir -p... /bin/mkdir -p checking for mawk... mawk checking whether make sets $(MAKE)... yes checking whether make supports nested variables... yes checking whether UID '1000' is supported by ustar format... yes checking whether GID '1000' is supported by ustar format... yes checking how to create a ustar tar archive... gnutar checking build system type... x86_64-pld-linux-gnux32 checking host system type... x86_64-pld-linux-gnux32 checking for git... /usr/bin/git checking whether building from a git repository... no checking for help2man... /usr/bin/help2man checking for help2man >= 1.37... yes checking whether make supports nested variables... (cached) yes checking whether make supports the include directive... yes (GNU style) checking for x86_64-pld-linux-gnux32-gcc... x86_64-pld-linux-gnux32-gcc checking whether the C compiler works... yes checking for C compiler default output file name... a.out checking for suffix of executables... checking whether we are cross compiling... no checking for suffix of object files... o checking whether the compiler supports GNU C... yes checking whether x86_64-pld-linux-gnux32-gcc accepts -g... yes checking for x86_64-pld-linux-gnux32-gcc option to enable C11 features... none needed checking whether x86_64-pld-linux-gnux32-gcc understands -c and -o together... yes checking dependency style of x86_64-pld-linux-gnux32-gcc... none checking how to run the C preprocessor... x86_64-pld-linux-gnux32-gcc -E checking whether the compiler supports GNU C++... yes checking whether x86_64-pld-linux-gnux32-g++ accepts -g... yes checking for x86_64-pld-linux-gnux32-g++ option to enable C++11 features... none needed checking dependency style of x86_64-pld-linux-gnux32-g++... none checking how to run the C++ preprocessor... x86_64-pld-linux-gnux32-g++ -E checking whether ln -s works... yes checking for mawk... (cached) mawk checking for a sed that does not truncate output... /bin/sed checking whether /usr/bin/python2 version is >= 2.6... yes checking for /usr/bin/python2 version... 2.7 checking for /usr/bin/python2 platform... linux2 checking for GNU default /usr/bin/python2 prefix... ${prefix} checking for GNU default /usr/bin/python2 exec_prefix... ${exec_prefix} checking for /usr/bin/python2 script directory (pythondir)... ${PYTHON_PREFIX}/share/python2.7/site-packages checking for /usr/bin/python2 extension module directory (pyexecdir)... ${PYTHON_EXEC_PREFIX}/libx32/python2.7/site-packages checking how to print strings... print -r checking for a sed that does not truncate output... (cached) /bin/sed checking for grep that handles long lines and -e... /bin/grep checking for egrep... /bin/grep -E checking for fgrep... /bin/grep -F checking for ld used by x86_64-pld-linux-gnux32-gcc... /usr/bin/ld checking if the linker (/usr/bin/ld) is GNU ld... yes checking for BSD- or MS-compatible name lister (nm)... /usr/bin/nm -B checking the name lister (/usr/bin/nm -B) interface... BSD nm checking the maximum length of command line arguments... 1572864 checking how to convert x86_64-pld-linux-gnux32 file names to x86_64-pld-linux-gnux32 format... func_convert_file_noop checking how to convert x86_64-pld-linux-gnux32 file names to toolchain format... func_convert_file_noop checking for /usr/bin/ld option to reload object files... -r checking for x86_64-pld-linux-gnux32-file... no checking for file... file checking for x86_64-pld-linux-gnux32-objdump... no checking for objdump... objdump checking how to recognize dependent libraries... pass_all checking for x86_64-pld-linux-gnux32-dlltool... no checking for dlltool... no checking how to associate runtime and link libraries... print -r -- checking for x86_64-pld-linux-gnux32-ar... no checking for ar... ar checking for archiver @FILE support... @ checking for x86_64-pld-linux-gnux32-strip... no checking for strip... strip checking for x86_64-pld-linux-gnux32-ranlib... no checking for ranlib... ranlib checking command to parse /usr/bin/nm -B output from x86_64-pld-linux-gnux32-gcc object... ok checking for sysroot... no checking for a working dd... /bin/dd checking how to truncate binary pipes... /bin/dd bs=4096 count=1 checking for x86_64-pld-linux-gnux32-mt... no checking for mt... no checking if : is a manifest tool... no checking for stdio.h... yes checking for stdlib.h... yes checking for string.h... yes checking for inttypes.h... yes checking for stdint.h... yes checking for strings.h... yes checking for sys/stat.h... yes checking for sys/types.h... yes checking for unistd.h... yes checking for dlfcn.h... yes checking for objdir... .libs checking if x86_64-pld-linux-gnux32-gcc supports -fno-rtti -fno-exceptions... no checking for x86_64-pld-linux-gnux32-gcc option to produce PIC... -fPIC -DPIC checking if x86_64-pld-linux-gnux32-gcc PIC flag -fPIC -DPIC works... yes checking if x86_64-pld-linux-gnux32-gcc static flag -static works... yes checking if x86_64-pld-linux-gnux32-gcc supports -c -o file.o... yes checking if x86_64-pld-linux-gnux32-gcc supports -c -o file.o... (cached) yes checking whether the x86_64-pld-linux-gnux32-gcc linker (/usr/bin/ld -m elf32_x86_64) supports shared libraries... yes checking whether -lc should be explicitly linked in... no checking dynamic linker characteristics... GNU/Linux ld.so checking how to hardcode library paths into programs... immediate checking whether stripping libraries is possible... yes checking if libtool supports shared libraries... yes checking whether to build shared libraries... yes checking whether to build static libraries... yes checking how to run the C++ preprocessor... x86_64-pld-linux-gnux32-g++ -E checking for ld used by x86_64-pld-linux-gnux32-g++... /usr/bin/ld -m elf32_x86_64 checking if the linker (/usr/bin/ld -m elf32_x86_64) is GNU ld... yes checking whether the x86_64-pld-linux-gnux32-g++ linker (/usr/bin/ld -m elf32_x86_64) supports shared libraries... yes checking for x86_64-pld-linux-gnux32-g++ option to produce PIC... -fPIC -DPIC checking if x86_64-pld-linux-gnux32-g++ PIC flag -fPIC -DPIC works... yes checking if x86_64-pld-linux-gnux32-g++ static flag -static works... yes checking if x86_64-pld-linux-gnux32-g++ supports -c -o file.o... yes checking if x86_64-pld-linux-gnux32-g++ supports -c -o file.o... (cached) yes checking whether the x86_64-pld-linux-gnux32-g++ linker (/usr/bin/ld -m elf32_x86_64) supports shared libraries... yes checking dynamic linker characteristics... (cached) GNU/Linux ld.so checking how to hardcode library paths into programs... immediate configure: creating ./config.lt config.lt: creating libtool checking for egrep... (cached) /bin/grep -E checking for main in -lm... yes checking for x86_64-pld-linux-gnux32-pkg-config... /usr/bin/x86_64-pld-linux-gnux32-pkg-config checking pkg-config is at least version 0.9.0... yes checking for GSL... yes checking for main in -lgslcblas... yes checking for gsl_version in -lgsl... yes checking for GSL version >= 1.13... yes checking for gsl/gsl_errno.h... yes checking for GLIB... yes checking for g_sequence_new in -lglib-2.0... yes checking for glib.h... yes checking for METAIO... yes checking for MetaioOpen in -lmetaio... yes checking for LAL... yes checking for XLALPerror in -llal... yes checking for lal/XLALError.h... yes checking whether LAL headers match the library... yes checking for LALSUPPORT... yes checking for XLALCacheImport in -llalsupport... yes checking for lal/LALCache.h... yes checking for LALMETAIO... yes checking for XLALLIGOLwHasTable in -llalmetaio... yes checking for lal/LIGOLwXMLRead.h... yes checking whether LALMetaIO headers match the library... yes checking for LALSIMULATION... yes checking for XLALSimDetectorStrainREAL8TimeSeries in -llalsimulation... yes checking for lal/LALSimulation.h... yes checking whether LALSimulation headers match the library... yes checking for LALBURST... yes checking for XLALEPSearch in -llalburst... yes checking for lal/EPSearch.h... yes checking whether LALBurst headers match the library... yes checking for x86_64-pld-linux-gnux32-gcc options needed to detect all undeclared functions... none needed checking for octave-cli... /usr/bin/octave-cli checking for octave-config... /usr/bin/octave-config checking for mkoctfile... /usr/bin/mkoctfile checking /usr/bin/octave-cli version... 6.4.0 checking /usr/bin/octave-cli .oct installation directory... /usr/libx32/octave/6.4.0/site/oct/x86_64-pld-linux-gnux32 checking C++ compiler used for building /usr/bin/octave-cli... x86_64-pld-linux-gnux32-g++ checking configured C++ compiler "x86_64-pld-linux-gnux32-g++" is compatible with /usr/bin/octave-cli C++ compiler "x86_64-pld-linux-gnux32-g++"... yes checking whether C++ compiler accepts -fPIC... yes checking whether C++ compiler accepts -I/usr/include/octave/..... yes checking whether C++ compiler accepts -I/usr/include/octave... yes checking whether C++ compiler accepts -fopenmp... yes checking whether C++ compiler accepts -O2... yes checking whether C++ compiler accepts -fwrapv... yes checking whether C++ compiler accepts -pipe... yes checking whether C++ compiler accepts -Wformat... yes checking whether C++ compiler accepts -Werror=format-security... yes checking whether C++ compiler accepts -gdwarf-4... yes checking whether C++ compiler accepts -fno-debug-types-section... yes checking whether C++ compiler accepts -fvar-tracking-assignments... yes checking whether C++ compiler accepts -g2... yes checking whether C++ compiler accepts -Wp,-D_FORTIFY_SOURCE=2... yes checking whether C++ compiler accepts -fstack-protector-strong... yes checking whether C++ compiler accepts --param=ssp-buffer-size=4... yes checking whether C++ compiler accepts -Werror=trampolines... yes checking whether C++ compiler accepts -fPIC... (cached) yes checking whether C++ compiler accepts -mtune=generic... yes checking whether C++ compiler accepts -march=x86-64... yes checking whether C++ compiler accepts -gdwarf-4... (cached) yes checking whether C++ compiler accepts -fno-debug-types-section... (cached) yes checking whether C++ compiler accepts -fvar-tracking-assignments... (cached) yes checking whether C++ compiler accepts -g2... (cached) yes checking whether C++ compiler accepts -Wno-uninitialized... yes checking whether C++ compiler accepts -Wno-unused-variable... yes checking whether C++ compiler accepts -Wno-unused-but-set-variable... yes checking whether C++ compiler accepts -Wno-format-extra-args... yes checking whether C++ compiler accepts -Wno-tautological-compare... yes checking whether C++ compiler accepts -Wno-deprecated-declarations... yes checking whether C++ compiler accepts -fno-strict-aliasing... yes checking whether C++ compiler accepts -O0... yes checking whether C++ compiler accepts -Wp,-U_FORTIFY_SOURCE... yes checking whether C++ linker accepts -L/usr/libx32... yes checking whether C++ linker accepts -loctinterp... yes checking whether C++ linker accepts -loctave... yes checking whether C++ linker accepts -Wl,--as-needed... yes checking whether C++ linker accepts -Wl,--no-copy-dt-needed-entries... yes checking whether C++ linker accepts -Wl,-z,relro... yes checking whether C++ linker accepts -Wl,-z,combreloc... yes checking for octave/oct.h... yes checking if /usr/bin/swig version is at least 3.0.12... yes (4.1.1) checking if /usr/bin/swig works with CCACHE_CPP2=1... yes checking for LALSuite binding dependencies... lal lalmetaio lalsimulation lalburst checking whether C compiler accepts -g3... yes checking whether C compiler accepts -Wall... yes checking whether C compiler accepts -W... yes checking whether C compiler accepts -Werror... yes checking whether C compiler accepts -Wmissing-prototypes... yes checking whether C compiler accepts -Wstrict-prototypes... yes checking whether C compiler accepts -Wshadow... yes checking whether C compiler accepts -Wpointer-arith... yes checking whether C compiler accepts -Wcast-qual... yes checking whether C compiler accepts -Wcast-align... yes checking whether C compiler accepts -Wwrite-strings... yes checking whether C compiler accepts -fno-common... yes checking whether C compiler accepts -Wnested-externs... yes checking whether C compiler accepts -Wno-format-zero-length... yes checking whether C compiler accepts -fno-strict-aliasing... yes checking whether C compiler accepts -Wno-unused-result... yes checking whether C compiler accepts -Wno-unknown-pragmas... yes checking whether C compiler accepts -diag-disable=3180... no checking whether C compiler accepts -Wno-misleading-indentation... yes checking whether C compiler accepts -Qunused-arguments... no checking that generated files are newer than configure... done configure: creating ./config.status config.status: creating Makefile config.status: creating debian/Makefile config.status: creating debian/control config.status: creating doxygen/Makefile config.status: creating doxygen/doxygen.cfg config.status: creating include/Makefile config.status: creating include/lal/Makefile config.status: creating laldetchar.pc config.status: creating laldetchar.spec config.status: creating python/Makefile config.status: creating python/laldetchar/Makefile config.status: creating python/laldetchar/__init__.py config.status: creating python/laldetchar/hveto/Makefile config.status: creating python/laldetchar/idq/Makefile config.status: creating python/laldetchar/triggers/Makefile config.status: creating src/LALDetCharVCSInfo.c config.status: creating src/LALDetCharVCSInfo.h config.status: creating src/Makefile config.status: creating src/version.c config.status: creating swig/Makefile config.status: creating test/Makefile config.status: creating src/config.h config.status: creating src/LALDetCharConfig.h config.status: src/LALDetCharConfig.h is unchanged config.status: executing depfiles commands config.status: executing libtool commands configure: ================================================== LALDetChar has now been successfully configured: * Python support is DISABLED * SWIG bindings for Octave are ENABLED * SWIG bindings for Python are DISABLED * Doxygen documentation is DISABLED * help2man documentation is ENABLED and will be installed under the directory: /usr Now run 'make' to build LALDetChar, and run 'make install' to install LALDetChar. ================================================== + /usr/bin/make -Otarget -j28 if echo "set laldetchar_PREFIX /usr; set laldetchar_DATADIR /usr/share/laldetchar; " | mawk -f ./gnuscripts/generate_user_env.awk >laldetchar-user-env.shell; then \ exit 0; \ else \ rm -f laldetchar-user-env.shell; \ exit 1; \ fi prefix=`echo "laldetchar-user-env.csh" | /bin/sed -e 's|.*\.||'`; \ echo "# source this file to access LALDetChar" >laldetchar-user-env.csh; \ /bin/sed -n -e "s|[@]SED[@]|/bin/sed|g;s|^$prefix:||p" laldetchar-user-env.shell >>laldetchar-user-env.csh prefix=`echo "laldetchar-user-env.sh" | /bin/sed -e 's|.*\.||'`; \ echo "# source this file to access LALDetChar" >laldetchar-user-env.sh; \ /bin/sed -n -e "s|[@]SED[@]|/bin/sed|g;s|^$prefix:||p" laldetchar-user-env.shell >>laldetchar-user-env.sh prefix=`echo "laldetchar-user-env.fish" | /bin/sed -e 's|.*\.||'`; \ echo "# source this file to access LALDetChar" >laldetchar-user-env.fish; \ /bin/sed -n -e "s|[@]SED[@]|/bin/sed|g;s|^$prefix:||p" laldetchar-user-env.shell >>laldetchar-user-env.fish /usr/bin/make all-recursive Making all in debian make[2]: Nothing to be done for 'all'. Making all in include Making all in lal for file in header-link-stamp *.h *.i; do \ rm -f "$file"; \ done; \ for dir in src swig; do \ ( cd "../../$dir" && /usr/bin/make header-links ) || exit 1; \ done; \ echo "header-link-stamp" > header-link-stamp for dir in ; do \ if test "x$dir" != "x."; then \ ( cd "$dir" && /usr/bin/make header-links ) || exit 1; \ fi; \ done; \ if test "xLALDetChar.h" != x; then \ echo "Making header-links in src"; \ for file in LALDetChar.h LALDetCharConfig.h LALDetCharGlib.h LALDetCharGlibTypes.h LALDetCharVCSInfo.h LALDetCharRange.h LALDetCharHvetoUtils.h LALDetCharHveto.h LALDetCharVCSInfoHeader.h; do \ case $file in \ header-links-local) continue;; \ /*) targetfile="$file";; \ *) targetfile="/tmp/B.gf3vzowf/BUILD/laldetchar-0.3.5/src/$file";; \ esac; \ linkname=`expr "$targetfile" : '.*/\([^/]*\)$'`; \ linkfile="/tmp/B.gf3vzowf/BUILD/laldetchar-0.3.5/include/lal/$linkname"; \ if test ! -r "$linkfile" ; then \ rm -f "$linkfile"; \ ln -s "$targetfile" "$linkfile"; \ fi; \ done; \ fi Making header-links in src make[4]: Entering directory '/tmp/B.gf3vzowf/BUILD/laldetchar-0.3.5/swig' rm -f ../include/lal/swiglaldetchar.i && \ ln -s /tmp/B.gf3vzowf/BUILD/laldetchar-0.3.5/swig/swiglaldetchar.i ../include/lal/swiglaldetchar.i make[4]: Leaving directory '/tmp/B.gf3vzowf/BUILD/laldetchar-0.3.5/swig' for dir in ; do \ if test "x$dir" != "x."; then \ ( cd "$dir" && /usr/bin/make header-links ) || exit 1; \ fi; \ done; \ if test "xSWIGLALDetCharAlpha.i" != x; then \ echo "Making header-links in swig"; \ for file in SWIGLALDetCharAlpha.i SWIGLALDetCharOmega.i SWIGLALDetCharTest.h header-links-local; do \ case $file in \ header-links-local) continue;; \ /*) targetfile="$file";; \ *) targetfile="/tmp/B.gf3vzowf/BUILD/laldetchar-0.3.5/swig/$file";; \ esac; \ linkname=`expr "$targetfile" : '.*/\([^/]*\)$'`; \ linkfile="/tmp/B.gf3vzowf/BUILD/laldetchar-0.3.5/include/lal/$linkname"; \ if test ! -r "$linkfile" ; then \ rm -f "$linkfile"; \ ln -s "$targetfile" "$linkfile"; \ fi; \ done; \ fi Making header-links in swig /usr/bin/make all-am make[4]: Nothing to be done for 'all-am'. make[3]: Nothing to be done for 'all-am'. Making all in src /usr/bin/make all-am make[3]: Entering directory '/tmp/B.gf3vzowf/BUILD/laldetchar-0.3.5/src' echo '/* LALDetCharBuildInfoHeader.h: generated by Makefile */' >LALDetCharBuildInfoHeader.h; \ echo '#define LALDETCHAR_CONFIGURE_ARGS "'"'LDFLAGS=-Wl,--as-needed -Wl,--no-copy-dt-needed-entries -Wl,-z,relro -Wl,-z,combreloc ' 'CFLAGS=-O2 -fwrapv -pipe -Wformat -Werror=format-security -gdwarf-4 -fno-debug-types-section -fvar-tracking-assignments -g2 -Wp,-D_FORTIFY_SOURCE=2 -fstack-protector-strong --param=ssp-buffer-size=4 -Werror=trampolines -fPIC -mtune=generic -march=x86-64 -gdwarf-4 -fno-debug-types-section -fvar-tracking-assignments -g2 ' 'CXXFLAGS=-O2 -fwrapv -pipe -Wformat -Werror=format-security -gdwarf-4 -fno-debug-types-section -fvar-tracking-assignments -g2 -Wp,-D_FORTIFY_SOURCE=2 -fstack-protector-strong --param=ssp-buffer-size=4 -Werror=trampolines -fPIC -mtune=generic -march=x86-64 -gdwarf-4 -fno-debug-types-section -fvar-tracking-assignments -g2 ' 'FFLAGS=-O2 -fwrapv -pipe -Wformat -Werror=format-security -gdwarf-4 -fno-debug-types-section -fvar-tracking-assignments -g2 -Wp,-D_FORTIFY_SOURCE=2 -fstack-protector-strong --param=ssp-buffer-size=4 -Werror=trampolines -fPIC -mtune=generic -march=x86-64 -gdwarf-4 -fno-debug-types-section -fvar-tracking-assignments -g2 ' 'FCFLAGS=-O2 -fwrapv -pipe -Wformat -Werror=format-security -gdwarf-4 -fno-debug-types-section -fvar-tracking-assignments -g2 -Wp,-D_FORTIFY_SOURCE=2 -fstack-protector-strong --param=ssp-buffer-size=4 -Werror=trampolines -fPIC -mtune=generic -march=x86-64 -gdwarf-4 -fno-debug-types-section -fvar-tracking-assignments -g2 ' 'CPPFLAGS=' 'CC=x86_64-pld-linux-gnux32-gcc' 'CXX=x86_64-pld-linux-gnux32-g++' '--host=x86_64-pld-linux-gnux32' '--build=x86_64-pld-linux-gnux32' '--prefix=/usr' '--exec-prefix=/usr' '--bindir=/usr/bin' '--sbindir=/usr/sbin' '--sysconfdir=/etc' '--datadir=/usr/share' '--includedir=/usr/include' '--libdir=/usr/libx32' '--libexecdir=/usr/libexec' '--localstatedir=/var' '--sharedstatedir=/var/lib' '--mandir=/usr/share/man' '--infodir=/usr/share/info' '--x-libraries=/usr/libx32' 'PYTHON=/usr/bin/python2' '--disable-dependency-tracking' '--disable-python' '--disable-silent-rules' '--enable-swig' '--disable-swig-python' 'build_alias=x86_64-pld-linux-gnux32' 'host_alias=x86_64-pld-linux-gnux32' 'PKG_CONFIG_PATH=:/usr/libx32/pkgconfig:/usr/share/pkgconfig'"'"' >>LALDetCharBuildInfoHeader.h; \ echo '#define LALDETCHAR_CONFIGURE_DATE "'"2024-06-09T18:01:25+0200"'"' >>LALDetCharBuildInfoHeader.h; \ echo '#define LALDETCHAR_BUILD_DATE "'`date +"%Y-%m-%dT%H:%M:%S%z"`'"' >>LALDetCharBuildInfoHeader.h make[3]: Leaving directory '/tmp/B.gf3vzowf/BUILD/laldetchar-0.3.5/src' make[3]: Entering directory '/tmp/B.gf3vzowf/BUILD/laldetchar-0.3.5/src' x86_64-pld-linux-gnux32-gcc -DHAVE_CONFIG_H -I. -I../include -DPKG_DATA_DIR='"/usr/share/laldetchar/"' -D_ISOC99_SOURCE -D__STDC_CONSTANT_MACROS -D__STDC_LIMIT_MACROS -I/usr/include/glib-2.0 -I/usr/libx32/glib-2.0/include -O2 -g -pthread -pthread -pthread -pthread -pthread -g3 -Wall -W -Werror -Wmissing-prototypes -Wstrict-prototypes -Wshadow -Wpointer-arith -Wcast-qual -Wcast-align -Wwrite-strings -fno-common -Wnested-externs -Wno-format-zero-length -fno-strict-aliasing -Wno-unused-result -Wno-unknown-pragmas -Wno-misleading-indentation -O2 -fwrapv -pipe -Wformat -Werror=format-security -gdwarf-4 -fno-debug-types-section -fvar-tracking-assignments -g2 -Wp,-D_FORTIFY_SOURCE=2 -fstack-protector-strong --param=ssp-buffer-size=4 -Werror=trampolines -fPIC -mtune=generic -march=x86-64 -gdwarf-4 -fno-debug-types-section -fvar-tracking-assignments -g2 -c -o version.o version.c make[3]: Leaving directory '/tmp/B.gf3vzowf/BUILD/laldetchar-0.3.5/src' make[3]: Entering directory '/tmp/B.gf3vzowf/BUILD/laldetchar-0.3.5/src' /bin/sh ../libtool --tag=CC --mode=compile x86_64-pld-linux-gnux32-gcc -DHAVE_CONFIG_H -I. -I../include -DPKG_DATA_DIR='"/usr/share/laldetchar/"' -D_ISOC99_SOURCE -D__STDC_CONSTANT_MACROS -D__STDC_LIMIT_MACROS -I/usr/include/glib-2.0 -I/usr/libx32/glib-2.0/include -O2 -g -pthread -pthread -pthread -pthread -pthread -g3 -Wall -W -Werror -Wmissing-prototypes -Wstrict-prototypes -Wshadow -Wpointer-arith -Wcast-qual -Wcast-align -Wwrite-strings -fno-common -Wnested-externs -Wno-format-zero-length -fno-strict-aliasing -Wno-unused-result -Wno-unknown-pragmas -Wno-misleading-indentation -O2 -fwrapv -pipe -Wformat -Werror=format-security -gdwarf-4 -fno-debug-types-section -fvar-tracking-assignments -g2 -Wp,-D_FORTIFY_SOURCE=2 -fstack-protector-strong --param=ssp-buffer-size=4 -Werror=trampolines -fPIC -mtune=generic -march=x86-64 -gdwarf-4 -fno-debug-types-section -fvar-tracking-assignments -g2 -c -o LALDetCharHvetoUtils.lo LALDetCharHvetoUtils.c libtool: compile: x86_64-pld-linux-gnux32-gcc -DHAVE_CONFIG_H -I. -I../include -DPKG_DATA_DIR=\"/usr/share/laldetchar/\" -D_ISOC99_SOURCE -D__STDC_CONSTANT_MACROS -D__STDC_LIMIT_MACROS -I/usr/include/glib-2.0 -I/usr/libx32/glib-2.0/include -O2 -g -pthread -pthread -pthread -pthread -pthread -g3 -Wall -W -Werror -Wmissing-prototypes -Wstrict-prototypes -Wshadow -Wpointer-arith -Wcast-qual -Wcast-align -Wwrite-strings -fno-common -Wnested-externs -Wno-format-zero-length -fno-strict-aliasing -Wno-unused-result -Wno-unknown-pragmas -Wno-misleading-indentation -O2 -fwrapv -pipe -Wformat -Werror=format-security -gdwarf-4 -fno-debug-types-section -fvar-tracking-assignments -g2 -Wp,-D_FORTIFY_SOURCE=2 -fstack-protector-strong --param=ssp-buffer-size=4 -Werror=trampolines -fPIC -mtune=generic -march=x86-64 -gdwarf-4 -fno-debug-types-section -fvar-tracking-assignments -g2 -c LALDetCharHvetoUtils.c -fPIC -DPIC -o .libs/LALDetCharHvetoUtils.o In file included from LALDetCharHvetoUtils.c:20: ../include/lal/LALDetCharHvetoUtils.h:26:10: fatal error: lal/LIGOLwXMLBurstRead.h: No such file or directory 26 | #include <lal/LIGOLwXMLBurstRead.h> | ^~~~~~~~~~~~~~~~~~~~~~~~~~ compilation terminated. make[3]: *** [Makefile:934: LALDetCharHvetoUtils.lo] Error 1 make[3]: Leaving directory '/tmp/B.gf3vzowf/BUILD/laldetchar-0.3.5/src' make[3]: *** Waiting for unfinished jobs.... make[3]: Entering directory '/tmp/B.gf3vzowf/BUILD/laldetchar-0.3.5/src' /bin/sh ../libtool --tag=CC --mode=compile x86_64-pld-linux-gnux32-gcc -DHAVE_CONFIG_H -I. -I../include -DPKG_DATA_DIR='"/usr/share/laldetchar/"' -D_ISOC99_SOURCE -D__STDC_CONSTANT_MACROS -D__STDC_LIMIT_MACROS -I/usr/include/glib-2.0 -I/usr/libx32/glib-2.0/include -O2 -g -pthread -pthread -pthread -pthread -pthread -g3 -Wall -W -Werror -Wmissing-prototypes -Wstrict-prototypes -Wshadow -Wpointer-arith -Wcast-qual -Wcast-align -Wwrite-strings -fno-common -Wnested-externs -Wno-format-zero-length -fno-strict-aliasing -Wno-unused-result -Wno-unknown-pragmas -Wno-misleading-indentation -O2 -fwrapv -pipe -Wformat -Werror=format-security -gdwarf-4 -fno-debug-types-section -fvar-tracking-assignments -g2 -Wp,-D_FORTIFY_SOURCE=2 -fstack-protector-strong --param=ssp-buffer-size=4 -Werror=trampolines -fPIC -mtune=generic -march=x86-64 -gdwarf-4 -fno-debug-types-section -fvar-tracking-assignments -g2 -c -o LALDetCharGlibTypes.lo LALDetCharGlibTypes.c libtool: compile: x86_64-pld-linux-gnux32-gcc -DHAVE_CONFIG_H -I. -I../include -DPKG_DATA_DIR=\"/usr/share/laldetchar/\" -D_ISOC99_SOURCE -D__STDC_CONSTANT_MACROS -D__STDC_LIMIT_MACROS -I/usr/include/glib-2.0 -I/usr/libx32/glib-2.0/include -O2 -g -pthread -pthread -pthread -pthread -pthread -g3 -Wall -W -Werror -Wmissing-prototypes -Wstrict-prototypes -Wshadow -Wpointer-arith -Wcast-qual -Wcast-align -Wwrite-strings -fno-common -Wnested-externs -Wno-format-zero-length -fno-strict-aliasing -Wno-unused-result -Wno-unknown-pragmas -Wno-misleading-indentation -O2 -fwrapv -pipe -Wformat -Werror=format-security -gdwarf-4 -fno-debug-types-section -fvar-tracking-assignments -g2 -Wp,-D_FORTIFY_SOURCE=2 -fstack-protector-strong --param=ssp-buffer-size=4 -Werror=trampolines -fPIC -mtune=generic -march=x86-64 -gdwarf-4 -fno-debug-types-section -fvar-tracking-assignments -g2 -c LALDetCharGlibTypes.c -fPIC -DPIC -o .libs/LALDetCharGlibTypes.o LALDetCharGlibTypes.c: In function 'XLALCreateGSequence': LALDetCharGlibTypes.c:58:45: error: 'XLALDestroySnglBurst' undeclared (first use in this function); did you mean 'XLALSortSnglBurst'? 58 | seq->s = g_sequence_new((GDestroyNotify)XLALDestroySnglBurst); | ^~~~~~~~~~~~~~~~~~~~ | XLALSortSnglBurst LALDetCharGlibTypes.c:58:45: note: each undeclared identifier is reported only once for each function it appears in make[3]: *** [Makefile:934: LALDetCharGlibTypes.lo] Error 1 make[3]: Leaving directory '/tmp/B.gf3vzowf/BUILD/laldetchar-0.3.5/src' make[3]: Entering directory '/tmp/B.gf3vzowf/BUILD/laldetchar-0.3.5/src' /bin/sh ../libtool --tag=CC --mode=compile x86_64-pld-linux-gnux32-gcc -DHAVE_CONFIG_H -I. -I../include -DPKG_DATA_DIR='"/usr/share/laldetchar/"' -D_ISOC99_SOURCE -D__STDC_CONSTANT_MACROS -D__STDC_LIMIT_MACROS -I/usr/include/glib-2.0 -I/usr/libx32/glib-2.0/include -O2 -g -pthread -pthread -pthread -pthread -pthread -g3 -Wall -W -Werror -Wmissing-prototypes -Wstrict-prototypes -Wshadow -Wpointer-arith -Wcast-qual -Wcast-align -Wwrite-strings -fno-common -Wnested-externs -Wno-format-zero-length -fno-strict-aliasing -Wno-unused-result -Wno-unknown-pragmas -Wno-misleading-indentation -O2 -fwrapv -pipe -Wformat -Werror=format-security -gdwarf-4 -fno-debug-types-section -fvar-tracking-assignments -g2 -Wp,-D_FORTIFY_SOURCE=2 -fstack-protector-strong --param=ssp-buffer-size=4 -Werror=trampolines -fPIC -mtune=generic -march=x86-64 -gdwarf-4 -fno-debug-types-section -fvar-tracking-assignments -g2 -c -o LALDetCharHveto.lo LALDetCharHveto.c libtool: compile: x86_64-pld-linux-gnux32-gcc -DHAVE_CONFIG_H -I. -I../include -DPKG_DATA_DIR=\"/usr/share/laldetchar/\" -D_ISOC99_SOURCE -D__STDC_CONSTANT_MACROS -D__STDC_LIMIT_MACROS -I/usr/include/glib-2.0 -I/usr/libx32/glib-2.0/include -O2 -g -pthread -pthread -pthread -pthread -pthread -g3 -Wall -W -Werror -Wmissing-prototypes -Wstrict-prototypes -Wshadow -Wpointer-arith -Wcast-qual -Wcast-align -Wwrite-strings -fno-common -Wnested-externs -Wno-format-zero-length -fno-strict-aliasing -Wno-unused-result -Wno-unknown-pragmas -Wno-misleading-indentation -O2 -fwrapv -pipe -Wformat -Werror=format-security -gdwarf-4 -fno-debug-types-section -fvar-tracking-assignments -g2 -Wp,-D_FORTIFY_SOURCE=2 -fstack-protector-strong --param=ssp-buffer-size=4 -Werror=trampolines -fPIC -mtune=generic -march=x86-64 -gdwarf-4 -fno-debug-types-section -fvar-tracking-assignments -g2 -c LALDetCharHveto.c -fPIC -DPIC -o .libs/LALDetCharHveto.o In file included from LALDetCharHveto.c:1: ../include/lal/LALDetCharHveto.h:30:10: fatal error: lal/LIGOLwXMLBurstRead.h: No such file or directory 30 | #include <lal/LIGOLwXMLBurstRead.h> | ^~~~~~~~~~~~~~~~~~~~~~~~~~ compilation terminated. make[3]: *** [Makefile:934: LALDetCharHveto.lo] Error 1 make[3]: Leaving directory '/tmp/B.gf3vzowf/BUILD/laldetchar-0.3.5/src' make[3]: Entering directory '/tmp/B.gf3vzowf/BUILD/laldetchar-0.3.5/src' /bin/sh ../libtool --tag=CC --mode=compile x86_64-pld-linux-gnux32-gcc -DHAVE_CONFIG_H -I. -I../include -DPKG_DATA_DIR='"/usr/share/laldetchar/"' -D_ISOC99_SOURCE -D__STDC_CONSTANT_MACROS -D__STDC_LIMIT_MACROS -I/usr/include/glib-2.0 -I/usr/libx32/glib-2.0/include -O2 -g -pthread -pthread -pthread -pthread -pthread -g3 -Wall -W -Werror -Wmissing-prototypes -Wstrict-prototypes -Wshadow -Wpointer-arith -Wcast-qual -Wcast-align -Wwrite-strings -fno-common -Wnested-externs -Wno-format-zero-length -fno-strict-aliasing -Wno-unused-result -Wno-unknown-pragmas -Wno-misleading-indentation -O2 -fwrapv -pipe -Wformat -Werror=format-security -gdwarf-4 -fno-debug-types-section -fvar-tracking-assignments -g2 -Wp,-D_FORTIFY_SOURCE=2 -fstack-protector-strong --param=ssp-buffer-size=4 -Werror=trampolines -fPIC -mtune=generic -march=x86-64 -gdwarf-4 -fno-debug-types-section -fvar-tracking-assignments -g2 -c -o LALDetCharInspiralRange.lo LALDetCharInspiralRange.c libtool: compile: x86_64-pld-linux-gnux32-gcc -DHAVE_CONFIG_H -I. -I../include -DPKG_DATA_DIR=\"/usr/share/laldetchar/\" -D_ISOC99_SOURCE -D__STDC_CONSTANT_MACROS -D__STDC_LIMIT_MACROS -I/usr/include/glib-2.0 -I/usr/libx32/glib-2.0/include -O2 -g -pthread -pthread -pthread -pthread -pthread -g3 -Wall -W -Werror -Wmissing-prototypes -Wstrict-prototypes -Wshadow -Wpointer-arith -Wcast-qual -Wcast-align -Wwrite-strings -fno-common -Wnested-externs -Wno-format-zero-length -fno-strict-aliasing -Wno-unused-result -Wno-unknown-pragmas -Wno-misleading-indentation -O2 -fwrapv -pipe -Wformat -Werror=format-security -gdwarf-4 -fno-debug-types-section -fvar-tracking-assignments -g2 -Wp,-D_FORTIFY_SOURCE=2 -fstack-protector-strong --param=ssp-buffer-size=4 -Werror=trampolines -fPIC -mtune=generic -march=x86-64 -gdwarf-4 -fno-debug-types-section -fvar-tracking-assignments -g2 -c LALDetCharInspiralRange.c -fPIC -DPIC -o .libs/LALDetCharInspiralRange.o libtool: compile: x86_64-pld-linux-gnux32-gcc -DHAVE_CONFIG_H -I. -I../include -DPKG_DATA_DIR=\"/usr/share/laldetchar/\" -D_ISOC99_SOURCE -D__STDC_CONSTANT_MACROS -D__STDC_LIMIT_MACROS -I/usr/include/glib-2.0 -I/usr/libx32/glib-2.0/include -O2 -g -pthread -pthread -pthread -pthread -pthread -g3 -Wall -W -Werror -Wmissing-prototypes -Wstrict-prototypes -Wshadow -Wpointer-arith -Wcast-qual -Wcast-align -Wwrite-strings -fno-common -Wnested-externs -Wno-format-zero-length -fno-strict-aliasing -Wno-unused-result -Wno-unknown-pragmas -Wno-misleading-indentation -O2 -fwrapv -pipe -Wformat -Werror=format-security -gdwarf-4 -fno-debug-types-section -fvar-tracking-assignments -g2 -Wp,-D_FORTIFY_SOURCE=2 -fstack-protector-strong --param=ssp-buffer-size=4 -Werror=trampolines -fPIC -mtune=generic -march=x86-64 -gdwarf-4 -fno-debug-types-section -fvar-tracking-assignments -g2 -c LALDetCharInspiralRange.c -o LALDetCharInspiralRange.o >/dev/null 2>&1 make[3]: Leaving directory '/tmp/B.gf3vzowf/BUILD/laldetchar-0.3.5/src' make[3]: Entering directory '/tmp/B.gf3vzowf/BUILD/laldetchar-0.3.5/src' cd .. && /bin/sh ./config.status src/LALDetCharVCSInfo.c config.status: creating src/LALDetCharVCSInfo.c make[3]: Leaving directory '/tmp/B.gf3vzowf/BUILD/laldetchar-0.3.5/src' make[2]: *** [Makefile:703: all] Error 2 make[1]: *** [Makefile:615: all-recursive] Error 1 make: *** [Makefile:515: all] Error 2 error: Bad exit status from /tmp/B.gf3vzowf/BUILD/tmp/rpm-tmp.oqriZ0 (%build) RPM build errors: Bad exit status from /tmp/B.gf3vzowf/BUILD/tmp/rpm-tmp.oqriZ0 (%build) ended at: Sun Jun 9 18:01:46 2024, done in 0:00:29.334184 error: No files produced. + chmod -R u+rwX /tmp/B.gf3vzowf/BUILD + rm -rf /tmp/B.gf3vzowf/tmp /tmp/B.gf3vzowf/BUILD + rm -rf /tmp/B.gf3vzowf Begin-PLD-Builder-Info Build-Time: user:29.45s sys:12.13s real:41.52s (faults io:1 non-io:2202449) End-PLD-Builder-Info
[Back to list of logs] [View rpm -qa of builder]