FailedOk

th/SRPMS[OK]
th/x32[OK]
th/i686[OK]
th/x86_64[OK]

ac/SRPMS[OK]
ac/i386[OK]
ac/i586[OK]
ac/i686[OK]
ac/alpha[OK]
ac/amd64[OK]
ac/athlon[OK]
ac/ppc[OK]
ac/sparc[OK]
ac/sparc64[OK]

Advanced Search
main()
Powered by PLD Linux
(c) 2002-2024 PLD Team
$Revision: 1.37 $
Powered by Ken.
Your IP: 44.200.194.255

lal-xml 80439688-6d9e-45ad-a474-0e503fa534a4

Status:Failed
Source URL:https://buildlogs.pld-linux.org/pld/th/x32/FAIL/lal-xml,80439688-6d9e-45ad-a474-0e503fa534a4.bz2
text/plain URL:View!
full text:View!
rpm -qa of builder:View!
Date:2024/06/09 15:26:48
Runtime:0:00:32.439131

Toc:

  • error 1
  • rpm: error: Failed build dependencies:
  • error 2
  • rpm: error: Failed build dependencies:
  • error 3
  • rpm: error: Failed build dependencies:
  • prep
  • Executing(%prep): /bin/sh -e /tmp/B.qa2tqqnq/BUILD/tmp/rpm-tmp.Ew7nk2
  • build
  • Executing(%build): /bin/sh -e /tmp/B.qa2tqqnq/BUILD/tmp/rpm-tmp.2nrded
  • error 4
  • LALXML.c:523:3: error: implicit declaration of function 'xmlThrDefIndentTreeOutput'; did you mean 'xmlIndentTreeOutput'? [-Werror=implicit-function-declaration]
  • error 5
  • LALXML.c:523:3: error: nested extern declaration of 'xmlThrDefIndentTreeOutput' [-Werror=nested-externs]
  • error 6
  • make[3]: *** [Makefile:854: LALXML.lo] Error 1
  • error 7
  • make[2]: *** [Makefile:659: all] Error 2
  • error 8
  • make[1]: *** [Makefile:587: all-recursive] Error 1
  • error 9
  • error: Bad exit status from /tmp/B.qa2tqqnq/BUILD/tmp/rpm-tmp.2nrded (%build)
  • error 10
  • RPM build errors:
  • error 11
  • error: No files produced.

Content:

checking if we should skip the build
started at: Sun Jun  9 15:25:40 2024
killing old processes on a builder
sending signal 9 to pid -1
cleaning up /tmp
fetching https://srcbuilder.pld-linux.org/th//srpms/80439688-6d9e-45ad-a474-0e503fa534a4/lal-xml-1.2.4-7.src.rpm
fetched 358279 bytes, 964.5 K/s
installing srpm: lal-xml-1.2.4-7.src.rpm
+ install -d /tmp/B.qa2tqqnq/BUILD /tmp/B.qa2tqqnq/RPMS
+ LC_ALL=en_US.UTF-8
+ rpm -qp --changelog lal-xml-1.2.4-7.src.rpm
* Sun Jun 09 2024 PLD Linux Team <feedback@pld-linux.org>
- For complete changelog see: http://git.pld-linux.org/?p=packages/lal-xml.git;a=log;h=master
* Mon Jan 23 2023 Jakub Bogusz <qboosh@pld-linux.org> 7018a1d
- added octave patch (fix install dir); release 7 * Mon Mar 28 2022 Jan Rękorajski <baggins@pld-linux.org> 4a6b2ce
- Release 6 (by relup.sh) * Sat Mar 26 2022 Jan Rękorajski <baggins@pld-linux.org> 075b86f
- rebuild with python 3.10 * Sat Dec 04 2021 Jan Rękorajski <baggins@pld-linux.org> c9e061f
- lal uses python3 now, rel 4 * Sun Nov 03 2019 Jan Rękorajski <baggins@pld-linux.org> 9043c7e
- workaround broken autoconf stuff - rel 3 * Mon Oct 28 2019 Jan Rękorajski <baggins@pld-linux.org> b7fddb1
- rebuild with python 3.8 - release 2 (by relup.sh) * Sun Jul 02 2017 Jakub Bogusz <qboosh@pld-linux.org> fa4c615
- new + rpm -Uhv --nodeps --define '_topdir /tmp/B.qa2tqqnq' --define '_specdir %{_topdir}' --define '_sourcedir %{_specdir}' --define '_rpmdir %{_topdir}/RPMS' --define '_builddir %{_topdir}/BUILD' lal-xml-1.2.4-7.src.rpm Updating / installing... lal-xml-1.2.4-7 ######################################## + rm -f lal-xml-1.2.4-7.src.rpm + install -m 700 -d /tmp/B.qa2tqqnq/BUILD/tmp + TMPDIR=/tmp/B.qa2tqqnq/BUILD/tmp + exec nice -n 0 rpmbuild -bp --short-circuit --nodeps --define '_topdir /tmp/B.qa2tqqnq' --define '_specdir %{_topdir}' --define '_sourcedir %{_specdir}' --define '_rpmdir %{_topdir}/RPMS' --define '_builddir %{_topdir}/BUILD' --target x32-pld-linux --define 'prep exit 0' /tmp/B.qa2tqqnq/lal-xml.spec Building target platforms: x32-pld-linux Building for target x32-pld-linux checking BuildConflict-ing packages rpm: error: Failed build dependencies: rpm: lal-devel >= 6.18.0 is needed by lal-xml-1.2.4-7.x32 rpm: Building target platforms: x32-pld-linux rpm: Building for target x32-pld-linux no BuildConflicts found checking BR rpm: error: Failed build dependencies: rpm: lal-devel >= 6.18.0 is needed by lal-xml-1.2.4-7.x32 rpm: Building target platforms: x32-pld-linux rpm: Building for target x32-pld-linux updating poldek cache... ready is up to date Loading [pndir]th... Applying packages.ndir.2024.05.18-20.05.08.gz... Retrieving diff::packages.ndir.2024.06.08-20.56.11.gz......................................done Retrieving diff::packages.ndir.dscr.2024.06.08-20.56.11.gz.................................done Applying packages.ndir.2024.06.08-20.56.11.gz... Writing /root/.cache/poldek/[...]/packages.ndir.gz... Loading [pndir]th... Applying packages.ndir.2024.05.18-20.05.08.gz... Retrieving diff::packages.ndir.2024.06.08-20.56.11.gz......................................done Retrieving diff::packages.ndir.dscr.2024.06.08-20.56.11.gz.................................done Applying packages.ndir.2024.06.08-20.56.11.gz... Writing /root/.cache/poldek/[...]/packages.ndir.gz... Retrieving diff::packages.ndir.2024.06.01-14.52.54.gz......................................done Loading [pndir]th-ready... Applying packages.ndir.2024.06.01-14.52.54.gz... Writing /root/.cache/poldek/[...]/packages.ndir.gz... Retrieving diff::packages.ndir.2024.06.01-14.52.54.gz......................................done Loading [pndir]th-ready... Applying packages.ndir.2024.06.01-14.52.54.gz... Writing /root/.cache/poldek/[...]/packages.ndir.gz... Retrieving diff::packages.ndir.2024.06.08-07.01.02.gz......................................done Loading [pndir]th-test... Applying packages.ndir.2024.06.08-07.01.02.gz... Applying packages.ndir.2024.06.08-18.58.02.gz... Retrieving diff::packages.ndir.2024.06.08-18.59.02.gz......................................done Applying packages.ndir.2024.06.08-18.59.02.gz... Retrieving diff::packages.ndir.2024.06.08-19.27.02.gz......................................done Applying packages.ndir.2024.06.08-19.27.02.gz... Applying packages.ndir.2024.06.08-20.22.01.gz... Retrieving diff::packages.ndir.2024.06.09-01.47.03.gz......................................done Applying packages.ndir.2024.06.09-01.47.03.gz... Writing /root/.cache/poldek/[...]/packages.ndir.gz... Retrieving th-test::packages.ndir.diff.toc.gz..............................................done Retrieving diff::packages.ndir.2024.06.08-18.57.01.gz......................................done Loading [pndir]th-test... Applying packages.ndir.2024.06.08-18.57.01.gz... Applying packages.ndir.2024.06.08-18.59.02.gz... Applying packages.ndir.2024.06.08-19.13.02.gz... Retrieving diff::packages.ndir.2024.06.08-19.27.02.gz......................................done Retrieving diff::packages.ndir.dscr.2024.06.08-19.27.02.gz.................................done Applying packages.ndir.2024.06.08-19.27.02.gz... Retrieving diff::packages.ndir.2024.06.08-20.22.02.gz......................................done Applying packages.ndir.2024.06.08-20.22.02.gz... Retrieving diff::packages.ndir.2024.06.09-06.06.02.gz......................................done Applying packages.ndir.2024.06.09-06.06.02.gz... Retrieving diff::packages.ndir.2024.06.09-09.26.02.gz......................................done Applying packages.ndir.2024.06.09-09.26.02.gz... Retrieving diff::packages.ndir.2024.06.09-09.27.02.gz......................................done Applying packages.ndir.2024.06.09-09.27.02.gz... Retrieving diff::packages.ndir.2024.06.09-11.06.02.gz......................................done Applying packages.ndir.2024.06.09-11.06.02.gz... Writing /root/.cache/poldek/[...]/packages.ndir.gz... checking conflicting packages in BRed packages poldek: Loading [pndir]ready... poldek: Loading [pndir]th-test... poldek: Loading [pndir]th-test... poldek: Loading [pndir]th-ready... poldek: Loading [pndir]th-ready... poldek: Loading [pndir]th... poldek: Loading [pndir]th... poldek: 30663 packages read poldek: Removed 1716 duplicate packages from available set poldek: Processing dependencies... poldek: lal-devel-7.5.0-1.x32 marks lal-7.5.0-1.x32 (cap lal = 7.5.0-1) poldek: There are 2 packages to install (1 marked by dependencies): poldek: A lal-7.5.0-1.x32 lal-devel-7.5.0-1.x32 poldek: This operation will use 4.2MB of disk space. poldek: Need to get 828.7KB of archives. poldek: lal-7.5.0-1.x32.rpm: digests OK poldek: lal-devel-7.5.0-1.x32.rpm: digests OK poldek: Executing pm-command.sh --upgrade -vh --test --root / --define _check_dirname_deps 0... poldek: Verifying... ######################################## poldek: Preparing... ######################################## no conflicts found checking BR rpm: error: Failed build dependencies: rpm: lal-devel >= 6.18.0 is needed by lal-xml-1.2.4-7.x32 rpm: Building target platforms: x32-pld-linux rpm: Building for target x32-pld-linux installing BR: lal\-devel + poldek --noask --caplookup -Q -v '--ignore=hhvm-*' '--ignore=php4-*' '--ignore=php52-*' '--ignore=php54-*' '--ignore=php55-*' '--ignore=php56-*' '--ignore=php70-*' '--ignore=php71-*' '--ignore=php72-*' '--ignore=php73-*' '--ignore=php74-*' '--ignore=php80-*' '--ignore=php81-*' '--ignore=php82-*' --upgrade lal-devel Loading [pndir]ready... Loading [pndir]th-test... Loading [pndir]th-test... Loading [pndir]th-ready... Loading [pndir]th-ready... Loading [pndir]th... Loading [pndir]th... 30663 packages read Removed 1716 duplicate packages from available set Processing dependencies... lal-devel-7.5.0-1.x32 marks lal-7.5.0-1.x32 (cap lal = 7.5.0-1) There are 2 packages to install (1 marked by dependencies): A lal-7.5.0-1.x32 lal-devel-7.5.0-1.x32 This operation will use 4.2MB of disk space. Need to get 828.7KB of archives. lal-7.5.0-1.x32.rpm: digests OK lal-devel-7.5.0-1.x32.rpm: digests OK Executing pm-command.sh --upgrade -vh --root / --define _check_dirname_deps 0... Verifying... ######################################## Preparing... ######################################## Updating / installing... lal-7.5.0-1 ######################################## lal-devel-7.5.0-1 ######################################## building RPM using: set -ex; : build-id: 80439688-6d9e-45ad-a474-0e503fa534a4; TMPDIR=/tmp/B.qa2tqqnq/BUILD/tmp exec nice -n 0 rpmbuild -bb --define '__jobs 28' --define '_smp_mflags -j28' --define '_make_opts -Otarget' --define '_pld_builder 1' --define '_topdir /tmp/B.qa2tqqnq' --define '_specdir %{_topdir}' --define '_sourcedir %{_specdir}' --define '_rpmdir %{_topdir}/RPMS' --define '_builddir %{_topdir}/BUILD' --target x32-pld-linux /tmp/B.qa2tqqnq/lal-xml.spec + : build-id: 80439688-6d9e-45ad-a474-0e503fa534a4 + TMPDIR=/tmp/B.qa2tqqnq/BUILD/tmp + exec nice -n 0 rpmbuild -bb --define '__jobs 28' --define '_smp_mflags -j28' --define '_make_opts -Otarget' --define '_pld_builder 1' --define '_topdir /tmp/B.qa2tqqnq' --define '_specdir %{_topdir}' --define '_sourcedir %{_specdir}' --define '_rpmdir %{_topdir}/RPMS' --define '_builddir %{_topdir}/BUILD' --target x32-pld-linux /tmp/B.qa2tqqnq/lal-xml.spec Building target platforms: x32-pld-linux Building for target x32-pld-linux Executing(%prep): /bin/sh -e /tmp/B.qa2tqqnq/BUILD/tmp/rpm-tmp.Ew7nk2 + umask 022 + cd /tmp/B.qa2tqqnq/BUILD + cd /tmp/B.qa2tqqnq/BUILD + rm -rf lalxml-1.2.4 + /usr/bin/xz -dc /tmp/B.qa2tqqnq/lalxml-1.2.4.tar.xz + /bin/tar -xof - + STATUS=0 + '[' 0 -ne 0 ']' + cd lalxml-1.2.4 + /bin/chmod -Rf a+rX,u+w,g-w,o-w . + echo 'Patch #0 (lal-xml-env.patch):' Patch #0 (lal-xml-env.patch): + </tmp/B.qa2tqqnq/lal-xml-env.patch + /usr/bin/patch -s -f -p1 '--fuzz=0' + echo 'Patch #1 (lal-xml-octave.patch):' Patch #1 (lal-xml-octave.patch): + </tmp/B.qa2tqqnq/lal-xml-octave.patch + /usr/bin/patch -s -f -p1 '--fuzz=0' + RPM_EC=0 + jobs -p + exit 0 Executing(%build): /bin/sh -e /tmp/B.qa2tqqnq/BUILD/tmp/rpm-tmp.2nrded HOME=/home/users/builder PATH=/home/users/builder/GNUstep/Tools:/bin:/usr/bin:/usr/local/bin TMPDIR=/tmp/B.qa2tqqnq/BUILD/tmp + umask 022 + cd /tmp/B.qa2tqqnq/BUILD + cd lalxml-1.2.4 + libtoolize --copy --force --install libtoolize: putting auxiliary files in AC_CONFIG_AUX_DIR, 'gnuscripts'. libtoolize: copying file 'gnuscripts/config.guess' libtoolize: copying file 'gnuscripts/config.sub' libtoolize: copying file 'gnuscripts/install-sh' libtoolize: copying file 'gnuscripts/ltmain.sh' libtoolize: putting macros in AC_CONFIG_MACRO_DIRS, 'gnuscripts'. libtoolize: copying file 'gnuscripts/libtool.m4' libtoolize: copying file 'gnuscripts/ltoptions.m4' libtoolize: copying file 'gnuscripts/ltsugar.m4' libtoolize: copying file 'gnuscripts/ltversion.m4' libtoolize: copying file 'gnuscripts/lt~obsolete.m4' libtoolize: Remember to add 'LT_INIT' to configure.ac. + aclocal -I gnuscripts + autoconf configure.ac:69: warning: The macro 'AC_HELP_STRING' is obsolete. configure.ac:69: You should run autoupdate. ./lib/autoconf/general.m4:204: AC_HELP_STRING is expanded from... gnuscripts/lalsuite_build.m4:714: LALSUITE_ENABLE_NIGHTLY is expanded from... configure.ac:69: the top level configure.ac:72: warning: The macro 'AC_HELP_STRING' is obsolete. configure.ac:72: You should run autoupdate. ./lib/autoconf/general.m4:204: AC_HELP_STRING is expanded from... gnuscripts/lalsuite_swig.m4:21: LALSUITE_ENABLE_SWIG is expanded from... configure.ac:72: the top level configure.ac:72: warning: The macro 'AC_HELP_STRING' is obsolete. configure.ac:72: You should run autoupdate. ./lib/autoconf/general.m4:204: AC_HELP_STRING is expanded from... gnuscripts/lalsuite_swig.m4:68: LALSUITE_ENABLE_SWIG_LANGUAGE is expanded from... gnuscripts/lalsuite_swig.m4:21: LALSUITE_ENABLE_SWIG is expanded from... configure.ac:72: the top level configure.ac:75: warning: The macro 'AC_HELP_STRING' is obsolete. configure.ac:75: You should run autoupdate. ./lib/autoconf/general.m4:204: AC_HELP_STRING is expanded from... gnuscripts/lalsuite_build.m4:1104: LALSUITE_ENABLE_DOXYGEN is expanded from... configure.ac:75: the top level configure.ac:81: warning: The macro 'AC_HELP_STRING' is obsolete. configure.ac:81: You should run autoupdate. ./lib/autoconf/general.m4:204: AC_HELP_STRING is expanded from... gnuscripts/lalsuite_gccflags.m4:6: LALSUITE_ENABLE_GCC_FLAGS is expanded from... configure.ac:81: the top level configure.ac:90: warning: The macro 'AC_PROG_CC_C99' is obsolete. configure.ac:90: You should run autoupdate. ./lib/autoconf/c.m4:1662: AC_PROG_CC_C99 is expanded from... gnuscripts/lalsuite_build.m4:337: LALSUITE_PROG_COMPILERS is expanded from... configure.ac:90: the top level configure.ac:97: warning: The macro 'AC_HELP_STRING' is obsolete. configure.ac:97: You should run autoupdate. ./lib/autoconf/general.m4:204: AC_HELP_STRING is expanded from... gnuscripts/lalsuite_build.m4:419: LALSUITE_CHECK_PYTHON is expanded from... configure.ac:97: the top level configure.ac:100: warning: The macro 'AC_HELP_STRING' is obsolete. configure.ac:100: You should run autoupdate. ./lib/autoconf/general.m4:204: AC_HELP_STRING is expanded from... gnuscripts/lalsuite_build.m4:1053: LALSUITE_ENABLE_OSX_VERSION_CHECK is expanded from... gnuscripts/lalsuite_build.m4:1064: LALSUITE_OSX_VERSION_CHECK is expanded from... configure.ac:100: the top level configure.ac:106: warning: The macro 'AC_HEADER_STDC' is obsolete. configure.ac:106: You should run autoupdate. ./lib/autoconf/headers.m4:663: AC_HEADER_STDC is expanded from... configure.ac:106: the top level configure.ac:124: warning: The macro 'AC_TRY_RUN' is obsolete. configure.ac:124: You should run autoupdate. ./lib/autoconf/general.m4:2995: AC_TRY_RUN is expanded from... gnuscripts/lalsuite_build.m4:996: LALSUITE_CHECK_GSL_VERSION is expanded from... configure.ac:124: the top level configure.ac:125: warning: The macro 'AC_HELP_STRING' is obsolete. configure.ac:125: You should run autoupdate. ./lib/autoconf/general.m4:204: AC_HELP_STRING is expanded from... gnuscripts/lalsuite_build.m4:1035: LALSUITE_ENABLE_FAST_GSL is expanded from... configure.ac:125: the top level configure.ac:138: warning: The macro 'AC_HELP_STRING' is obsolete. configure.ac:138: You should run autoupdate. ./lib/autoconf/general.m4:204: AC_HELP_STRING is expanded from... gnuscripts/lalsuite_build.m4:1124: LALSUITE_USE_DOXYGEN is expanded from... configure.ac:138: the top level + autoheader + automake -a -c -f --foreign configure.ac:90: installing 'gnuscripts/compile' configure.ac:27: installing 'gnuscripts/missing' src/Makefile.am: installing 'gnuscripts/depcomp' + ./configure 'LDFLAGS=-Wl,--as-needed -Wl,--no-copy-dt-needed-entries -Wl,-z,relro -Wl,-z,combreloc ' 'CFLAGS=-O2 -fwrapv -pipe -Wformat -Werror=format-security -gdwarf-4 -fno-debug-types-section -fvar-tracking-assignments -g2 -Wp,-D_FORTIFY_SOURCE=2 -fstack-protector-strong --param=ssp-buffer-size=4 -Werror=trampolines -fPIC -mtune=generic -march=x86-64 -gdwarf-4 -fno-debug-types-section -fvar-tracking-assignments -g2 ' 'CXXFLAGS=-O2 -fwrapv -pipe -Wformat -Werror=format-security -gdwarf-4 -fno-debug-types-section -fvar-tracking-assignments -g2 -Wp,-D_FORTIFY_SOURCE=2 -fstack-protector-strong --param=ssp-buffer-size=4 -Werror=trampolines -fPIC -mtune=generic -march=x86-64 -gdwarf-4 -fno-debug-types-section -fvar-tracking-assignments -g2 ' 'FFLAGS=-O2 -fwrapv -pipe -Wformat -Werror=format-security -gdwarf-4 -fno-debug-types-section -fvar-tracking-assignments -g2 -Wp,-D_FORTIFY_SOURCE=2 -fstack-protector-strong --param=ssp-buffer-size=4 -Werror=trampolines -fPIC -mtune=generic -march=x86-64 -gdwarf-4 -fno-debug-types-section -fvar-tracking-assignments -g2 ' 'FCFLAGS=-O2 -fwrapv -pipe -Wformat -Werror=format-security -gdwarf-4 -fno-debug-types-section -fvar-tracking-assignments -g2 -Wp,-D_FORTIFY_SOURCE=2 -fstack-protector-strong --param=ssp-buffer-size=4 -Werror=trampolines -fPIC -mtune=generic -march=x86-64 -gdwarf-4 -fno-debug-types-section -fvar-tracking-assignments -g2 ' 'CPPFLAGS=' 'CC=x86_64-pld-linux-gnux32-gcc' 'CXX=x86_64-pld-linux-gnux32-g++' '--host=x86_64-pld-linux-gnux32' '--build=x86_64-pld-linux-gnux32' '--prefix=/usr' '--exec-prefix=/usr' '--bindir=/usr/bin' '--sbindir=/usr/sbin' '--sysconfdir=/etc' '--datadir=/usr/share' '--includedir=/usr/include' '--libdir=/usr/libx32' '--libexecdir=/usr/libexec' '--localstatedir=/var' '--sharedstatedir=/var/lib' '--mandir=/usr/share/man' '--infodir=/usr/share/info' '--x-libraries=/usr/libx32' 'PYTHON=/usr/bin/python3' --disable-dependency-tracking --disable-silent-rules --enable-swig checking for a BSD-compatible install... /usr/bin/install -c checking whether build environment is sane... yes checking for a race-free mkdir -p... /bin/mkdir -p checking for mawk... mawk checking whether make sets $(MAKE)... yes checking whether make supports nested variables... yes checking whether UID '1000' is supported by ustar format... yes checking whether GID '1000' is supported by ustar format... yes checking how to create a ustar tar archive... gnutar checking build system type... x86_64-pld-linux-gnux32 checking host system type... x86_64-pld-linux-gnux32 checking for git... /usr/bin/git checking whether building from a git repository... no checking whether make supports nested variables... (cached) yes checking whether make supports the include directive... yes (GNU style) checking for x86_64-pld-linux-gnux32-gcc... x86_64-pld-linux-gnux32-gcc checking whether the C compiler works... yes checking for C compiler default output file name... a.out checking for suffix of executables... checking whether we are cross compiling... no checking for suffix of object files... o checking whether the compiler supports GNU C... yes checking whether x86_64-pld-linux-gnux32-gcc accepts -g... yes checking for x86_64-pld-linux-gnux32-gcc option to enable C11 features... none needed checking whether x86_64-pld-linux-gnux32-gcc understands -c and -o together... yes checking dependency style of x86_64-pld-linux-gnux32-gcc... none checking how to run the C preprocessor... x86_64-pld-linux-gnux32-gcc -E checking whether the compiler supports GNU C++... yes checking whether x86_64-pld-linux-gnux32-g++ accepts -g... yes checking for x86_64-pld-linux-gnux32-g++ option to enable C++11 features... none needed checking dependency style of x86_64-pld-linux-gnux32-g++... none checking how to run the C++ preprocessor... x86_64-pld-linux-gnux32-g++ -E checking whether ln -s works... yes checking for mawk... (cached) mawk checking for a sed that does not truncate output... /bin/sed checking whether /usr/bin/python3 version is >= 2.6... yes checking for /usr/bin/python3 version... 3.10 checking for /usr/bin/python3 platform... linux checking for GNU default /usr/bin/python3 prefix... ${prefix} checking for GNU default /usr/bin/python3 exec_prefix... ${exec_prefix} checking for /usr/bin/python3 script directory (pythondir)... ${PYTHON_PREFIX}/share/python3.10/site-packages checking for /usr/bin/python3 extension module directory (pyexecdir)... ${PYTHON_EXEC_PREFIX}/libx32/python3.10/site-packages checking how to print strings... print -r checking for a sed that does not truncate output... (cached) /bin/sed checking for grep that handles long lines and -e... /bin/grep checking for egrep... /bin/grep -E checking for fgrep... /bin/grep -F checking for ld used by x86_64-pld-linux-gnux32-gcc... /usr/bin/ld checking if the linker (/usr/bin/ld) is GNU ld... yes checking for BSD- or MS-compatible name lister (nm)... /usr/bin/nm -B checking the name lister (/usr/bin/nm -B) interface... BSD nm checking the maximum length of command line arguments... 1572864 checking how to convert x86_64-pld-linux-gnux32 file names to x86_64-pld-linux-gnux32 format... func_convert_file_noop checking how to convert x86_64-pld-linux-gnux32 file names to toolchain format... func_convert_file_noop checking for /usr/bin/ld option to reload object files... -r checking for x86_64-pld-linux-gnux32-file... no checking for file... file checking for x86_64-pld-linux-gnux32-objdump... no checking for objdump... objdump checking how to recognize dependent libraries... pass_all checking for x86_64-pld-linux-gnux32-dlltool... no checking for dlltool... no checking how to associate runtime and link libraries... print -r -- checking for x86_64-pld-linux-gnux32-ar... no checking for ar... ar checking for archiver @FILE support... @ checking for x86_64-pld-linux-gnux32-strip... no checking for strip... strip checking for x86_64-pld-linux-gnux32-ranlib... no checking for ranlib... ranlib checking command to parse /usr/bin/nm -B output from x86_64-pld-linux-gnux32-gcc object... ok checking for sysroot... no checking for a working dd... /bin/dd checking how to truncate binary pipes... /bin/dd bs=4096 count=1 checking for x86_64-pld-linux-gnux32-mt... no checking for mt... no checking if : is a manifest tool... no checking for stdio.h... yes checking for stdlib.h... yes checking for string.h... yes checking for inttypes.h... yes checking for stdint.h... yes checking for strings.h... yes checking for sys/stat.h... yes checking for sys/types.h... yes checking for unistd.h... yes checking for dlfcn.h... yes checking for objdir... .libs checking if x86_64-pld-linux-gnux32-gcc supports -fno-rtti -fno-exceptions... no checking for x86_64-pld-linux-gnux32-gcc option to produce PIC... -fPIC -DPIC checking if x86_64-pld-linux-gnux32-gcc PIC flag -fPIC -DPIC works... yes checking if x86_64-pld-linux-gnux32-gcc static flag -static works... yes checking if x86_64-pld-linux-gnux32-gcc supports -c -o file.o... yes checking if x86_64-pld-linux-gnux32-gcc supports -c -o file.o... (cached) yes checking whether the x86_64-pld-linux-gnux32-gcc linker (/usr/bin/ld -m elf32_x86_64) supports shared libraries... yes checking whether -lc should be explicitly linked in... no checking dynamic linker characteristics... GNU/Linux ld.so checking how to hardcode library paths into programs... immediate checking whether stripping libraries is possible... yes checking if libtool supports shared libraries... yes checking whether to build shared libraries... yes checking whether to build static libraries... yes checking how to run the C++ preprocessor... x86_64-pld-linux-gnux32-g++ -E checking for ld used by x86_64-pld-linux-gnux32-g++... /usr/bin/ld -m elf32_x86_64 checking if the linker (/usr/bin/ld -m elf32_x86_64) is GNU ld... yes checking whether the x86_64-pld-linux-gnux32-g++ linker (/usr/bin/ld -m elf32_x86_64) supports shared libraries... yes checking for x86_64-pld-linux-gnux32-g++ option to produce PIC... -fPIC -DPIC checking if x86_64-pld-linux-gnux32-g++ PIC flag -fPIC -DPIC works... yes checking if x86_64-pld-linux-gnux32-g++ static flag -static works... yes checking if x86_64-pld-linux-gnux32-g++ supports -c -o file.o... yes checking if x86_64-pld-linux-gnux32-g++ supports -c -o file.o... (cached) yes checking whether the x86_64-pld-linux-gnux32-g++ linker (/usr/bin/ld -m elf32_x86_64) supports shared libraries... yes checking dynamic linker characteristics... (cached) GNU/Linux ld.so checking how to hardcode library paths into programs... immediate configure: creating ./config.lt config.lt: creating libtool checking for egrep... (cached) /bin/grep -E checking for main in -lm... yes checking for x86_64-pld-linux-gnux32-pkg-config... /usr/bin/x86_64-pld-linux-gnux32-pkg-config checking pkg-config is at least version 0.9.0... yes checking for LIBXML2... yes checking for xmlInitParser in -lxml2... yes checking for libxml/tree.h... yes checking for GSL... yes checking for main in -lgslcblas... yes checking for gsl_version in -lgsl... yes checking for GSL version >= 1.13... yes checking for gsl/gsl_errno.h... yes checking for LAL... yes checking for XLALPerror in -llal... yes checking for lal/XLALError.h... yes checking whether LAL headers match the library... yes checking for LALSUPPORT... yes checking for XLALCacheImport in -llalsupport... yes checking for lal/LALCache.h... yes checking for x86_64-pld-linux-gnux32-gcc options needed to detect all undeclared functions... none needed checking for octave-cli... /usr/bin/octave-cli checking for octave-config... /usr/bin/octave-config checking for mkoctfile... /usr/bin/mkoctfile checking /usr/bin/octave-cli version... 6.4.0 checking /usr/bin/octave-cli .oct installation directory... /usr/libx32/octave/6.4.0/site/oct/x86_64-pld-linux-gnux32 checking C++ compiler used for building /usr/bin/octave-cli... x86_64-pld-linux-gnux32-g++ checking configured C++ compiler "x86_64-pld-linux-gnux32-g++" is compatible with /usr/bin/octave-cli C++ compiler "x86_64-pld-linux-gnux32-g++"... yes checking whether C++ compiler accepts -fPIC... yes checking whether C++ compiler accepts -I/usr/include/octave/..... yes checking whether C++ compiler accepts -I/usr/include/octave... yes checking whether C++ compiler accepts -fopenmp... yes checking whether C++ compiler accepts -O2... yes checking whether C++ compiler accepts -fwrapv... yes checking whether C++ compiler accepts -pipe... yes checking whether C++ compiler accepts -Wformat... yes checking whether C++ compiler accepts -Werror=format-security... yes checking whether C++ compiler accepts -gdwarf-4... yes checking whether C++ compiler accepts -fno-debug-types-section... yes checking whether C++ compiler accepts -fvar-tracking-assignments... yes checking whether C++ compiler accepts -g2... yes checking whether C++ compiler accepts -Wp,-D_FORTIFY_SOURCE=2... yes checking whether C++ compiler accepts -fstack-protector-strong... yes checking whether C++ compiler accepts --param=ssp-buffer-size=4... yes checking whether C++ compiler accepts -Werror=trampolines... yes checking whether C++ compiler accepts -fPIC... (cached) yes checking whether C++ compiler accepts -mtune=generic... yes checking whether C++ compiler accepts -march=x86-64... yes checking whether C++ compiler accepts -gdwarf-4... (cached) yes checking whether C++ compiler accepts -fno-debug-types-section... (cached) yes checking whether C++ compiler accepts -fvar-tracking-assignments... (cached) yes checking whether C++ compiler accepts -g2... (cached) yes checking whether C++ compiler accepts -Wno-uninitialized... yes checking whether C++ compiler accepts -Wno-unused-variable... yes checking whether C++ compiler accepts -Wno-unused-but-set-variable... yes checking whether C++ compiler accepts -Wno-format-extra-args... yes checking whether C++ compiler accepts -Wno-tautological-compare... yes checking whether C++ compiler accepts -Wno-deprecated-declarations... yes checking whether C++ compiler accepts -fno-strict-aliasing... yes checking whether C++ compiler accepts -O0... yes checking whether C++ compiler accepts -Wp,-U_FORTIFY_SOURCE... yes checking whether C++ linker accepts -L/usr/libx32... yes checking whether C++ linker accepts -loctinterp... yes checking whether C++ linker accepts -loctave... yes checking whether C++ linker accepts -Wl,--as-needed... yes checking whether C++ linker accepts -Wl,--no-copy-dt-needed-entries... yes checking whether C++ linker accepts -Wl,-z,relro... yes checking whether C++ linker accepts -Wl,-z,combreloc... yes checking for octave/oct.h... yes checking for distutils... yes checking for NumPy... yes checking NumPy version... 1.22.2 checking whether C compiler accepts -Wno-unused-result... yes checking whether C compiler accepts -Wsign-compare... yes checking whether C compiler accepts -O2... yes checking whether C compiler accepts -fwrapv... yes checking whether C compiler accepts -pipe... yes checking whether C compiler accepts -Wformat... yes checking whether C compiler accepts -Werror=format-security... yes checking whether C compiler accepts -gdwarf-4... yes checking whether C compiler accepts -fno-debug-types-section... yes checking whether C compiler accepts -fvar-tracking-assignments... yes checking whether C compiler accepts -g2... yes checking whether C compiler accepts -Wp,-D_FORTIFY_SOURCE=2... yes checking whether C compiler accepts -fstack-protector-strong... yes checking whether C compiler accepts --param=ssp-buffer-size=4... yes checking whether C compiler accepts -Werror=trampolines... yes checking whether C compiler accepts -fPIC... yes checking whether C compiler accepts -mtune=generic... yes checking whether C compiler accepts -march=x86-64... yes checking whether C compiler accepts -gdwarf-4... (cached) yes checking whether C compiler accepts -fno-debug-types-section... (cached) yes checking whether C compiler accepts -fvar-tracking-assignments... (cached) yes checking whether C compiler accepts -g2... (cached) yes checking whether C compiler accepts -O2... (cached) yes checking whether C compiler accepts -fwrapv... (cached) yes checking whether C compiler accepts -pipe... (cached) yes checking whether C compiler accepts -Wformat... (cached) yes checking whether C compiler accepts -Werror=format-security... (cached) yes checking whether C compiler accepts -gdwarf-4... (cached) yes checking whether C compiler accepts -fno-debug-types-section... (cached) yes checking whether C compiler accepts -fvar-tracking-assignments... (cached) yes checking whether C compiler accepts -g2... (cached) yes checking whether C compiler accepts -Wp,-D_FORTIFY_SOURCE=2... (cached) yes checking whether C compiler accepts -fstack-protector-strong... (cached) yes checking whether C compiler accepts --param=ssp-buffer-size=4... (cached) yes checking whether C compiler accepts -Werror=trampolines... (cached) yes checking whether C compiler accepts -fPIC... (cached) yes checking whether C compiler accepts -mtune=generic... (cached) yes checking whether C compiler accepts -march=x86-64... (cached) yes checking whether C compiler accepts -gdwarf-4... (cached) yes checking whether C compiler accepts -fno-debug-types-section... (cached) yes checking whether C compiler accepts -fvar-tracking-assignments... (cached) yes checking whether C compiler accepts -g2... (cached) yes checking whether C compiler accepts -Wno-uninitialized... yes checking whether C compiler accepts -Wno-unused-variable... yes checking whether C compiler accepts -Wno-unused-but-set-variable... yes checking whether C compiler accepts -Wno-format-extra-args... yes checking whether C compiler accepts -Wno-tautological-compare... yes checking whether C compiler accepts -fno-strict-aliasing... yes checking whether C linker accepts -Wl,--as-needed... yes checking whether C linker accepts -Wl,--no-copy-dt-needed-entries... yes checking whether C linker accepts -Wl,-z,relro... yes checking whether C linker accepts -Wl,-z,combreloc... yes checking whether C linker accepts -L/usr/share/python3.10/site-packages... yes checking whether C linker accepts -L/usr/libx32/python3.10/site-packages... yes checking whether C linker accepts -L/usr/libx32/python3.10... yes checking whether C linker accepts -L/usr/libx32... yes checking for Python.h... yes checking for numpy/arrayobject.h... yes checking whether NPY_ARRAY_WRITEABLE is declared... yes checking whether PyArray_SetBaseObject is declared... yes checking if /usr/bin/swig version is at least 3.0.12... yes (4.1.1) checking if /usr/bin/swig works with CCACHE_CPP2=1... yes checking for LALSuite binding dependencies... lal checking if SWIG supports relative Python imports... yes checking whether C compiler accepts -g3... yes checking whether C compiler accepts -Wall... yes checking whether C compiler accepts -W... yes checking whether C compiler accepts -Werror... yes checking whether C compiler accepts -Wmissing-prototypes... yes checking whether C compiler accepts -Wstrict-prototypes... yes checking whether C compiler accepts -Wshadow... yes checking whether C compiler accepts -Wpointer-arith... yes checking whether C compiler accepts -Wcast-qual... yes checking whether C compiler accepts -Wcast-align... yes checking whether C compiler accepts -Wwrite-strings... yes checking whether C compiler accepts -fno-common... yes checking whether C compiler accepts -Wnested-externs... yes checking whether C compiler accepts -Wno-format-zero-length... yes checking whether C compiler accepts -fno-strict-aliasing... (cached) yes checking whether C compiler accepts -Wno-unused-result... (cached) yes checking whether C compiler accepts -Wno-unknown-pragmas... yes checking whether C compiler accepts -diag-disable=3180... no checking whether C compiler accepts -Wno-misleading-indentation... yes checking whether C compiler accepts -Qunused-arguments... no checking that generated files are newer than configure... done configure: creating ./config.status config.status: creating Makefile config.status: creating debian/Makefile config.status: creating debian/control config.status: creating doxygen/Makefile config.status: creating doxygen/doxygen.cfg config.status: creating include/Makefile config.status: creating include/lal/Makefile config.status: creating lalxml.pc config.status: creating lalxml.spec config.status: creating python/Makefile config.status: creating python/lalxml/Makefile config.status: creating python/lalxml/__init__.py config.status: creating src/LALXMLVCSInfo.c config.status: creating src/LALXMLVCSInfo.h config.status: creating src/Makefile config.status: creating src/version.c config.status: creating swig/Makefile config.status: creating test/Makefile config.status: creating src/config.h config.status: creating src/LALXMLConfig.h config.status: src/LALXMLConfig.h is unchanged config.status: executing depfiles commands config.status: executing libtool commands configure: ================================================== LALXML has now been successfully configured: * Python support is ENABLED * SWIG bindings for Octave are ENABLED * SWIG bindings for Python are ENABLED * Doxygen documentation is DISABLED and will be installed under the directory: /usr Now run 'make' to build LALXML, and run 'make install' to install LALXML. ================================================== + /usr/bin/make -Otarget -j28 if echo "set lalxml_PREFIX /usr; set lalxml_DATADIR /usr/share/lalxml; " | mawk -f ./gnuscripts/generate_user_env.awk >lalxml-user-env.shell; then \ exit 0; \ else \ rm -f lalxml-user-env.shell; \ exit 1; \ fi prefix=`echo "lalxml-user-env.sh" | /bin/sed -e 's|.*\.||'`; \ echo "# source this file to access LALXML" >lalxml-user-env.sh; \ /bin/sed -n -e "s|[@]SED[@]|/bin/sed|g;s|^$prefix:||p" lalxml-user-env.shell >>lalxml-user-env.sh prefix=`echo "lalxml-user-env.csh" | /bin/sed -e 's|.*\.||'`; \ echo "# source this file to access LALXML" >lalxml-user-env.csh; \ /bin/sed -n -e "s|[@]SED[@]|/bin/sed|g;s|^$prefix:||p" lalxml-user-env.shell >>lalxml-user-env.csh prefix=`echo "lalxml-user-env.fish" | /bin/sed -e 's|.*\.||'`; \ echo "# source this file to access LALXML" >lalxml-user-env.fish; \ /bin/sed -n -e "s|[@]SED[@]|/bin/sed|g;s|^$prefix:||p" lalxml-user-env.shell >>lalxml-user-env.fish /usr/bin/make all-recursive Making all in debian make[2]: Nothing to be done for 'all'. Making all in include Making all in lal for file in header-link-stamp *.h *.i; do \ rm -f "$file"; \ done; \ for dir in src swig; do \ ( cd "../../$dir" && /usr/bin/make header-links ) || exit 1; \ done; \ echo "header-link-stamp" > header-link-stamp for dir in ; do \ if test "x$dir" != "x."; then \ ( cd "$dir" && /usr/bin/make header-links ) || exit 1; \ fi; \ done; \ if test "xLALXML.h" != x; then \ echo "Making header-links in src"; \ for file in LALXML.h LALXMLConfig.h LALXMLVCSInfo.h LALXMLVCSInfoHeader.h LALXMLVOTableCommon.h LALXMLVOTableSerializers.h; do \ case $file in \ header-links-local) continue;; \ /*) targetfile="$file";; \ *) targetfile="/tmp/B.qa2tqqnq/BUILD/lalxml-1.2.4/src/$file";; \ esac; \ linkname=`expr "$targetfile" : '.*/\([^/]*\)$'`; \ linkfile="/tmp/B.qa2tqqnq/BUILD/lalxml-1.2.4/include/lal/$linkname"; \ if test ! -r "$linkfile" ; then \ rm -f "$linkfile"; \ ln -s "$targetfile" "$linkfile"; \ fi; \ done; \ fi Making header-links in src make[4]: Entering directory '/tmp/B.qa2tqqnq/BUILD/lalxml-1.2.4/swig' rm -f ../include/lal/swiglalxml.i && \ ln -s /tmp/B.qa2tqqnq/BUILD/lalxml-1.2.4/swig/swiglalxml.i ../include/lal/swiglalxml.i make[4]: Leaving directory '/tmp/B.qa2tqqnq/BUILD/lalxml-1.2.4/swig' for dir in ; do \ if test "x$dir" != "x."; then \ ( cd "$dir" && /usr/bin/make header-links ) || exit 1; \ fi; \ done; \ if test "xSWIGLALXMLAlpha.i" != x; then \ echo "Making header-links in swig"; \ for file in SWIGLALXMLAlpha.i SWIGLALXMLOmega.i SWIGLALXMLTest.h header-links-local; do \ case $file in \ header-links-local) continue;; \ /*) targetfile="$file";; \ *) targetfile="/tmp/B.qa2tqqnq/BUILD/lalxml-1.2.4/swig/$file";; \ esac; \ linkname=`expr "$targetfile" : '.*/\([^/]*\)$'`; \ linkfile="/tmp/B.qa2tqqnq/BUILD/lalxml-1.2.4/include/lal/$linkname"; \ if test ! -r "$linkfile" ; then \ rm -f "$linkfile"; \ ln -s "$targetfile" "$linkfile"; \ fi; \ done; \ fi Making header-links in swig /usr/bin/make all-am make[4]: Nothing to be done for 'all-am'. make[3]: Nothing to be done for 'all-am'. Making all in src /usr/bin/make all-am make[3]: Entering directory '/tmp/B.qa2tqqnq/BUILD/lalxml-1.2.4/src' echo '/* LALXMLBuildInfoHeader.h: generated by Makefile */' >LALXMLBuildInfoHeader.h; \ echo '#define LALXML_CONFIGURE_ARGS "'"'LDFLAGS=-Wl,--as-needed -Wl,--no-copy-dt-needed-entries -Wl,-z,relro -Wl,-z,combreloc ' 'CFLAGS=-O2 -fwrapv -pipe -Wformat -Werror=format-security -gdwarf-4 -fno-debug-types-section -fvar-tracking-assignments -g2 -Wp,-D_FORTIFY_SOURCE=2 -fstack-protector-strong --param=ssp-buffer-size=4 -Werror=trampolines -fPIC -mtune=generic -march=x86-64 -gdwarf-4 -fno-debug-types-section -fvar-tracking-assignments -g2 ' 'CXXFLAGS=-O2 -fwrapv -pipe -Wformat -Werror=format-security -gdwarf-4 -fno-debug-types-section -fvar-tracking-assignments -g2 -Wp,-D_FORTIFY_SOURCE=2 -fstack-protector-strong --param=ssp-buffer-size=4 -Werror=trampolines -fPIC -mtune=generic -march=x86-64 -gdwarf-4 -fno-debug-types-section -fvar-tracking-assignments -g2 ' 'FFLAGS=-O2 -fwrapv -pipe -Wformat -Werror=format-security -gdwarf-4 -fno-debug-types-section -fvar-tracking-assignments -g2 -Wp,-D_FORTIFY_SOURCE=2 -fstack-protector-strong --param=ssp-buffer-size=4 -Werror=trampolines -fPIC -mtune=generic -march=x86-64 -gdwarf-4 -fno-debug-types-section -fvar-tracking-assignments -g2 ' 'FCFLAGS=-O2 -fwrapv -pipe -Wformat -Werror=format-security -gdwarf-4 -fno-debug-types-section -fvar-tracking-assignments -g2 -Wp,-D_FORTIFY_SOURCE=2 -fstack-protector-strong --param=ssp-buffer-size=4 -Werror=trampolines -fPIC -mtune=generic -march=x86-64 -gdwarf-4 -fno-debug-types-section -fvar-tracking-assignments -g2 ' 'CPPFLAGS=' 'CC=x86_64-pld-linux-gnux32-gcc' 'CXX=x86_64-pld-linux-gnux32-g++' '--host=x86_64-pld-linux-gnux32' '--build=x86_64-pld-linux-gnux32' '--prefix=/usr' '--exec-prefix=/usr' '--bindir=/usr/bin' '--sbindir=/usr/sbin' '--sysconfdir=/etc' '--datadir=/usr/share' '--includedir=/usr/include' '--libdir=/usr/libx32' '--libexecdir=/usr/libexec' '--localstatedir=/var' '--sharedstatedir=/var/lib' '--mandir=/usr/share/man' '--infodir=/usr/share/info' '--x-libraries=/usr/libx32' 'PYTHON=/usr/bin/python3' '--disable-dependency-tracking' '--disable-silent-rules' '--enable-swig' 'build_alias=x86_64-pld-linux-gnux32' 'host_alias=x86_64-pld-linux-gnux32' 'PKG_CONFIG_PATH=:/usr/libx32/pkgconfig:/usr/share/pkgconfig'"'"' >>LALXMLBuildInfoHeader.h; \ echo '#define LALXML_CONFIGURE_DATE "'"2024-06-09T15:26:23+0200"'"' >>LALXMLBuildInfoHeader.h; \ echo '#define LALXML_BUILD_DATE "'`date +"%Y-%m-%dT%H:%M:%S%z"`'"' >>LALXMLBuildInfoHeader.h make[3]: Leaving directory '/tmp/B.qa2tqqnq/BUILD/lalxml-1.2.4/src' make[3]: Entering directory '/tmp/B.qa2tqqnq/BUILD/lalxml-1.2.4/src' x86_64-pld-linux-gnux32-gcc -DHAVE_CONFIG_H -I. -I../include -DPKG_DATA_DIR='"/usr/share/lalxml/"' -D_ISOC99_SOURCE -D__STDC_CONSTANT_MACROS -D__STDC_LIMIT_MACROS -I/usr/include/libxml2 -O2 -g -pthread -pthread -g3 -Wall -W -Werror -Wmissing-prototypes -Wstrict-prototypes -Wshadow -Wpointer-arith -Wcast-qual -Wcast-align -Wwrite-strings -fno-common -Wnested-externs -Wno-format-zero-length -fno-strict-aliasing -Wno-unused-result -Wno-unknown-pragmas -Wno-misleading-indentation -O2 -fwrapv -pipe -Wformat -Werror=format-security -gdwarf-4 -fno-debug-types-section -fvar-tracking-assignments -g2 -Wp,-D_FORTIFY_SOURCE=2 -fstack-protector-strong --param=ssp-buffer-size=4 -Werror=trampolines -fPIC -mtune=generic -march=x86-64 -gdwarf-4 -fno-debug-types-section -fvar-tracking-assignments -g2 -c -o version.o version.c make[3]: Leaving directory '/tmp/B.qa2tqqnq/BUILD/lalxml-1.2.4/src' make[3]: Entering directory '/tmp/B.qa2tqqnq/BUILD/lalxml-1.2.4/src' /bin/sh ../libtool --tag=CC --mode=compile x86_64-pld-linux-gnux32-gcc -DHAVE_CONFIG_H -I. -I../include -DPKG_DATA_DIR='"/usr/share/lalxml/"' -D_ISOC99_SOURCE -D__STDC_CONSTANT_MACROS -D__STDC_LIMIT_MACROS -I/usr/include/libxml2 -O2 -g -pthread -pthread -g3 -Wall -W -Werror -Wmissing-prototypes -Wstrict-prototypes -Wshadow -Wpointer-arith -Wcast-qual -Wcast-align -Wwrite-strings -fno-common -Wnested-externs -Wno-format-zero-length -fno-strict-aliasing -Wno-unused-result -Wno-unknown-pragmas -Wno-misleading-indentation -O2 -fwrapv -pipe -Wformat -Werror=format-security -gdwarf-4 -fno-debug-types-section -fvar-tracking-assignments -g2 -Wp,-D_FORTIFY_SOURCE=2 -fstack-protector-strong --param=ssp-buffer-size=4 -Werror=trampolines -fPIC -mtune=generic -march=x86-64 -gdwarf-4 -fno-debug-types-section -fvar-tracking-assignments -g2 -c -o LALXML.lo LALXML.c libtool: compile: x86_64-pld-linux-gnux32-gcc -DHAVE_CONFIG_H -I. -I../include -DPKG_DATA_DIR=\"/usr/share/lalxml/\" -D_ISOC99_SOURCE -D__STDC_CONSTANT_MACROS -D__STDC_LIMIT_MACROS -I/usr/include/libxml2 -O2 -g -pthread -pthread -g3 -Wall -W -Werror -Wmissing-prototypes -Wstrict-prototypes -Wshadow -Wpointer-arith -Wcast-qual -Wcast-align -Wwrite-strings -fno-common -Wnested-externs -Wno-format-zero-length -fno-strict-aliasing -Wno-unused-result -Wno-unknown-pragmas -Wno-misleading-indentation -O2 -fwrapv -pipe -Wformat -Werror=format-security -gdwarf-4 -fno-debug-types-section -fvar-tracking-assignments -g2 -Wp,-D_FORTIFY_SOURCE=2 -fstack-protector-strong --param=ssp-buffer-size=4 -Werror=trampolines -fPIC -mtune=generic -march=x86-64 -gdwarf-4 -fno-debug-types-section -fvar-tracking-assignments -g2 -c LALXML.c -fPIC -DPIC -o .libs/LALXML.o LALXML.c: In function 'XLALXMLDoc2String': LALXML.c:523:3: error: implicit declaration of function 'xmlThrDefIndentTreeOutput'; did you mean 'xmlIndentTreeOutput'? [-Werror=implicit-function-declaration] 523 | xmlThrDefIndentTreeOutput(1); | ^~~~~~~~~~~~~~~~~~~~~~~~~ | xmlIndentTreeOutput LALXML.c:523:3: error: nested extern declaration of 'xmlThrDefIndentTreeOutput' [-Werror=nested-externs] cc1: all warnings being treated as errors make[3]: *** [Makefile:854: LALXML.lo] Error 1 make[3]: Leaving directory '/tmp/B.qa2tqqnq/BUILD/lalxml-1.2.4/src' make[3]: *** Waiting for unfinished jobs.... make[3]: Entering directory '/tmp/B.qa2tqqnq/BUILD/lalxml-1.2.4/src' cd .. && /bin/sh ./config.status src/LALXMLVCSInfo.c config.status: creating src/LALXMLVCSInfo.c make[3]: Leaving directory '/tmp/B.qa2tqqnq/BUILD/lalxml-1.2.4/src' make[3]: Entering directory '/tmp/B.qa2tqqnq/BUILD/lalxml-1.2.4/src' /bin/sh ../libtool --tag=CC --mode=compile x86_64-pld-linux-gnux32-gcc -DHAVE_CONFIG_H -I. -I../include -DPKG_DATA_DIR='"/usr/share/lalxml/"' -D_ISOC99_SOURCE -D__STDC_CONSTANT_MACROS -D__STDC_LIMIT_MACROS -I/usr/include/libxml2 -O2 -g -pthread -pthread -g3 -Wall -W -Werror -Wmissing-prototypes -Wstrict-prototypes -Wshadow -Wpointer-arith -Wcast-qual -Wcast-align -Wwrite-strings -fno-common -Wnested-externs -Wno-format-zero-length -fno-strict-aliasing -Wno-unused-result -Wno-unknown-pragmas -Wno-misleading-indentation -O2 -fwrapv -pipe -Wformat -Werror=format-security -gdwarf-4 -fno-debug-types-section -fvar-tracking-assignments -g2 -Wp,-D_FORTIFY_SOURCE=2 -fstack-protector-strong --param=ssp-buffer-size=4 -Werror=trampolines -fPIC -mtune=generic -march=x86-64 -gdwarf-4 -fno-debug-types-section -fvar-tracking-assignments -g2 -c -o LALXMLVOTableSerializers.lo LALXMLVOTableSerializers.c libtool: compile: x86_64-pld-linux-gnux32-gcc -DHAVE_CONFIG_H -I. -I../include -DPKG_DATA_DIR=\"/usr/share/lalxml/\" -D_ISOC99_SOURCE -D__STDC_CONSTANT_MACROS -D__STDC_LIMIT_MACROS -I/usr/include/libxml2 -O2 -g -pthread -pthread -g3 -Wall -W -Werror -Wmissing-prototypes -Wstrict-prototypes -Wshadow -Wpointer-arith -Wcast-qual -Wcast-align -Wwrite-strings -fno-common -Wnested-externs -Wno-format-zero-length -fno-strict-aliasing -Wno-unused-result -Wno-unknown-pragmas -Wno-misleading-indentation -O2 -fwrapv -pipe -Wformat -Werror=format-security -gdwarf-4 -fno-debug-types-section -fvar-tracking-assignments -g2 -Wp,-D_FORTIFY_SOURCE=2 -fstack-protector-strong --param=ssp-buffer-size=4 -Werror=trampolines -fPIC -mtune=generic -march=x86-64 -gdwarf-4 -fno-debug-types-section -fvar-tracking-assignments -g2 -c LALXMLVOTableSerializers.c -fPIC -DPIC -o .libs/LALXMLVOTableSerializers.o libtool: compile: x86_64-pld-linux-gnux32-gcc -DHAVE_CONFIG_H -I. -I../include -DPKG_DATA_DIR=\"/usr/share/lalxml/\" -D_ISOC99_SOURCE -D__STDC_CONSTANT_MACROS -D__STDC_LIMIT_MACROS -I/usr/include/libxml2 -O2 -g -pthread -pthread -g3 -Wall -W -Werror -Wmissing-prototypes -Wstrict-prototypes -Wshadow -Wpointer-arith -Wcast-qual -Wcast-align -Wwrite-strings -fno-common -Wnested-externs -Wno-format-zero-length -fno-strict-aliasing -Wno-unused-result -Wno-unknown-pragmas -Wno-misleading-indentation -O2 -fwrapv -pipe -Wformat -Werror=format-security -gdwarf-4 -fno-debug-types-section -fvar-tracking-assignments -g2 -Wp,-D_FORTIFY_SOURCE=2 -fstack-protector-strong --param=ssp-buffer-size=4 -Werror=trampolines -fPIC -mtune=generic -march=x86-64 -gdwarf-4 -fno-debug-types-section -fvar-tracking-assignments -g2 -c LALXMLVOTableSerializers.c -o LALXMLVOTableSerializers.o >/dev/null 2>&1 make[3]: Leaving directory '/tmp/B.qa2tqqnq/BUILD/lalxml-1.2.4/src' make[3]: Entering directory '/tmp/B.qa2tqqnq/BUILD/lalxml-1.2.4/src' /bin/sh ../libtool --tag=CC --mode=compile x86_64-pld-linux-gnux32-gcc -DHAVE_CONFIG_H -I. -I../include -DPKG_DATA_DIR='"/usr/share/lalxml/"' -D_ISOC99_SOURCE -D__STDC_CONSTANT_MACROS -D__STDC_LIMIT_MACROS -I/usr/include/libxml2 -O2 -g -pthread -pthread -g3 -Wall -W -Werror -Wmissing-prototypes -Wstrict-prototypes -Wshadow -Wpointer-arith -Wcast-qual -Wcast-align -Wwrite-strings -fno-common -Wnested-externs -Wno-format-zero-length -fno-strict-aliasing -Wno-unused-result -Wno-unknown-pragmas -Wno-misleading-indentation -O2 -fwrapv -pipe -Wformat -Werror=format-security -gdwarf-4 -fno-debug-types-section -fvar-tracking-assignments -g2 -Wp,-D_FORTIFY_SOURCE=2 -fstack-protector-strong --param=ssp-buffer-size=4 -Werror=trampolines -fPIC -mtune=generic -march=x86-64 -gdwarf-4 -fno-debug-types-section -fvar-tracking-assignments -g2 -c -o LALXMLVOTableCommon.lo LALXMLVOTableCommon.c libtool: compile: x86_64-pld-linux-gnux32-gcc -DHAVE_CONFIG_H -I. -I../include -DPKG_DATA_DIR=\"/usr/share/lalxml/\" -D_ISOC99_SOURCE -D__STDC_CONSTANT_MACROS -D__STDC_LIMIT_MACROS -I/usr/include/libxml2 -O2 -g -pthread -pthread -g3 -Wall -W -Werror -Wmissing-prototypes -Wstrict-prototypes -Wshadow -Wpointer-arith -Wcast-qual -Wcast-align -Wwrite-strings -fno-common -Wnested-externs -Wno-format-zero-length -fno-strict-aliasing -Wno-unused-result -Wno-unknown-pragmas -Wno-misleading-indentation -O2 -fwrapv -pipe -Wformat -Werror=format-security -gdwarf-4 -fno-debug-types-section -fvar-tracking-assignments -g2 -Wp,-D_FORTIFY_SOURCE=2 -fstack-protector-strong --param=ssp-buffer-size=4 -Werror=trampolines -fPIC -mtune=generic -march=x86-64 -gdwarf-4 -fno-debug-types-section -fvar-tracking-assignments -g2 -c LALXMLVOTableCommon.c -fPIC -DPIC -o .libs/LALXMLVOTableCommon.o libtool: compile: x86_64-pld-linux-gnux32-gcc -DHAVE_CONFIG_H -I. -I../include -DPKG_DATA_DIR=\"/usr/share/lalxml/\" -D_ISOC99_SOURCE -D__STDC_CONSTANT_MACROS -D__STDC_LIMIT_MACROS -I/usr/include/libxml2 -O2 -g -pthread -pthread -g3 -Wall -W -Werror -Wmissing-prototypes -Wstrict-prototypes -Wshadow -Wpointer-arith -Wcast-qual -Wcast-align -Wwrite-strings -fno-common -Wnested-externs -Wno-format-zero-length -fno-strict-aliasing -Wno-unused-result -Wno-unknown-pragmas -Wno-misleading-indentation -O2 -fwrapv -pipe -Wformat -Werror=format-security -gdwarf-4 -fno-debug-types-section -fvar-tracking-assignments -g2 -Wp,-D_FORTIFY_SOURCE=2 -fstack-protector-strong --param=ssp-buffer-size=4 -Werror=trampolines -fPIC -mtune=generic -march=x86-64 -gdwarf-4 -fno-debug-types-section -fvar-tracking-assignments -g2 -c LALXMLVOTableCommon.c -o LALXMLVOTableCommon.o >/dev/null 2>&1 make[3]: Leaving directory '/tmp/B.qa2tqqnq/BUILD/lalxml-1.2.4/src' make[2]: *** [Makefile:659: all] Error 2 make[1]: *** [Makefile:587: all-recursive] Error 1 make: *** [Makefile:487: all] Error 2 error: Bad exit status from /tmp/B.qa2tqqnq/BUILD/tmp/rpm-tmp.2nrded (%build) RPM build errors: Bad exit status from /tmp/B.qa2tqqnq/BUILD/tmp/rpm-tmp.2nrded (%build) ended at: Sun Jun 9 15:26:47 2024, done in 0:00:32.439131 error: No files produced. + chmod -R u+rwX /tmp/B.qa2tqqnq/BUILD + rm -rf /tmp/B.qa2tqqnq/tmp /tmp/B.qa2tqqnq/BUILD + rm -rf /tmp/B.qa2tqqnq Begin-PLD-Builder-Info Build-Time: user:44.26s sys:14.14s real:67.50s (faults io:5 non-io:2392237) End-PLD-Builder-Info
[Back to list of logs] [View rpm -qa of builder]