FailedOk

th/SRPMS[OK]
th/x32[OK]
th/i686[OK]
th/x86_64[OK]

ac/SRPMS[OK]
ac/i386[OK]
ac/i586[OK]
ac/i686[OK]
ac/alpha[OK]
ac/amd64[OK]
ac/athlon[OK]
ac/ppc[OK]
ac/sparc[OK]
ac/sparc64[OK]

Advanced Search
main()
Powered by PLD Linux
(c) 2002-2021 PLD Team
$Revision: 1.37 $
Powered by vim.
Your IP: 3.235.223.5

libkcapi 92c9e1bb-3c2e-4b6e-b1d7-d11787422ee9

Status:Failed
Source URL:https://buildlogs.pld-linux.org/pld/th/x32/FAIL/libkcapi,92c9e1bb-3c2e-4b6e-b1d7-d11787422ee9.bz2
text/plain URL:View!
full text:View!
rpm -qa of builder:View!
Date:2021/05/29 11:46:11
Runtime:0:00:13.415908

Toc:

  • error 1
  • lib/doc/bin/docproc.c:433:17: error: conversion to 'ssize_t' {aka 'int'} from 'unsigned int' may change the sign of the result [-Werror=sign-conversion]
  • error 2
  • lib/doc/bin/docproc.c:441:48: error: comparison of integer expressions of different signedness: 'ssize_t' {aka 'int'} and 'unsigned int' [-Werror=sign-compare]
  • error 3
  • error: Bad exit status from /tmp/B.rr14TY/BUILD/tmp/rpm-tmp.8S5Xod (%build)
  • error 4
  • RPM build errors:
  • error 5
  • error: No files produced.

Content:

checking for stdlib.h... yes
checking for string.h... yes
checking for inttypes.h... yes
checking for stdint.h... yes
checking for strings.h... yes
checking for sys/stat.h... yes
checking for sys/types.h... yes
checking for unistd.h... yes
checking for dlfcn.h... yes
checking for objdir... .libs
checking if x86_64-pld-linux-gnux32-gcc supports -fno-rtti -fno-exceptions... no
checking for x86_64-pld-linux-gnux32-gcc option to produce PIC... -fPIC -DPIC
checking if x86_64-pld-linux-gnux32-gcc PIC flag -fPIC -DPIC works... yes
checking if x86_64-pld-linux-gnux32-gcc static flag -static works... yes
checking if x86_64-pld-linux-gnux32-gcc supports -c -o file.o... yes
checking if x86_64-pld-linux-gnux32-gcc supports -c -o file.o... (cached) yes
checking whether the x86_64-pld-linux-gnux32-gcc linker (/usr/bin/ld -m elf32_x86_64) supports shared libraries... yes
checking whether -lc should be explicitly linked in... no
checking dynamic linker characteristics... GNU/Linux ld.so
checking how to hardcode library paths into programs... immediate
checking whether stripping libraries is possible... yes
checking if libtool supports shared libraries... yes
checking whether to build shared libraries... yes
checking whether to build static libraries... yes
checking for x86_64-pld-linux-gnux32-gcc... (cached) x86_64-pld-linux-gnux32-gcc
checking whether the compiler supports GNU C... (cached) yes
checking whether x86_64-pld-linux-gnux32-gcc accepts -g... (cached) yes
checking for x86_64-pld-linux-gnux32-gcc option to enable C11 features... (cached) none needed
checking whether x86_64-pld-linux-gnux32-gcc understands -c and -o together... (cached) yes
checking dependency style of x86_64-pld-linux-gnux32-gcc... (cached) gcc3
checking how to run the C preprocessor... x86_64-pld-linux-gnux32-gcc -E
checking for gcc... gcc
checking whether the compiler supports GNU C... (cached) yes
checking whether gcc accepts -g... yes
checking for gcc option to enable C11 features... (cached) none needed
checking whether gcc understands -c and -o together... (cached) yes
checking dependency style of gcc... (cached) gcc3
checking how to run the C preprocessor... gcc -E
checking if x86_64-pld-linux-gnux32-gcc supports PIE... yes
checking for openssl... /usr/bin/openssl
checking for clang... /usr/bin/clang
checking for cppcheck... /usr/bin/cppcheck
checking for xmlto... /usr/bin/xmlto
checking for db2pdf... no
checking for db2ps... no
checking for mktemp... /bin/mktemp
checking for library containing clock_gettime... none required
checking for a sed that does not truncate output... (cached) /bin/sed
checking whether ln -s works... yes
checking for cp... /bin/cp
checking for ln... /bin/ln
checking for mv... /bin/mv
checking for touch... /bin/touch
configure: WARNING: db2pdf not installed
configure: WARNING: db2ps not installed
checking for getrandom... yes
checking for secure_getenv... yes
checking whether CC supports -fstack-protector-strong... yes
checking whether to add -D_FORTIFY_SOURCE=2 to CPPFLAGS... no
checking for tail... yes
configure: API version=1.3.0
configure: library version=1.3.0
checking for special C compiler options needed for large files... no
checking for _FILE_OFFSET_BITS value needed for large files... no
checking for off_t... yes
checking for _LARGEFILE_SOURCE value needed for large files... no
checking that generated files are newer than configure... done
configure: creating ./config.status
config.status: creating Makefile
config.status: creating libkcapi.pc
config.status: executing depfiles commands
config.status: executing libtool commands
+ /usr/bin/make -Otarget -j9
Makefile:2024: warning: overriding recipe for target 'lib/doc/bin/docproc'
Makefile:992: warning: ignoring old recipe for target 'lib/doc/bin/docproc'
x86_64-pld-linux-gnux32-gcc -DPACKAGE_NAME=\"libkcapi\" -DPACKAGE_TARNAME=\"libkcapi\" -DPACKAGE_VERSION=\"1.3.0\" -DPACKAGE_STRING=\"libkcapi\ 1.3.0\" -DPACKAGE_BUGREPORT=\"\" -DPACKAGE_URL=\"\" -DKCAPI_MAJVERSION=1 -DKCAPI_MINVERSION=3 -DKCAPI_PATCHLEVEL=0 -DPACKAGE=\"libkcapi\" -DVERSION=\"1.3.0\" -DHAVE_STDIO_H=1 -DHAVE_STDLIB_H=1 -DHAVE_STRING_H=1 -DHAVE_INTTYPES_H=1 -DHAVE_STDINT_H=1 -DHAVE_STRINGS_H=1 -DHAVE_SYS_STAT_H=1 -DHAVE_SYS_TYPES_H=1 -DHAVE_UNISTD_H=1 -DSTDC_HEADERS=1 -DHAVE_DLFCN_H=1 -DLT_OBJDIR=\".libs/\" -DHAVE_GETRANDOM=1 -DHAVE_SECURE_GETENV=1 -DCHECK_PREFIX=\".\" -DCHECK_SUFFIX=\"hmac\" -DHAVE_FSEEKO=1 -I.  -Wextra -Wall -pedantic -fwrapv --param ssp-buffer-size=4 -O2 -Werror -std=gnu99 -Wconversion -I./lib/   -fstack-protector-strong -O2 -fwrapv -pipe -Wformat -Werror=format-security -gdwarf-4 -fno-debug-types-section -fvar-tracking-assignments -g2 -Wp,-D_FORTIFY_SOURCE=2 -fstack-protector-strong --param=ssp-buffer-size=4 -Werror=trampolines -fPIC -mtune=generic -march=x86-64 -gdwarf-4 -fno-debug-types-section -fvar-tracking-assignments -g2  -fpie -fPIE -DPIE -MT apps/bin_kcapi_rng-kcapi-rng.o -MD -MP -MF apps/.deps/bin_kcapi_rng-kcapi-rng.Tpo -c -o apps/bin_kcapi_rng-kcapi-rng.o `test -f 'apps/kcapi-rng.c' || echo './'`apps/kcapi-rng.c
mv -f apps/.deps/bin_kcapi_rng-kcapi-rng.Tpo apps/.deps/bin_kcapi_rng-kcapi-rng.Po
x86_64-pld-linux-gnux32-gcc -DPACKAGE_NAME=\"libkcapi\" -DPACKAGE_TARNAME=\"libkcapi\" -DPACKAGE_VERSION=\"1.3.0\" -DPACKAGE_STRING=\"libkcapi\ 1.3.0\" -DPACKAGE_BUGREPORT=\"\" -DPACKAGE_URL=\"\" -DKCAPI_MAJVERSION=1 -DKCAPI_MINVERSION=3 -DKCAPI_PATCHLEVEL=0 -DPACKAGE=\"libkcapi\" -DVERSION=\"1.3.0\" -DHAVE_STDIO_H=1 -DHAVE_STDLIB_H=1 -DHAVE_STRING_H=1 -DHAVE_INTTYPES_H=1 -DHAVE_STDINT_H=1 -DHAVE_STRINGS_H=1 -DHAVE_SYS_STAT_H=1 -DHAVE_SYS_TYPES_H=1 -DHAVE_UNISTD_H=1 -DSTDC_HEADERS=1 -DHAVE_DLFCN_H=1 -DLT_OBJDIR=\".libs/\" -DHAVE_GETRANDOM=1 -DHAVE_SECURE_GETENV=1 -DCHECK_PREFIX=\".\" -DCHECK_SUFFIX=\"hmac\" -DHAVE_FSEEKO=1 -I.  -Wextra -Wall -pedantic -fwrapv --param ssp-buffer-size=4 -O2 -Werror -std=gnu99 -Wconversion -I./lib/   -fstack-protector-strong -O2 -fwrapv -pipe -Wformat -Werror=format-security -gdwarf-4 -fno-debug-types-section -fvar-tracking-assignments -g2 -Wp,-D_FORTIFY_SOURCE=2 -fstack-protector-strong --param=ssp-buffer-size=4 -Werror=trampolines -fPIC -mtune=generic -march=x86-64 -gdwarf-4 -fno-debug-types-section -fvar-tracking-assignments -g2  -fpie -fPIE -DPIE -MT apps/bin_kcapi_rng-app-internal.o -MD -MP -MF apps/.deps/bin_kcapi_rng-app-internal.Tpo -c -o apps/bin_kcapi_rng-app-internal.o `test -f 'apps/app-internal.c' || echo './'`apps/app-internal.c
mv -f apps/.deps/bin_kcapi_rng-app-internal.Tpo apps/.deps/bin_kcapi_rng-app-internal.Po
x86_64-pld-linux-gnux32-gcc -DPACKAGE_NAME=\"libkcapi\" -DPACKAGE_TARNAME=\"libkcapi\" -DPACKAGE_VERSION=\"1.3.0\" -DPACKAGE_STRING=\"libkcapi\ 1.3.0\" -DPACKAGE_BUGREPORT=\"\" -DPACKAGE_URL=\"\" -DKCAPI_MAJVERSION=1 -DKCAPI_MINVERSION=3 -DKCAPI_PATCHLEVEL=0 -DPACKAGE=\"libkcapi\" -DVERSION=\"1.3.0\" -DHAVE_STDIO_H=1 -DHAVE_STDLIB_H=1 -DHAVE_STRING_H=1 -DHAVE_INTTYPES_H=1 -DHAVE_STDINT_H=1 -DHAVE_STRINGS_H=1 -DHAVE_SYS_STAT_H=1 -DHAVE_SYS_TYPES_H=1 -DHAVE_UNISTD_H=1 -DSTDC_HEADERS=1 -DHAVE_DLFCN_H=1 -DLT_OBJDIR=\".libs/\" -DHAVE_GETRANDOM=1 -DHAVE_SECURE_GETENV=1 -DCHECK_PREFIX=\".\" -DCHECK_SUFFIX=\"hmac\" -DHAVE_FSEEKO=1 -I.  -Wextra -Wall -pedantic -fwrapv --param ssp-buffer-size=4 -O2 -Werror -std=gnu99 -Wconversion -I./lib/   -fstack-protector-strong -O2 -fwrapv -pipe -Wformat -Werror=format-security -gdwarf-4 -fno-debug-types-section -fvar-tracking-assignments -g2 -Wp,-D_FORTIFY_SOURCE=2 -fstack-protector-strong --param=ssp-buffer-size=4 -Werror=trampolines -fPIC -mtune=generic -march=x86-64 -gdwarf-4 -fno-debug-types-section -fvar-tracking-assignments -g2  -fpie -fPIE -DPIE -MT apps/bin_kcapi_enc-app-internal.o -MD -MP -MF apps/.deps/bin_kcapi_enc-app-internal.Tpo -c -o apps/bin_kcapi_enc-app-internal.o `test -f 'apps/app-internal.c' || echo './'`apps/app-internal.c
mv -f apps/.deps/bin_kcapi_enc-app-internal.Tpo apps/.deps/bin_kcapi_enc-app-internal.Po
x86_64-pld-linux-gnux32-gcc -DPACKAGE_NAME=\"libkcapi\" -DPACKAGE_TARNAME=\"libkcapi\" -DPACKAGE_VERSION=\"1.3.0\" -DPACKAGE_STRING=\"libkcapi\ 1.3.0\" -DPACKAGE_BUGREPORT=\"\" -DPACKAGE_URL=\"\" -DKCAPI_MAJVERSION=1 -DKCAPI_MINVERSION=3 -DKCAPI_PATCHLEVEL=0 -DPACKAGE=\"libkcapi\" -DVERSION=\"1.3.0\" -DHAVE_STDIO_H=1 -DHAVE_STDLIB_H=1 -DHAVE_STRING_H=1 -DHAVE_INTTYPES_H=1 -DHAVE_STDINT_H=1 -DHAVE_STRINGS_H=1 -DHAVE_SYS_STAT_H=1 -DHAVE_SYS_TYPES_H=1 -DHAVE_UNISTD_H=1 -DSTDC_HEADERS=1 -DHAVE_DLFCN_H=1 -DLT_OBJDIR=\".libs/\" -DHAVE_GETRANDOM=1 -DHAVE_SECURE_GETENV=1 -DCHECK_PREFIX=\".\" -DCHECK_SUFFIX=\"hmac\" -DHAVE_FSEEKO=1 -I.  -Wextra -Wall -pedantic -fwrapv --param ssp-buffer-size=4 -O2 -Werror -std=gnu99 -Wconversion -I./lib/   -fstack-protector-strong -O2 -fwrapv -pipe -Wformat -Werror=format-security -gdwarf-4 -fno-debug-types-section -fvar-tracking-assignments -g2 -Wp,-D_FORTIFY_SOURCE=2 -fstack-protector-strong --param=ssp-buffer-size=4 -Werror=trampolines -fPIC -mtune=generic -march=x86-64 -gdwarf-4 -fno-debug-types-section -fvar-tracking-assignments -g2  -fpie -fPIE -DPIE -MT apps/bin_kcapi_enc-kcapi-enc.o -MD -MP -MF apps/.deps/bin_kcapi_enc-kcapi-enc.Tpo -c -o apps/bin_kcapi_enc-kcapi-enc.o `test -f 'apps/kcapi-enc.c' || echo './'`apps/kcapi-enc.c
mv -f apps/.deps/bin_kcapi_enc-kcapi-enc.Tpo apps/.deps/bin_kcapi_enc-kcapi-enc.Po
x86_64-pld-linux-gnux32-gcc -DPACKAGE_NAME=\"libkcapi\" -DPACKAGE_TARNAME=\"libkcapi\" -DPACKAGE_VERSION=\"1.3.0\" -DPACKAGE_STRING=\"libkcapi\ 1.3.0\" -DPACKAGE_BUGREPORT=\"\" -DPACKAGE_URL=\"\" -DKCAPI_MAJVERSION=1 -DKCAPI_MINVERSION=3 -DKCAPI_PATCHLEVEL=0 -DPACKAGE=\"libkcapi\" -DVERSION=\"1.3.0\" -DHAVE_STDIO_H=1 -DHAVE_STDLIB_H=1 -DHAVE_STRING_H=1 -DHAVE_INTTYPES_H=1 -DHAVE_STDINT_H=1 -DHAVE_STRINGS_H=1 -DHAVE_SYS_STAT_H=1 -DHAVE_SYS_TYPES_H=1 -DHAVE_UNISTD_H=1 -DSTDC_HEADERS=1 -DHAVE_DLFCN_H=1 -DLT_OBJDIR=\".libs/\" -DHAVE_GETRANDOM=1 -DHAVE_SECURE_GETENV=1 -DCHECK_PREFIX=\".\" -DCHECK_SUFFIX=\"hmac\" -DHAVE_FSEEKO=1 -I.  -Wextra -Wall -pedantic -fwrapv --param ssp-buffer-size=4 -O2 -Werror -std=gnu99 -Wconversion -I./lib/   -fstack-protector-strong -O2 -fwrapv -pipe -Wformat -Werror=format-security -gdwarf-4 -fno-debug-types-section -fvar-tracking-assignments -g2 -Wp,-D_FORTIFY_SOURCE=2 -fstack-protector-strong --param=ssp-buffer-size=4 -Werror=trampolines -fPIC -mtune=generic -march=x86-64 -gdwarf-4 -fno-debug-types-section -fvar-tracking-assignments -g2  -fpie -fPIE -DPIE -MT apps/bin_kcapi_dgst-kcapi-dgst.o -MD -MP -MF apps/.deps/bin_kcapi_dgst-kcapi-dgst.Tpo -c -o apps/bin_kcapi_dgst-kcapi-dgst.o `test -f 'apps/kcapi-dgst.c' || echo './'`apps/kcapi-dgst.c
mv -f apps/.deps/bin_kcapi_dgst-kcapi-dgst.Tpo apps/.deps/bin_kcapi_dgst-kcapi-dgst.Po
x86_64-pld-linux-gnux32-gcc -DPACKAGE_NAME=\"libkcapi\" -DPACKAGE_TARNAME=\"libkcapi\" -DPACKAGE_VERSION=\"1.3.0\" -DPACKAGE_STRING=\"libkcapi\ 1.3.0\" -DPACKAGE_BUGREPORT=\"\" -DPACKAGE_URL=\"\" -DKCAPI_MAJVERSION=1 -DKCAPI_MINVERSION=3 -DKCAPI_PATCHLEVEL=0 -DPACKAGE=\"libkcapi\" -DVERSION=\"1.3.0\" -DHAVE_STDIO_H=1 -DHAVE_STDLIB_H=1 -DHAVE_STRING_H=1 -DHAVE_INTTYPES_H=1 -DHAVE_STDINT_H=1 -DHAVE_STRINGS_H=1 -DHAVE_SYS_STAT_H=1 -DHAVE_SYS_TYPES_H=1 -DHAVE_UNISTD_H=1 -DSTDC_HEADERS=1 -DHAVE_DLFCN_H=1 -DLT_OBJDIR=\".libs/\" -DHAVE_GETRANDOM=1 -DHAVE_SECURE_GETENV=1 -DCHECK_PREFIX=\".\" -DCHECK_SUFFIX=\"hmac\" -DHAVE_FSEEKO=1 -I.  -Wextra -Wall -pedantic -fwrapv --param ssp-buffer-size=4 -O2 -Werror -std=gnu99 -Wconversion -I./lib/   -fstack-protector-strong -O2 -fwrapv -pipe -Wformat -Werror=format-security -gdwarf-4 -fno-debug-types-section -fvar-tracking-assignments -g2 -Wp,-D_FORTIFY_SOURCE=2 -fstack-protector-strong --param=ssp-buffer-size=4 -Werror=trampolines -fPIC -mtune=generic -march=x86-64 -gdwarf-4 -fno-debug-types-section -fvar-tracking-assignments -g2  -fpie -fPIE -DPIE -MT apps/bin_kcapi_dgst-app-internal.o -MD -MP -MF apps/.deps/bin_kcapi_dgst-app-internal.Tpo -c -o apps/bin_kcapi_dgst-app-internal.o `test -f 'apps/app-internal.c' || echo './'`apps/app-internal.c
mv -f apps/.deps/bin_kcapi_dgst-app-internal.Tpo apps/.deps/bin_kcapi_dgst-app-internal.Po
/bin/sh ./libtool  --tag=CC   --mode=compile x86_64-pld-linux-gnux32-gcc -DPACKAGE_NAME=\"libkcapi\" -DPACKAGE_TARNAME=\"libkcapi\" -DPACKAGE_VERSION=\"1.3.0\" -DPACKAGE_STRING=\"libkcapi\ 1.3.0\" -DPACKAGE_BUGREPORT=\"\" -DPACKAGE_URL=\"\" -DKCAPI_MAJVERSION=1 -DKCAPI_MINVERSION=3 -DKCAPI_PATCHLEVEL=0 -DPACKAGE=\"libkcapi\" -DVERSION=\"1.3.0\" -DHAVE_STDIO_H=1 -DHAVE_STDLIB_H=1 -DHAVE_STRING_H=1 -DHAVE_INTTYPES_H=1 -DHAVE_STDINT_H=1 -DHAVE_STRINGS_H=1 -DHAVE_SYS_STAT_H=1 -DHAVE_SYS_TYPES_H=1 -DHAVE_UNISTD_H=1 -DSTDC_HEADERS=1 -DHAVE_DLFCN_H=1 -DLT_OBJDIR=\".libs/\" -DHAVE_GETRANDOM=1 -DHAVE_SECURE_GETENV=1 -DCHECK_PREFIX=\".\" -DCHECK_SUFFIX=\"hmac\" -DHAVE_FSEEKO=1 -I.  -Wextra -Wall -pedantic -fwrapv --param ssp-buffer-size=4 -O2 -Werror -std=gnu99 -Wconversion -fvisibility=hidden   -fstack-protector-strong -O2 -fwrapv -pipe -Wformat -Werror=format-security -gdwarf-4 -fno-debug-types-section -fvar-tracking-assignments -g2 -Wp,-D_FORTIFY_SOURCE=2 -fstack-protector-strong --param=ssp-buffer-size=4 -Werror=trampolines -fPIC -mtune=generic -march=x86-64 -gdwarf-4 -fno-debug-types-section -fvar-tracking-assignments -g2  -fpie -fPIE -DPIE -MT lib/libkcapi_la-kcapi-utils.lo -MD -MP -MF lib/.deps/libkcapi_la-kcapi-utils.Tpo -c -o lib/libkcapi_la-kcapi-utils.lo `test -f 'lib/kcapi-utils.c' || echo './'`lib/kcapi-utils.c
libtool: compile:  x86_64-pld-linux-gnux32-gcc -DPACKAGE_NAME=\"libkcapi\" -DPACKAGE_TARNAME=\"libkcapi\" -DPACKAGE_VERSION=\"1.3.0\" "-DPACKAGE_STRING=\"libkcapi 1.3.0\"" -DPACKAGE_BUGREPORT=\"\" -DPACKAGE_URL=\"\" -DKCAPI_MAJVERSION=1 -DKCAPI_MINVERSION=3 -DKCAPI_PATCHLEVEL=0 -DPACKAGE=\"libkcapi\" -DVERSION=\"1.3.0\" -DHAVE_STDIO_H=1 -DHAVE_STDLIB_H=1 -DHAVE_STRING_H=1 -DHAVE_INTTYPES_H=1 -DHAVE_STDINT_H=1 -DHAVE_STRINGS_H=1 -DHAVE_SYS_STAT_H=1 -DHAVE_SYS_TYPES_H=1 -DHAVE_UNISTD_H=1 -DSTDC_HEADERS=1 -DHAVE_DLFCN_H=1 -DLT_OBJDIR=\".libs/\" -DHAVE_GETRANDOM=1 -DHAVE_SECURE_GETENV=1 -DCHECK_PREFIX=\".\" -DCHECK_SUFFIX=\"hmac\" -DHAVE_FSEEKO=1 -I. -Wextra -Wall -pedantic -fwrapv --param ssp-buffer-size=4 -O2 -Werror -std=gnu99 -Wconversion -fvisibility=hidden -fstack-protector-strong -O2 -fwrapv -pipe -Wformat -Werror=format-security -gdwarf-4 -fno-debug-types-section -fvar-tracking-assignments -g2 -Wp,-D_FORTIFY_SOURCE=2 -fstack-protector-strong --param=ssp-buffer-size=4 -Werror=trampolines -fPIC -mtune=generic -march=x86-64 -gdwarf-4 -fno-debug-types-section -fvar-tracking-assignments -g2 -DPIE -MT lib/libkcapi_la-kcapi-utils.lo -MD -MP -MF lib/.deps/libkcapi_la-kcapi-utils.Tpo -c lib/kcapi-utils.c  -fPIC -DPIC -o lib/.libs/libkcapi_la-kcapi-utils.o
libtool: compile:  x86_64-pld-linux-gnux32-gcc -DPACKAGE_NAME=\"libkcapi\" -DPACKAGE_TARNAME=\"libkcapi\" -DPACKAGE_VERSION=\"1.3.0\" "-DPACKAGE_STRING=\"libkcapi 1.3.0\"" -DPACKAGE_BUGREPORT=\"\" -DPACKAGE_URL=\"\" -DKCAPI_MAJVERSION=1 -DKCAPI_MINVERSION=3 -DKCAPI_PATCHLEVEL=0 -DPACKAGE=\"libkcapi\" -DVERSION=\"1.3.0\" -DHAVE_STDIO_H=1 -DHAVE_STDLIB_H=1 -DHAVE_STRING_H=1 -DHAVE_INTTYPES_H=1 -DHAVE_STDINT_H=1 -DHAVE_STRINGS_H=1 -DHAVE_SYS_STAT_H=1 -DHAVE_SYS_TYPES_H=1 -DHAVE_UNISTD_H=1 -DSTDC_HEADERS=1 -DHAVE_DLFCN_H=1 -DLT_OBJDIR=\".libs/\" -DHAVE_GETRANDOM=1 -DHAVE_SECURE_GETENV=1 -DCHECK_PREFIX=\".\" -DCHECK_SUFFIX=\"hmac\" -DHAVE_FSEEKO=1 -I. -Wextra -Wall -pedantic -fwrapv --param ssp-buffer-size=4 -O2 -Werror -std=gnu99 -Wconversion -fvisibility=hidden -fstack-protector-strong -O2 -fwrapv -pipe -Wformat -Werror=format-security -gdwarf-4 -fno-debug-types-section -fvar-tracking-assignments -g2 -Wp,-D_FORTIFY_SOURCE=2 -fstack-protector-strong --param=ssp-buffer-size=4 -Werror=trampolines -fPIC -mtune=generic -march=x86-64 -gdwarf-4 -fno-debug-types-section -fvar-tracking-assignments -g2 -DPIE -MT lib/libkcapi_la-kcapi-utils.lo -MD -MP -MF lib/.deps/libkcapi_la-kcapi-utils.Tpo -c lib/kcapi-utils.c  -fPIC -DPIC -o lib/libkcapi_la-kcapi-utils.o >/dev/null 2>&1
mv -f lib/.deps/libkcapi_la-kcapi-utils.Tpo lib/.deps/libkcapi_la-kcapi-utils.Plo
/bin/sh ./libtool  --tag=CC   --mode=compile x86_64-pld-linux-gnux32-gcc -DPACKAGE_NAME=\"libkcapi\" -DPACKAGE_TARNAME=\"libkcapi\" -DPACKAGE_VERSION=\"1.3.0\" -DPACKAGE_STRING=\"libkcapi\ 1.3.0\" -DPACKAGE_BUGREPORT=\"\" -DPACKAGE_URL=\"\" -DKCAPI_MAJVERSION=1 -DKCAPI_MINVERSION=3 -DKCAPI_PATCHLEVEL=0 -DPACKAGE=\"libkcapi\" -DVERSION=\"1.3.0\" -DHAVE_STDIO_H=1 -DHAVE_STDLIB_H=1 -DHAVE_STRING_H=1 -DHAVE_INTTYPES_H=1 -DHAVE_STDINT_H=1 -DHAVE_STRINGS_H=1 -DHAVE_SYS_STAT_H=1 -DHAVE_SYS_TYPES_H=1 -DHAVE_UNISTD_H=1 -DSTDC_HEADERS=1 -DHAVE_DLFCN_H=1 -DLT_OBJDIR=\".libs/\" -DHAVE_GETRANDOM=1 -DHAVE_SECURE_GETENV=1 -DCHECK_PREFIX=\".\" -DCHECK_SUFFIX=\"hmac\" -DHAVE_FSEEKO=1 -I.  -Wextra -Wall -pedantic -fwrapv --param ssp-buffer-size=4 -O2 -Werror -std=gnu99 -Wconversion -fvisibility=hidden   -fstack-protector-strong -O2 -fwrapv -pipe -Wformat -Werror=format-security -gdwarf-4 -fno-debug-types-section -fvar-tracking-assignments -g2 -Wp,-D_FORTIFY_SOURCE=2 -fstack-protector-strong --param=ssp-buffer-size=4 -Werror=trampolines -fPIC -mtune=generic -march=x86-64 -gdwarf-4 -fno-debug-types-section -fvar-tracking-assignments -g2  -fpie -fPIE -DPIE -MT lib/libkcapi_la-kcapi-rng.lo -MD -MP -MF lib/.deps/libkcapi_la-kcapi-rng.Tpo -c -o lib/libkcapi_la-kcapi-rng.lo `test -f 'lib/kcapi-rng.c' || echo './'`lib/kcapi-rng.c
libtool: compile:  x86_64-pld-linux-gnux32-gcc -DPACKAGE_NAME=\"libkcapi\" -DPACKAGE_TARNAME=\"libkcapi\" -DPACKAGE_VERSION=\"1.3.0\" "-DPACKAGE_STRING=\"libkcapi 1.3.0\"" -DPACKAGE_BUGREPORT=\"\" -DPACKAGE_URL=\"\" -DKCAPI_MAJVERSION=1 -DKCAPI_MINVERSION=3 -DKCAPI_PATCHLEVEL=0 -DPACKAGE=\"libkcapi\" -DVERSION=\"1.3.0\" -DHAVE_STDIO_H=1 -DHAVE_STDLIB_H=1 -DHAVE_STRING_H=1 -DHAVE_INTTYPES_H=1 -DHAVE_STDINT_H=1 -DHAVE_STRINGS_H=1 -DHAVE_SYS_STAT_H=1 -DHAVE_SYS_TYPES_H=1 -DHAVE_UNISTD_H=1 -DSTDC_HEADERS=1 -DHAVE_DLFCN_H=1 -DLT_OBJDIR=\".libs/\" -DHAVE_GETRANDOM=1 -DHAVE_SECURE_GETENV=1 -DCHECK_PREFIX=\".\" -DCHECK_SUFFIX=\"hmac\" -DHAVE_FSEEKO=1 -I. -Wextra -Wall -pedantic -fwrapv --param ssp-buffer-size=4 -O2 -Werror -std=gnu99 -Wconversion -fvisibility=hidden -fstack-protector-strong -O2 -fwrapv -pipe -Wformat -Werror=format-security -gdwarf-4 -fno-debug-types-section -fvar-tracking-assignments -g2 -Wp,-D_FORTIFY_SOURCE=2 -fstack-protector-strong --param=ssp-buffer-size=4 -Werror=trampolines -fPIC -mtune=generic -march=x86-64 -gdwarf-4 -fno-debug-types-section -fvar-tracking-assignments -g2 -DPIE -MT lib/libkcapi_la-kcapi-rng.lo -MD -MP -MF lib/.deps/libkcapi_la-kcapi-rng.Tpo -c lib/kcapi-rng.c  -fPIC -DPIC -o lib/.libs/libkcapi_la-kcapi-rng.o
libtool: compile:  x86_64-pld-linux-gnux32-gcc -DPACKAGE_NAME=\"libkcapi\" -DPACKAGE_TARNAME=\"libkcapi\" -DPACKAGE_VERSION=\"1.3.0\" "-DPACKAGE_STRING=\"libkcapi 1.3.0\"" -DPACKAGE_BUGREPORT=\"\" -DPACKAGE_URL=\"\" -DKCAPI_MAJVERSION=1 -DKCAPI_MINVERSION=3 -DKCAPI_PATCHLEVEL=0 -DPACKAGE=\"libkcapi\" -DVERSION=\"1.3.0\" -DHAVE_STDIO_H=1 -DHAVE_STDLIB_H=1 -DHAVE_STRING_H=1 -DHAVE_INTTYPES_H=1 -DHAVE_STDINT_H=1 -DHAVE_STRINGS_H=1 -DHAVE_SYS_STAT_H=1 -DHAVE_SYS_TYPES_H=1 -DHAVE_UNISTD_H=1 -DSTDC_HEADERS=1 -DHAVE_DLFCN_H=1 -DLT_OBJDIR=\".libs/\" -DHAVE_GETRANDOM=1 -DHAVE_SECURE_GETENV=1 -DCHECK_PREFIX=\".\" -DCHECK_SUFFIX=\"hmac\" -DHAVE_FSEEKO=1 -I. -Wextra -Wall -pedantic -fwrapv --param ssp-buffer-size=4 -O2 -Werror -std=gnu99 -Wconversion -fvisibility=hidden -fstack-protector-strong -O2 -fwrapv -pipe -Wformat -Werror=format-security -gdwarf-4 -fno-debug-types-section -fvar-tracking-assignments -g2 -Wp,-D_FORTIFY_SOURCE=2 -fstack-protector-strong --param=ssp-buffer-size=4 -Werror=trampolines -fPIC -mtune=generic -march=x86-64 -gdwarf-4 -fno-debug-types-section -fvar-tracking-assignments -g2 -DPIE -MT lib/libkcapi_la-kcapi-rng.lo -MD -MP -MF lib/.deps/libkcapi_la-kcapi-rng.Tpo -c lib/kcapi-rng.c  -fPIC -DPIC -o lib/libkcapi_la-kcapi-rng.o >/dev/null 2>&1
mv -f lib/.deps/libkcapi_la-kcapi-rng.Tpo lib/.deps/libkcapi_la-kcapi-rng.Plo
depbase=`echo lib/doc/bin/docproc.o | sed 's|[^/]*$|.deps/&|;s|\.o$||'`;\
gcc -DPACKAGE_NAME=\"libkcapi\" -DPACKAGE_TARNAME=\"libkcapi\" -DPACKAGE_VERSION=\"1.3.0\" -DPACKAGE_STRING=\"libkcapi\ 1.3.0\" -DPACKAGE_BUGREPORT=\"\" -DPACKAGE_URL=\"\" -DKCAPI_MAJVERSION=1 -DKCAPI_MINVERSION=3 -DKCAPI_PATCHLEVEL=0 -DPACKAGE=\"libkcapi\" -DVERSION=\"1.3.0\" -DHAVE_STDIO_H=1 -DHAVE_STDLIB_H=1 -DHAVE_STRING_H=1 -DHAVE_INTTYPES_H=1 -DHAVE_STDINT_H=1 -DHAVE_STRINGS_H=1 -DHAVE_SYS_STAT_H=1 -DHAVE_SYS_TYPES_H=1 -DHAVE_UNISTD_H=1 -DSTDC_HEADERS=1 -DHAVE_DLFCN_H=1 -DLT_OBJDIR=\".libs/\" -DHAVE_GETRANDOM=1 -DHAVE_SECURE_GETENV=1 -DCHECK_PREFIX=\".\" -DCHECK_SUFFIX=\"hmac\" -DHAVE_FSEEKO=1 -I.   -Wextra -Wall -pedantic -fwrapv --param ssp-buffer-size=4 -O2 -Werror -std=gnu99 -Wconversion   -g -O2 -MT lib/doc/bin/docproc.o -MD -MP -MF $depbase.Tpo -c -o lib/doc/bin/docproc.o lib/doc/bin/docproc.c &&\
mv -f $depbase.Tpo $depbase.Po
lib/doc/bin/docproc.c: In function 'find_all_symbols':
lib/doc/bin/docproc.c:433:17: error: conversion to 'ssize_t' {aka 'int'} from 'unsigned int' may change the sign of the result [-Werror=sign-conversion]
  433 |         start = all_list_len;
      |                 ^~~~~~~~~~~~
lib/doc/bin/docproc.c:441:48: error: comparison of integer expressions of different signedness: 'ssize_t' {aka 'int'} and 'unsigned int' [-Werror=sign-compare]
  441 |         for (i = 0; i < (int)data_len && start != all_list_len; i++) {
      |                                                ^~
cc1: all warnings being treated as errors
make: *** [Makefile:1077: lib/doc/bin/docproc.o] Error 1
make: *** Waiting for unfinished jobs....
/bin/sh ./libtool  --tag=CC   --mode=compile x86_64-pld-linux-gnux32-gcc -DPACKAGE_NAME=\"libkcapi\" -DPACKAGE_TARNAME=\"libkcapi\" -DPACKAGE_VERSION=\"1.3.0\" -DPACKAGE_STRING=\"libkcapi\ 1.3.0\" -DPACKAGE_BUGREPORT=\"\" -DPACKAGE_URL=\"\" -DKCAPI_MAJVERSION=1 -DKCAPI_MINVERSION=3 -DKCAPI_PATCHLEVEL=0 -DPACKAGE=\"libkcapi\" -DVERSION=\"1.3.0\" -DHAVE_STDIO_H=1 -DHAVE_STDLIB_H=1 -DHAVE_STRING_H=1 -DHAVE_INTTYPES_H=1 -DHAVE_STDINT_H=1 -DHAVE_STRINGS_H=1 -DHAVE_SYS_STAT_H=1 -DHAVE_SYS_TYPES_H=1 -DHAVE_UNISTD_H=1 -DSTDC_HEADERS=1 -DHAVE_DLFCN_H=1 -DLT_OBJDIR=\".libs/\" -DHAVE_GETRANDOM=1 -DHAVE_SECURE_GETENV=1 -DCHECK_PREFIX=\".\" -DCHECK_SUFFIX=\"hmac\" -DHAVE_FSEEKO=1 -I.  -Wextra -Wall -pedantic -fwrapv --param ssp-buffer-size=4 -O2 -Werror -std=gnu99 -Wconversion -fvisibility=hidden   -fstack-protector-strong -O2 -fwrapv -pipe -Wformat -Werror=format-security -gdwarf-4 -fno-debug-types-section -fvar-tracking-assignments -g2 -Wp,-D_FORTIFY_SOURCE=2 -fstack-protector-strong --param=ssp-buffer-size=4 -Werror=trampolines -fPIC -mtune=generic -march=x86-64 -gdwarf-4 -fno-debug-types-section -fvar-tracking-assignments -g2  -fpie -fPIE -DPIE -MT lib/libkcapi_la-kcapi-md.lo -MD -MP -MF lib/.deps/libkcapi_la-kcapi-md.Tpo -c -o lib/libkcapi_la-kcapi-md.lo `test -f 'lib/kcapi-md.c' || echo './'`lib/kcapi-md.c
libtool: compile:  x86_64-pld-linux-gnux32-gcc -DPACKAGE_NAME=\"libkcapi\" -DPACKAGE_TARNAME=\"libkcapi\" -DPACKAGE_VERSION=\"1.3.0\" "-DPACKAGE_STRING=\"libkcapi 1.3.0\"" -DPACKAGE_BUGREPORT=\"\" -DPACKAGE_URL=\"\" -DKCAPI_MAJVERSION=1 -DKCAPI_MINVERSION=3 -DKCAPI_PATCHLEVEL=0 -DPACKAGE=\"libkcapi\" -DVERSION=\"1.3.0\" -DHAVE_STDIO_H=1 -DHAVE_STDLIB_H=1 -DHAVE_STRING_H=1 -DHAVE_INTTYPES_H=1 -DHAVE_STDINT_H=1 -DHAVE_STRINGS_H=1 -DHAVE_SYS_STAT_H=1 -DHAVE_SYS_TYPES_H=1 -DHAVE_UNISTD_H=1 -DSTDC_HEADERS=1 -DHAVE_DLFCN_H=1 -DLT_OBJDIR=\".libs/\" -DHAVE_GETRANDOM=1 -DHAVE_SECURE_GETENV=1 -DCHECK_PREFIX=\".\" -DCHECK_SUFFIX=\"hmac\" -DHAVE_FSEEKO=1 -I. -Wextra -Wall -pedantic -fwrapv --param ssp-buffer-size=4 -O2 -Werror -std=gnu99 -Wconversion -fvisibility=hidden -fstack-protector-strong -O2 -fwrapv -pipe -Wformat -Werror=format-security -gdwarf-4 -fno-debug-types-section -fvar-tracking-assignments -g2 -Wp,-D_FORTIFY_SOURCE=2 -fstack-protector-strong --param=ssp-buffer-size=4 -Werror=trampolines -fPIC -mtune=generic -march=x86-64 -gdwarf-4 -fno-debug-types-section -fvar-tracking-assignments -g2 -DPIE -MT lib/libkcapi_la-kcapi-md.lo -MD -MP -MF lib/.deps/libkcapi_la-kcapi-md.Tpo -c lib/kcapi-md.c  -fPIC -DPIC -o lib/.libs/libkcapi_la-kcapi-md.o
libtool: compile:  x86_64-pld-linux-gnux32-gcc -DPACKAGE_NAME=\"libkcapi\" -DPACKAGE_TARNAME=\"libkcapi\" -DPACKAGE_VERSION=\"1.3.0\" "-DPACKAGE_STRING=\"libkcapi 1.3.0\"" -DPACKAGE_BUGREPORT=\"\" -DPACKAGE_URL=\"\" -DKCAPI_MAJVERSION=1 -DKCAPI_MINVERSION=3 -DKCAPI_PATCHLEVEL=0 -DPACKAGE=\"libkcapi\" -DVERSION=\"1.3.0\" -DHAVE_STDIO_H=1 -DHAVE_STDLIB_H=1 -DHAVE_STRING_H=1 -DHAVE_INTTYPES_H=1 -DHAVE_STDINT_H=1 -DHAVE_STRINGS_H=1 -DHAVE_SYS_STAT_H=1 -DHAVE_SYS_TYPES_H=1 -DHAVE_UNISTD_H=1 -DSTDC_HEADERS=1 -DHAVE_DLFCN_H=1 -DLT_OBJDIR=\".libs/\" -DHAVE_GETRANDOM=1 -DHAVE_SECURE_GETENV=1 -DCHECK_PREFIX=\".\" -DCHECK_SUFFIX=\"hmac\" -DHAVE_FSEEKO=1 -I. -Wextra -Wall -pedantic -fwrapv --param ssp-buffer-size=4 -O2 -Werror -std=gnu99 -Wconversion -fvisibility=hidden -fstack-protector-strong -O2 -fwrapv -pipe -Wformat -Werror=format-security -gdwarf-4 -fno-debug-types-section -fvar-tracking-assignments -g2 -Wp,-D_FORTIFY_SOURCE=2 -fstack-protector-strong --param=ssp-buffer-size=4 -Werror=trampolines -fPIC -mtune=generic -march=x86-64 -gdwarf-4 -fno-debug-types-section -fvar-tracking-assignments -g2 -DPIE -MT lib/libkcapi_la-kcapi-md.lo -MD -MP -MF lib/.deps/libkcapi_la-kcapi-md.Tpo -c lib/kcapi-md.c  -fPIC -DPIC -o lib/libkcapi_la-kcapi-md.o >/dev/null 2>&1
mv -f lib/.deps/libkcapi_la-kcapi-md.Tpo lib/.deps/libkcapi_la-kcapi-md.Plo
/bin/sh ./libtool  --tag=CC   --mode=compile x86_64-pld-linux-gnux32-gcc -DPACKAGE_NAME=\"libkcapi\" -DPACKAGE_TARNAME=\"libkcapi\" -DPACKAGE_VERSION=\"1.3.0\" -DPACKAGE_STRING=\"libkcapi\ 1.3.0\" -DPACKAGE_BUGREPORT=\"\" -DPACKAGE_URL=\"\" -DKCAPI_MAJVERSION=1 -DKCAPI_MINVERSION=3 -DKCAPI_PATCHLEVEL=0 -DPACKAGE=\"libkcapi\" -DVERSION=\"1.3.0\" -DHAVE_STDIO_H=1 -DHAVE_STDLIB_H=1 -DHAVE_STRING_H=1 -DHAVE_INTTYPES_H=1 -DHAVE_STDINT_H=1 -DHAVE_STRINGS_H=1 -DHAVE_SYS_STAT_H=1 -DHAVE_SYS_TYPES_H=1 -DHAVE_UNISTD_H=1 -DSTDC_HEADERS=1 -DHAVE_DLFCN_H=1 -DLT_OBJDIR=\".libs/\" -DHAVE_GETRANDOM=1 -DHAVE_SECURE_GETENV=1 -DCHECK_PREFIX=\".\" -DCHECK_SUFFIX=\"hmac\" -DHAVE_FSEEKO=1 -I.  -Wextra -Wall -pedantic -fwrapv --param ssp-buffer-size=4 -O2 -Werror -std=gnu99 -Wconversion -fvisibility=hidden   -fstack-protector-strong -O2 -fwrapv -pipe -Wformat -Werror=format-security -gdwarf-4 -fno-debug-types-section -fvar-tracking-assignments -g2 -Wp,-D_FORTIFY_SOURCE=2 -fstack-protector-strong --param=ssp-buffer-size=4 -Werror=trampolines -fPIC -mtune=generic -march=x86-64 -gdwarf-4 -fno-debug-types-section -fvar-tracking-assignments -g2  -fpie -fPIE -DPIE -MT lib/libkcapi_la-kcapi-sym.lo -MD -MP -MF lib/.deps/libkcapi_la-kcapi-sym.Tpo -c -o lib/libkcapi_la-kcapi-sym.lo `test -f 'lib/kcapi-sym.c' || echo './'`lib/kcapi-sym.c
libtool: compile:  x86_64-pld-linux-gnux32-gcc -DPACKAGE_NAME=\"libkcapi\" -DPACKAGE_TARNAME=\"libkcapi\" -DPACKAGE_VERSION=\"1.3.0\" "-DPACKAGE_STRING=\"libkcapi 1.3.0\"" -DPACKAGE_BUGREPORT=\"\" -DPACKAGE_URL=\"\" -DKCAPI_MAJVERSION=1 -DKCAPI_MINVERSION=3 -DKCAPI_PATCHLEVEL=0 -DPACKAGE=\"libkcapi\" -DVERSION=\"1.3.0\" -DHAVE_STDIO_H=1 -DHAVE_STDLIB_H=1 -DHAVE_STRING_H=1 -DHAVE_INTTYPES_H=1 -DHAVE_STDINT_H=1 -DHAVE_STRINGS_H=1 -DHAVE_SYS_STAT_H=1 -DHAVE_SYS_TYPES_H=1 -DHAVE_UNISTD_H=1 -DSTDC_HEADERS=1 -DHAVE_DLFCN_H=1 -DLT_OBJDIR=\".libs/\" -DHAVE_GETRANDOM=1 -DHAVE_SECURE_GETENV=1 -DCHECK_PREFIX=\".\" -DCHECK_SUFFIX=\"hmac\" -DHAVE_FSEEKO=1 -I. -Wextra -Wall -pedantic -fwrapv --param ssp-buffer-size=4 -O2 -Werror -std=gnu99 -Wconversion -fvisibility=hidden -fstack-protector-strong -O2 -fwrapv -pipe -Wformat -Werror=format-security -gdwarf-4 -fno-debug-types-section -fvar-tracking-assignments -g2 -Wp,-D_FORTIFY_SOURCE=2 -fstack-protector-strong --param=ssp-buffer-size=4 -Werror=trampolines -fPIC -mtune=generic -march=x86-64 -gdwarf-4 -fno-debug-types-section -fvar-tracking-assignments -g2 -DPIE -MT lib/libkcapi_la-kcapi-sym.lo -MD -MP -MF lib/.deps/libkcapi_la-kcapi-sym.Tpo -c lib/kcapi-sym.c  -fPIC -DPIC -o lib/.libs/libkcapi_la-kcapi-sym.o
libtool: compile:  x86_64-pld-linux-gnux32-gcc -DPACKAGE_NAME=\"libkcapi\" -DPACKAGE_TARNAME=\"libkcapi\" -DPACKAGE_VERSION=\"1.3.0\" "-DPACKAGE_STRING=\"libkcapi 1.3.0\"" -DPACKAGE_BUGREPORT=\"\" -DPACKAGE_URL=\"\" -DKCAPI_MAJVERSION=1 -DKCAPI_MINVERSION=3 -DKCAPI_PATCHLEVEL=0 -DPACKAGE=\"libkcapi\" -DVERSION=\"1.3.0\" -DHAVE_STDIO_H=1 -DHAVE_STDLIB_H=1 -DHAVE_STRING_H=1 -DHAVE_INTTYPES_H=1 -DHAVE_STDINT_H=1 -DHAVE_STRINGS_H=1 -DHAVE_SYS_STAT_H=1 -DHAVE_SYS_TYPES_H=1 -DHAVE_UNISTD_H=1 -DSTDC_HEADERS=1 -DHAVE_DLFCN_H=1 -DLT_OBJDIR=\".libs/\" -DHAVE_GETRANDOM=1 -DHAVE_SECURE_GETENV=1 -DCHECK_PREFIX=\".\" -DCHECK_SUFFIX=\"hmac\" -DHAVE_FSEEKO=1 -I. -Wextra -Wall -pedantic -fwrapv --param ssp-buffer-size=4 -O2 -Werror -std=gnu99 -Wconversion -fvisibility=hidden -fstack-protector-strong -O2 -fwrapv -pipe -Wformat -Werror=format-security -gdwarf-4 -fno-debug-types-section -fvar-tracking-assignments -g2 -Wp,-D_FORTIFY_SOURCE=2 -fstack-protector-strong --param=ssp-buffer-size=4 -Werror=trampolines -fPIC -mtune=generic -march=x86-64 -gdwarf-4 -fno-debug-types-section -fvar-tracking-assignments -g2 -DPIE -MT lib/libkcapi_la-kcapi-sym.lo -MD -MP -MF lib/.deps/libkcapi_la-kcapi-sym.Tpo -c lib/kcapi-sym.c  -fPIC -DPIC -o lib/libkcapi_la-kcapi-sym.o >/dev/null 2>&1
mv -f lib/.deps/libkcapi_la-kcapi-sym.Tpo lib/.deps/libkcapi_la-kcapi-sym.Plo
/bin/sh ./libtool  --tag=CC   --mode=compile x86_64-pld-linux-gnux32-gcc -DPACKAGE_NAME=\"libkcapi\" -DPACKAGE_TARNAME=\"libkcapi\" -DPACKAGE_VERSION=\"1.3.0\" -DPACKAGE_STRING=\"libkcapi\ 1.3.0\" -DPACKAGE_BUGREPORT=\"\" -DPACKAGE_URL=\"\" -DKCAPI_MAJVERSION=1 -DKCAPI_MINVERSION=3 -DKCAPI_PATCHLEVEL=0 -DPACKAGE=\"libkcapi\" -DVERSION=\"1.3.0\" -DHAVE_STDIO_H=1 -DHAVE_STDLIB_H=1 -DHAVE_STRING_H=1 -DHAVE_INTTYPES_H=1 -DHAVE_STDINT_H=1 -DHAVE_STRINGS_H=1 -DHAVE_SYS_STAT_H=1 -DHAVE_SYS_TYPES_H=1 -DHAVE_UNISTD_H=1 -DSTDC_HEADERS=1 -DHAVE_DLFCN_H=1 -DLT_OBJDIR=\".libs/\" -DHAVE_GETRANDOM=1 -DHAVE_SECURE_GETENV=1 -DCHECK_PREFIX=\".\" -DCHECK_SUFFIX=\"hmac\" -DHAVE_FSEEKO=1 -I.  -Wextra -Wall -pedantic -fwrapv --param ssp-buffer-size=4 -O2 -Werror -std=gnu99 -Wconversion -fvisibility=hidden   -fstack-protector-strong -O2 -fwrapv -pipe -Wformat -Werror=format-security -gdwarf-4 -fno-debug-types-section -fvar-tracking-assignments -g2 -Wp,-D_FORTIFY_SOURCE=2 -fstack-protector-strong --param=ssp-buffer-size=4 -Werror=trampolines -fPIC -mtune=generic -march=x86-64 -gdwarf-4 -fno-debug-types-section -fvar-tracking-assignments -g2  -fpie -fPIE -DPIE -MT lib/libkcapi_la-kcapi-aead.lo -MD -MP -MF lib/.deps/libkcapi_la-kcapi-aead.Tpo -c -o lib/libkcapi_la-kcapi-aead.lo `test -f 'lib/kcapi-aead.c' || echo './'`lib/kcapi-aead.c
libtool: compile:  x86_64-pld-linux-gnux32-gcc -DPACKAGE_NAME=\"libkcapi\" -DPACKAGE_TARNAME=\"libkcapi\" -DPACKAGE_VERSION=\"1.3.0\" "-DPACKAGE_STRING=\"libkcapi 1.3.0\"" -DPACKAGE_BUGREPORT=\"\" -DPACKAGE_URL=\"\" -DKCAPI_MAJVERSION=1 -DKCAPI_MINVERSION=3 -DKCAPI_PATCHLEVEL=0 -DPACKAGE=\"libkcapi\" -DVERSION=\"1.3.0\" -DHAVE_STDIO_H=1 -DHAVE_STDLIB_H=1 -DHAVE_STRING_H=1 -DHAVE_INTTYPES_H=1 -DHAVE_STDINT_H=1 -DHAVE_STRINGS_H=1 -DHAVE_SYS_STAT_H=1 -DHAVE_SYS_TYPES_H=1 -DHAVE_UNISTD_H=1 -DSTDC_HEADERS=1 -DHAVE_DLFCN_H=1 -DLT_OBJDIR=\".libs/\" -DHAVE_GETRANDOM=1 -DHAVE_SECURE_GETENV=1 -DCHECK_PREFIX=\".\" -DCHECK_SUFFIX=\"hmac\" -DHAVE_FSEEKO=1 -I. -Wextra -Wall -pedantic -fwrapv --param ssp-buffer-size=4 -O2 -Werror -std=gnu99 -Wconversion -fvisibility=hidden -fstack-protector-strong -O2 -fwrapv -pipe -Wformat -Werror=format-security -gdwarf-4 -fno-debug-types-section -fvar-tracking-assignments -g2 -Wp,-D_FORTIFY_SOURCE=2 -fstack-protector-strong --param=ssp-buffer-size=4 -Werror=trampolines -fPIC -mtune=generic -march=x86-64 -gdwarf-4 -fno-debug-types-section -fvar-tracking-assignments -g2 -DPIE -MT lib/libkcapi_la-kcapi-aead.lo -MD -MP -MF lib/.deps/libkcapi_la-kcapi-aead.Tpo -c lib/kcapi-aead.c  -fPIC -DPIC -o lib/.libs/libkcapi_la-kcapi-aead.o
libtool: compile:  x86_64-pld-linux-gnux32-gcc -DPACKAGE_NAME=\"libkcapi\" -DPACKAGE_TARNAME=\"libkcapi\" -DPACKAGE_VERSION=\"1.3.0\" "-DPACKAGE_STRING=\"libkcapi 1.3.0\"" -DPACKAGE_BUGREPORT=\"\" -DPACKAGE_URL=\"\" -DKCAPI_MAJVERSION=1 -DKCAPI_MINVERSION=3 -DKCAPI_PATCHLEVEL=0 -DPACKAGE=\"libkcapi\" -DVERSION=\"1.3.0\" -DHAVE_STDIO_H=1 -DHAVE_STDLIB_H=1 -DHAVE_STRING_H=1 -DHAVE_INTTYPES_H=1 -DHAVE_STDINT_H=1 -DHAVE_STRINGS_H=1 -DHAVE_SYS_STAT_H=1 -DHAVE_SYS_TYPES_H=1 -DHAVE_UNISTD_H=1 -DSTDC_HEADERS=1 -DHAVE_DLFCN_H=1 -DLT_OBJDIR=\".libs/\" -DHAVE_GETRANDOM=1 -DHAVE_SECURE_GETENV=1 -DCHECK_PREFIX=\".\" -DCHECK_SUFFIX=\"hmac\" -DHAVE_FSEEKO=1 -I. -Wextra -Wall -pedantic -fwrapv --param ssp-buffer-size=4 -O2 -Werror -std=gnu99 -Wconversion -fvisibility=hidden -fstack-protector-strong -O2 -fwrapv -pipe -Wformat -Werror=format-security -gdwarf-4 -fno-debug-types-section -fvar-tracking-assignments -g2 -Wp,-D_FORTIFY_SOURCE=2 -fstack-protector-strong --param=ssp-buffer-size=4 -Werror=trampolines -fPIC -mtune=generic -march=x86-64 -gdwarf-4 -fno-debug-types-section -fvar-tracking-assignments -g2 -DPIE -MT lib/libkcapi_la-kcapi-aead.lo -MD -MP -MF lib/.deps/libkcapi_la-kcapi-aead.Tpo -c lib/kcapi-aead.c  -fPIC -DPIC -o lib/libkcapi_la-kcapi-aead.o >/dev/null 2>&1
mv -f lib/.deps/libkcapi_la-kcapi-aead.Tpo lib/.deps/libkcapi_la-kcapi-aead.Plo
/bin/sh ./libtool  --tag=CC   --mode=compile x86_64-pld-linux-gnux32-gcc -DPACKAGE_NAME=\"libkcapi\" -DPACKAGE_TARNAME=\"libkcapi\" -DPACKAGE_VERSION=\"1.3.0\" -DPACKAGE_STRING=\"libkcapi\ 1.3.0\" -DPACKAGE_BUGREPORT=\"\" -DPACKAGE_URL=\"\" -DKCAPI_MAJVERSION=1 -DKCAPI_MINVERSION=3 -DKCAPI_PATCHLEVEL=0 -DPACKAGE=\"libkcapi\" -DVERSION=\"1.3.0\" -DHAVE_STDIO_H=1 -DHAVE_STDLIB_H=1 -DHAVE_STRING_H=1 -DHAVE_INTTYPES_H=1 -DHAVE_STDINT_H=1 -DHAVE_STRINGS_H=1 -DHAVE_SYS_STAT_H=1 -DHAVE_SYS_TYPES_H=1 -DHAVE_UNISTD_H=1 -DSTDC_HEADERS=1 -DHAVE_DLFCN_H=1 -DLT_OBJDIR=\".libs/\" -DHAVE_GETRANDOM=1 -DHAVE_SECURE_GETENV=1 -DCHECK_PREFIX=\".\" -DCHECK_SUFFIX=\"hmac\" -DHAVE_FSEEKO=1 -I.  -Wextra -Wall -pedantic -fwrapv --param ssp-buffer-size=4 -O2 -Werror -std=gnu99 -Wconversion -fvisibility=hidden   -fstack-protector-strong -O2 -fwrapv -pipe -Wformat -Werror=format-security -gdwarf-4 -fno-debug-types-section -fvar-tracking-assignments -g2 -Wp,-D_FORTIFY_SOURCE=2 -fstack-protector-strong --param=ssp-buffer-size=4 -Werror=trampolines -fPIC -mtune=generic -march=x86-64 -gdwarf-4 -fno-debug-types-section -fvar-tracking-assignments -g2  -fpie -fPIE -DPIE -MT lib/libkcapi_la-kcapi-kdf.lo -MD -MP -MF lib/.deps/libkcapi_la-kcapi-kdf.Tpo -c -o lib/libkcapi_la-kcapi-kdf.lo `test -f 'lib/kcapi-kdf.c' || echo './'`lib/kcapi-kdf.c
libtool: compile:  x86_64-pld-linux-gnux32-gcc -DPACKAGE_NAME=\"libkcapi\" -DPACKAGE_TARNAME=\"libkcapi\" -DPACKAGE_VERSION=\"1.3.0\" "-DPACKAGE_STRING=\"libkcapi 1.3.0\"" -DPACKAGE_BUGREPORT=\"\" -DPACKAGE_URL=\"\" -DKCAPI_MAJVERSION=1 -DKCAPI_MINVERSION=3 -DKCAPI_PATCHLEVEL=0 -DPACKAGE=\"libkcapi\" -DVERSION=\"1.3.0\" -DHAVE_STDIO_H=1 -DHAVE_STDLIB_H=1 -DHAVE_STRING_H=1 -DHAVE_INTTYPES_H=1 -DHAVE_STDINT_H=1 -DHAVE_STRINGS_H=1 -DHAVE_SYS_STAT_H=1 -DHAVE_SYS_TYPES_H=1 -DHAVE_UNISTD_H=1 -DSTDC_HEADERS=1 -DHAVE_DLFCN_H=1 -DLT_OBJDIR=\".libs/\" -DHAVE_GETRANDOM=1 -DHAVE_SECURE_GETENV=1 -DCHECK_PREFIX=\".\" -DCHECK_SUFFIX=\"hmac\" -DHAVE_FSEEKO=1 -I. -Wextra -Wall -pedantic -fwrapv --param ssp-buffer-size=4 -O2 -Werror -std=gnu99 -Wconversion -fvisibility=hidden -fstack-protector-strong -O2 -fwrapv -pipe -Wformat -Werror=format-security -gdwarf-4 -fno-debug-types-section -fvar-tracking-assignments -g2 -Wp,-D_FORTIFY_SOURCE=2 -fstack-protector-strong --param=ssp-buffer-size=4 -Werror=trampolines -fPIC -mtune=generic -march=x86-64 -gdwarf-4 -fno-debug-types-section -fvar-tracking-assignments -g2 -DPIE -MT lib/libkcapi_la-kcapi-kdf.lo -MD -MP -MF lib/.deps/libkcapi_la-kcapi-kdf.Tpo -c lib/kcapi-kdf.c  -fPIC -DPIC -o lib/.libs/libkcapi_la-kcapi-kdf.o
libtool: compile:  x86_64-pld-linux-gnux32-gcc -DPACKAGE_NAME=\"libkcapi\" -DPACKAGE_TARNAME=\"libkcapi\" -DPACKAGE_VERSION=\"1.3.0\" "-DPACKAGE_STRING=\"libkcapi 1.3.0\"" -DPACKAGE_BUGREPORT=\"\" -DPACKAGE_URL=\"\" -DKCAPI_MAJVERSION=1 -DKCAPI_MINVERSION=3 -DKCAPI_PATCHLEVEL=0 -DPACKAGE=\"libkcapi\" -DVERSION=\"1.3.0\" -DHAVE_STDIO_H=1 -DHAVE_STDLIB_H=1 -DHAVE_STRING_H=1 -DHAVE_INTTYPES_H=1 -DHAVE_STDINT_H=1 -DHAVE_STRINGS_H=1 -DHAVE_SYS_STAT_H=1 -DHAVE_SYS_TYPES_H=1 -DHAVE_UNISTD_H=1 -DSTDC_HEADERS=1 -DHAVE_DLFCN_H=1 -DLT_OBJDIR=\".libs/\" -DHAVE_GETRANDOM=1 -DHAVE_SECURE_GETENV=1 -DCHECK_PREFIX=\".\" -DCHECK_SUFFIX=\"hmac\" -DHAVE_FSEEKO=1 -I. -Wextra -Wall -pedantic -fwrapv --param ssp-buffer-size=4 -O2 -Werror -std=gnu99 -Wconversion -fvisibility=hidden -fstack-protector-strong -O2 -fwrapv -pipe -Wformat -Werror=format-security -gdwarf-4 -fno-debug-types-section -fvar-tracking-assignments -g2 -Wp,-D_FORTIFY_SOURCE=2 -fstack-protector-strong --param=ssp-buffer-size=4 -Werror=trampolines -fPIC -mtune=generic -march=x86-64 -gdwarf-4 -fno-debug-types-section -fvar-tracking-assignments -g2 -DPIE -MT lib/libkcapi_la-kcapi-kdf.lo -MD -MP -MF lib/.deps/libkcapi_la-kcapi-kdf.Tpo -c lib/kcapi-kdf.c  -fPIC -DPIC -o lib/libkcapi_la-kcapi-kdf.o >/dev/null 2>&1
mv -f lib/.deps/libkcapi_la-kcapi-kdf.Tpo lib/.deps/libkcapi_la-kcapi-kdf.Plo
/bin/sh ./libtool  --tag=CC   --mode=compile x86_64-pld-linux-gnux32-gcc -DPACKAGE_NAME=\"libkcapi\" -DPACKAGE_TARNAME=\"libkcapi\" -DPACKAGE_VERSION=\"1.3.0\" -DPACKAGE_STRING=\"libkcapi\ 1.3.0\" -DPACKAGE_BUGREPORT=\"\" -DPACKAGE_URL=\"\" -DKCAPI_MAJVERSION=1 -DKCAPI_MINVERSION=3 -DKCAPI_PATCHLEVEL=0 -DPACKAGE=\"libkcapi\" -DVERSION=\"1.3.0\" -DHAVE_STDIO_H=1 -DHAVE_STDLIB_H=1 -DHAVE_STRING_H=1 -DHAVE_INTTYPES_H=1 -DHAVE_STDINT_H=1 -DHAVE_STRINGS_H=1 -DHAVE_SYS_STAT_H=1 -DHAVE_SYS_TYPES_H=1 -DHAVE_UNISTD_H=1 -DSTDC_HEADERS=1 -DHAVE_DLFCN_H=1 -DLT_OBJDIR=\".libs/\" -DHAVE_GETRANDOM=1 -DHAVE_SECURE_GETENV=1 -DCHECK_PREFIX=\".\" -DCHECK_SUFFIX=\"hmac\" -DHAVE_FSEEKO=1 -I.  -Wextra -Wall -pedantic -fwrapv --param ssp-buffer-size=4 -O2 -Werror -std=gnu99 -Wconversion -fvisibility=hidden   -fstack-protector-strong -O2 -fwrapv -pipe -Wformat -Werror=format-security -gdwarf-4 -fno-debug-types-section -fvar-tracking-assignments -g2 -Wp,-D_FORTIFY_SOURCE=2 -fstack-protector-strong --param=ssp-buffer-size=4 -Werror=trampolines -fPIC -mtune=generic -march=x86-64 -gdwarf-4 -fno-debug-types-section -fvar-tracking-assignments -g2  -fpie -fPIE -DPIE -MT lib/libkcapi_la-kcapi-kernel-if.lo -MD -MP -MF lib/.deps/libkcapi_la-kcapi-kernel-if.Tpo -c -o lib/libkcapi_la-kcapi-kernel-if.lo `test -f 'lib/kcapi-kernel-if.c' || echo './'`lib/kcapi-kernel-if.c
libtool: compile:  x86_64-pld-linux-gnux32-gcc -DPACKAGE_NAME=\"libkcapi\" -DPACKAGE_TARNAME=\"libkcapi\" -DPACKAGE_VERSION=\"1.3.0\" "-DPACKAGE_STRING=\"libkcapi 1.3.0\"" -DPACKAGE_BUGREPORT=\"\" -DPACKAGE_URL=\"\" -DKCAPI_MAJVERSION=1 -DKCAPI_MINVERSION=3 -DKCAPI_PATCHLEVEL=0 -DPACKAGE=\"libkcapi\" -DVERSION=\"1.3.0\" -DHAVE_STDIO_H=1 -DHAVE_STDLIB_H=1 -DHAVE_STRING_H=1 -DHAVE_INTTYPES_H=1 -DHAVE_STDINT_H=1 -DHAVE_STRINGS_H=1 -DHAVE_SYS_STAT_H=1 -DHAVE_SYS_TYPES_H=1 -DHAVE_UNISTD_H=1 -DSTDC_HEADERS=1 -DHAVE_DLFCN_H=1 -DLT_OBJDIR=\".libs/\" -DHAVE_GETRANDOM=1 -DHAVE_SECURE_GETENV=1 -DCHECK_PREFIX=\".\" -DCHECK_SUFFIX=\"hmac\" -DHAVE_FSEEKO=1 -I. -Wextra -Wall -pedantic -fwrapv --param ssp-buffer-size=4 -O2 -Werror -std=gnu99 -Wconversion -fvisibility=hidden -fstack-protector-strong -O2 -fwrapv -pipe -Wformat -Werror=format-security -gdwarf-4 -fno-debug-types-section -fvar-tracking-assignments -g2 -Wp,-D_FORTIFY_SOURCE=2 -fstack-protector-strong --param=ssp-buffer-size=4 -Werror=trampolines -fPIC -mtune=generic -march=x86-64 -gdwarf-4 -fno-debug-types-section -fvar-tracking-assignments -g2 -DPIE -MT lib/libkcapi_la-kcapi-kernel-if.lo -MD -MP -MF lib/.deps/libkcapi_la-kcapi-kernel-if.Tpo -c lib/kcapi-kernel-if.c  -fPIC -DPIC -o lib/.libs/libkcapi_la-kcapi-kernel-if.o
libtool: compile:  x86_64-pld-linux-gnux32-gcc -DPACKAGE_NAME=\"libkcapi\" -DPACKAGE_TARNAME=\"libkcapi\" -DPACKAGE_VERSION=\"1.3.0\" "-DPACKAGE_STRING=\"libkcapi 1.3.0\"" -DPACKAGE_BUGREPORT=\"\" -DPACKAGE_URL=\"\" -DKCAPI_MAJVERSION=1 -DKCAPI_MINVERSION=3 -DKCAPI_PATCHLEVEL=0 -DPACKAGE=\"libkcapi\" -DVERSION=\"1.3.0\" -DHAVE_STDIO_H=1 -DHAVE_STDLIB_H=1 -DHAVE_STRING_H=1 -DHAVE_INTTYPES_H=1 -DHAVE_STDINT_H=1 -DHAVE_STRINGS_H=1 -DHAVE_SYS_STAT_H=1 -DHAVE_SYS_TYPES_H=1 -DHAVE_UNISTD_H=1 -DSTDC_HEADERS=1 -DHAVE_DLFCN_H=1 -DLT_OBJDIR=\".libs/\" -DHAVE_GETRANDOM=1 -DHAVE_SECURE_GETENV=1 -DCHECK_PREFIX=\".\" -DCHECK_SUFFIX=\"hmac\" -DHAVE_FSEEKO=1 -I. -Wextra -Wall -pedantic -fwrapv --param ssp-buffer-size=4 -O2 -Werror -std=gnu99 -Wconversion -fvisibility=hidden -fstack-protector-strong -O2 -fwrapv -pipe -Wformat -Werror=format-security -gdwarf-4 -fno-debug-types-section -fvar-tracking-assignments -g2 -Wp,-D_FORTIFY_SOURCE=2 -fstack-protector-strong --param=ssp-buffer-size=4 -Werror=trampolines -fPIC -mtune=generic -march=x86-64 -gdwarf-4 -fno-debug-types-section -fvar-tracking-assignments -g2 -DPIE -MT lib/libkcapi_la-kcapi-kernel-if.lo -MD -MP -MF lib/.deps/libkcapi_la-kcapi-kernel-if.Tpo -c lib/kcapi-kernel-if.c  -fPIC -DPIC -o lib/libkcapi_la-kcapi-kernel-if.o >/dev/null 2>&1
mv -f lib/.deps/libkcapi_la-kcapi-kernel-if.Tpo lib/.deps/libkcapi_la-kcapi-kernel-if.Plo
error: Bad exit status from /tmp/B.rr14TY/BUILD/tmp/rpm-tmp.8S5Xod (%build)


RPM build errors:
    Could not canonicalize hostname: naiad
    Bad exit status from /tmp/B.rr14TY/BUILD/tmp/rpm-tmp.8S5Xod (%build)
ended at: Sat May 29 11:46:11 2021, done in 0:00:13.415908
error: No files produced.
+ chmod -R u+rwX /tmp/B.rr14TY/BUILD
+ rm -rf /tmp/B.rr14TY/tmp /tmp/B.rr14TY/BUILD
+ rm -rf /tmp/B.rr14TY
Begin-PLD-Builder-Info
Build-Time: user:18.26s sys:4.43s real:15.25s (faults io:94 non-io:992427)

End-PLD-Builder-Info
[Back to list of logs] [View rpm -qa of builder]