FailedOk

th/SRPMS[OK]
th/x32[OK]
th/i686[OK]
th/x86_64[OK]

ac/SRPMS[OK]
ac/i386[OK]
ac/i586[OK]
ac/i686[OK]
ac/alpha[OK]
ac/amd64[OK]
ac/athlon[OK]
ac/ppc[OK]
ac/sparc[OK]
ac/sparc64[OK]

Advanced Search
main()
Powered by PLD Linux
(c) 2002-2021 PLD Team
$Revision: 1.37 $
Powered by php.
Your IP: 3.235.223.5

librsvg fd21e60e-18ac-403f-b6b5-a3aa01fceb8d

Status:Failed
Source URL:https://buildlogs.pld-linux.org/pld/th/x32/FAIL/librsvg,fd21e60e-18ac-403f-b6b5-a3aa01fceb8d.bz2
text/plain URL:View!
rpm -qa of builder:View!
Date:2021/05/27 22:32:56
Runtime:0:00:19.087549

Toc:

  • error 1
  • rpm: error: Failed build dependencies:
  • error 2
  • rpm: error: Failed build dependencies:
  • prep
  • Executing(%prep): /bin/sh -e /tmp/B.5g8PtW/BUILD/tmp/rpm-tmp.0gp1XK
  • build
  • Executing(%build): /bin/sh -e /tmp/B.5g8PtW/BUILD/tmp/rpm-tmp.xzEohA
  • error 3
  • error: aborting due to previous error
  • error 4
  • error: aborting due to previous error
  • error 5
  • error: aborting due to previous error
  • error 6
  • error: aborting due to previous error
  • error 7
  • error: could not compile `libc`
  • error 8
  • error: aborting due to previous error
  • error 9
  • error: aborting due to previous error
  • error 10
  • error: aborting due to previous error
  • error 11
  • error: aborting due to previous error
  • error 12
  • error: aborting due to previous error
  • error 13
  • error: build failed
  • error 14
  • make[2]: *** [Makefile:1780: librsvg_c_api.la] Error 101
  • error 15
  • make[1]: *** [Makefile:1277: all-recursive] Error 1
  • error 16
  • error: Bad exit status from /tmp/B.5g8PtW/BUILD/tmp/rpm-tmp.xzEohA (%build)
  • error 17
  • RPM build errors:
  • error 18
  • error: No files produced.

Content:

request from: atler
checking if we should skip the build
started at: Thu May 27 22:32:06 2021
killing old processes on a builder
sending signal 9 to pid -1
cleaning up /tmp
fetching https://srcbuilder.pld-linux.org/th//srpms/fd21e60e-18ac-403f-b6b5-a3aa01fceb8d/librsvg-2.50.6-1.src.rpm
fetched 22249026 bytes, 13144.3 K/s
installing srpm: librsvg-2.50.6-1.src.rpm
+ install -d /tmp/B.5g8PtW/BUILD /tmp/B.5g8PtW/RPMS
+ LC_ALL=en_US.UTF-8
+ rpm -qp --changelog librsvg-2.50.6-1.src.rpm
* Thu May 27 2021 PLD Linux Team <feedback@pld-linux.org>
- For complete changelog see: http://git.pld-linux.org/?p=packages/librsvg.git;a=log;h=master
* Thu May 27 2021 Jan Palus <atler@pld-linux.org> 1199f87
- up to 2.50.6 * Thu May 06 2021 Jakub Bogusz <qboosh@pld-linux.org> 401b1ff
- updated to 2.50.5 * Tue Apr 13 2021 Jakub Bogusz <qboosh@pld-linux.org> 4fa27e6
- updated to 2.50.4 (fixes RUSTSEC-2020-0146 in generic-array) * Sun Mar 07 2021 Jan Rękorajski <baggins@pld-linux.org> ca0684e
- unconditional noarch subpackages * Fri Jan 29 2021 Jakub Bogusz <qboosh@pld-linux.org> 04e55f8
- updated to 2.50.3 * Fri Dec 04 2020 Jan Palus <atler@pld-linux.org> 19355c5
- add support for armhf * Fri Nov 20 2020 Jakub Bogusz <qboosh@pld-linux.org> f9634e0
- updated to 2.50.2 * Tue Oct 06 2020 Jan Palus <atler@pld-linux.org> 41e5f31
- fix build without apidocs * Mon Oct 05 2020 Jakub Bogusz <qboosh@pld-linux.org> 1bafbd4
- enhanced x32 patch (adjust thin-slice package to support x86_64-x32 ABI) - more cross rust related hacks * Mon Oct 05 2020 Jakub Bogusz <qboosh@pld-linux.org> b4b630d
- try with x32: invoke cargo/rustc with proper target; still some sources patching required for gnux32 abi * Sat Oct 03 2020 Jakub Bogusz <qboosh@pld-linux.org> 6cc6852
- updated to 2.50.1 * Fri Sep 11 2020 Jakub Bogusz <qboosh@pld-linux.org> 9cac6a7
- updated to 2.50.0 * Tue Jul 07 2020 Jakub Bogusz <qboosh@pld-linux.org> 24f1f52
- updated to 2.48.8 * Fri Jun 05 2020 Jakub Bogusz <qboosh@pld-linux.org> 724ccdb
- updated to 2.48.7 * Wed Jun 03 2020 Jakub Bogusz <qboosh@pld-linux.org> 8310686
- updated to 2.48.6 * Sat May 30 2020 Jakub Bogusz <qboosh@pld-linux.org> b1a4cab
- updated to 2.48.5 * Sat May 02 2020 Jan Palus <atler@pld-linux.org> 11846de
- fix build without static libs * Sat May 02 2020 Jan Palus <atler@pld-linux.org> 287b4e6
- add aarch64 to supported archs * Fri Apr 24 2020 Jakub Bogusz <qboosh@pld-linux.org> 246d3e7
- updated to 2.48.4 * Fri Apr 17 2020 Jakub Bogusz <qboosh@pld-linux.org> f948888
- EA with rust working + rpm -Uhv --nodeps --define '_topdir /tmp/B.5g8PtW' --define '_specdir %{_topdir}' --define '_sourcedir %{_specdir}' --define '_rpmdir %{_topdir}/RPMS' --define '_builddir %{_topdir}/BUILD' librsvg-2.50.6-1.src.rpm Updating / installing... librsvg-1:2.50.6-1 ######################################## + rm -f librsvg-2.50.6-1.src.rpm + install -m 700 -d /tmp/B.5g8PtW/BUILD/tmp + TMPDIR=/tmp/B.5g8PtW/BUILD/tmp + exec nice -n 0 rpmbuild -bp --short-circuit --nodeps --define '_topdir /tmp/B.5g8PtW' --define '_specdir %{_topdir}' --define '_sourcedir %{_specdir}' --define '_rpmdir %{_topdir}/RPMS' --define '_builddir %{_topdir}/BUILD' --target x32-pld-linux --define 'prep exit 0' /tmp/B.5g8PtW/librsvg.spec warning: line 67: It's not recommended to have unversioned Obsoletes: Obsoletes: librsvg0 warning: line 110: It's not recommended to have unversioned Obsoletes: Obsoletes: librsvg0-devel warning: Could not canonicalize hostname: naiad Building target platforms: x32-pld-linux Building for target x32-pld-linux checking BuildConflict-ing packages no BuildConflicts found checking BR rpm: warning: line 67: It's not recommended to have unversioned Obsoletes: Obsoletes: librsvg0 rpm: warning: line 110: It's not recommended to have unversioned Obsoletes: Obsoletes: librsvg0-devel rpm: warning: Could not canonicalize hostname: naiad rpm: error: Failed build dependencies: rpm: cargo is needed by librsvg-1:2.50.6-1.x32 rpm: rust >= 1.40 is needed by librsvg-1:2.50.6-1.x32 rpm: Building target platforms: x32-pld-linux rpm: Building for target x32-pld-linux updating poldek cache... ready is up to date th is up to date th is up to date th-ready is up to date th-ready is up to date Retrieving diff::packages.ndir.2021.05.27-10.10.02.gz......................................done Loading [pndir]th-test... Applying packages.ndir.2021.05.27-10.10.02.gz... Writing /root/.cache/poldek/[...]/packages.ndir.gz... Retrieving diff::packages.ndir.2021.05.27-14.36.01.gz......................................done Loading [pndir]th-test... Applying packages.ndir.2021.05.27-14.36.01.gz... Retrieving diff::packages.ndir.2021.05.27-20.27.03.gz......................................done Applying packages.ndir.2021.05.27-20.27.03.gz... Writing /root/.cache/poldek/[...]/packages.ndir.gz... checking conflicting packages in BRed packages poldek: Loading [pndir]ready... poldek: Loading [pndir]th-test... poldek: Loading [pndir]th-test... poldek: Loading [pndir]th-ready... poldek: Loading [pndir]th-ready... poldek: Loading [pndir]th... poldek: Loading [pndir]th... poldek: 30915 packages read poldek: Removed 4147 duplicate packages from available set poldek: Processing dependencies... poldek: There are 2 packages to install: poldek: A cargo-1.52.0-0.1.x32 rust-1.52.0-0.1.x32 poldek: This operation will use 292.7MB of disk space. poldek: Need to get 48.3MB of archives. poldek: rust-1.52.0-0.1.x32.rpm: digests OK poldek: cargo-1.52.0-0.1.x32.rpm: digests OK poldek: Executing pm-command.sh --upgrade -vh --test --root / --define _check_dirname_deps 0... poldek: Verifying... ######################################## poldek: Preparing... ######################################## no conflicts found checking BR rpm: warning: line 67: It's not recommended to have unversioned Obsoletes: Obsoletes: librsvg0 rpm: warning: line 110: It's not recommended to have unversioned Obsoletes: Obsoletes: librsvg0-devel rpm: warning: Could not canonicalize hostname: naiad rpm: error: Failed build dependencies: rpm: cargo is needed by librsvg-1:2.50.6-1.x32 rpm: rust >= 1.40 is needed by librsvg-1:2.50.6-1.x32 rpm: Building target platforms: x32-pld-linux rpm: Building for target x32-pld-linux installing BR: cargo rust + poldek --noask --caplookup -Q -v '--ignore=hhvm-*' '--ignore=php4-*' '--ignore=php52-*' '--ignore=php54-*' '--ignore=php55-*' '--ignore=php56-*' '--ignore=php70-*' '--ignore=php71-*' '--ignore=php72-*' '--ignore=php73-*' '--ignore=php74-*' '--ignore=php80-*' --upgrade cargo rust Loading [pndir]ready... Loading [pndir]th-test... Loading [pndir]th-test... Loading [pndir]th-ready... Loading [pndir]th-ready... Loading [pndir]th... Loading [pndir]th... 30915 packages read Removed 4147 duplicate packages from available set Processing dependencies... There are 1 package to install: A rust-1.52.0-0.1.x32 This operation will use 273.3MB of disk space. Need to get 43.8MB of archives. rust-1.52.0-0.1.x32.rpm: digests OK Executing pm-command.sh --upgrade -vh --root / --define _check_dirname_deps 0... Verifying... ######################################## Preparing... ######################################## Updating / installing... rust-1.52.0-0.1 ######################################## Installing set #2 Processing dependencies... There are 1 package to install: A cargo-1.52.0-0.1.x32 This operation will use 19.4MB of disk space. Need to get 4.5MB of archives. cargo-1.52.0-0.1.x32.rpm: digests OK Executing pm-command.sh --upgrade -vh --root / --define _check_dirname_deps 0... Verifying... ######################################## Preparing... ######################################## Updating / installing... cargo-1.52.0-0.1 ######################################## building RPM using: set -ex; : build-id: fd21e60e-18ac-403f-b6b5-a3aa01fceb8d; TMPDIR=/tmp/B.5g8PtW/BUILD/tmp exec nice -n 0 rpmbuild -bb --define '_smp_mflags -j9' --define '_make_opts -Otarget' --define '_pld_builder 1' --define '_topdir /tmp/B.5g8PtW' --define '_specdir %{_topdir}' --define '_sourcedir %{_specdir}' --define '_rpmdir %{_topdir}/RPMS' --define '_builddir %{_topdir}/BUILD' --target x32-pld-linux /tmp/B.5g8PtW/librsvg.spec + : build-id: fd21e60e-18ac-403f-b6b5-a3aa01fceb8d + TMPDIR=/tmp/B.5g8PtW/BUILD/tmp + exec nice -n 0 rpmbuild -bb --define '_smp_mflags -j9' --define '_make_opts -Otarget' --define '_pld_builder 1' --define '_topdir /tmp/B.5g8PtW' --define '_specdir %{_topdir}' --define '_sourcedir %{_specdir}' --define '_rpmdir %{_topdir}/RPMS' --define '_builddir %{_topdir}/BUILD' --target x32-pld-linux /tmp/B.5g8PtW/librsvg.spec warning: line 67: It's not recommended to have unversioned Obsoletes: Obsoletes: librsvg0 warning: line 110: It's not recommended to have unversioned Obsoletes: Obsoletes: librsvg0-devel warning: Could not canonicalize hostname: naiad Building target platforms: x32-pld-linux Building for target x32-pld-linux Executing(%prep): /bin/sh -e /tmp/B.5g8PtW/BUILD/tmp/rpm-tmp.0gp1XK + umask 022 + cd /tmp/B.5g8PtW/BUILD + cd /tmp/B.5g8PtW/BUILD + rm -rf librsvg-2.50.6 + /usr/bin/xz -dc /tmp/B.5g8PtW/librsvg-2.50.6.tar.xz + /bin/tar -xof - + STATUS=0 + '[' 0 -ne 0 ']' + cd librsvg-2.50.6 + /bin/chmod -Rf a+rX,u+w,g-w,o-w . + echo 'Patch #0 (x32.patch):' Patch #0 (x32.patch): + </tmp/B.5g8PtW/x32.patch + /usr/bin/patch -s -p1 '--fuzz=0' + echo 'Patch #1 (librsvg-gtkdoc.patch):' Patch #1 (librsvg-gtkdoc.patch): + </tmp/B.5g8PtW/librsvg-gtkdoc.patch + /usr/bin/patch -s -p1 '--fuzz=0' + /bin/sed -i -e 's/test "\?x\?\$cross_compiling"\? = "\?x\?yes"\?/true/' configure.ac + RPM_EC=0 + jobs -p + exit 0 Executing(%build): /bin/sh -e /tmp/B.5g8PtW/BUILD/tmp/rpm-tmp.xzEohA HOME=/home/users/builder PATH=/home/users/builder/GNUstep/Tools:/bin:/usr/bin:/usr/local/bin TMPDIR=/tmp/B.5g8PtW/BUILD/tmp + umask 022 + cd /tmp/B.5g8PtW/BUILD + cd librsvg-2.50.6 + gtkdocize --copy + libtoolize --copy --force --install libtoolize: putting auxiliary files in '.'. libtoolize: copying file './config.guess' libtoolize: copying file './config.sub' libtoolize: copying file './install-sh' libtoolize: copying file './ltmain.sh' libtoolize: putting macros in AC_CONFIG_MACRO_DIRS, 'm4'. libtoolize: copying file 'm4/libtool.m4' libtoolize: copying file 'm4/ltoptions.m4' libtoolize: copying file 'm4/ltsugar.m4' libtoolize: copying file 'm4/ltversion.m4' libtoolize: copying file 'm4/lt~obsolete.m4' libtoolize: Consider adding '-I m4' to ACLOCAL_AMFLAGS in Makefile.am. + aclocal -I m4 + autoconf configure.ac:84: warning: The macro `AC_ISC_POSIX' is obsolete. configure.ac:84: You should run autoupdate. ./lib/autoconf/specific.m4:550: AC_ISC_POSIX is expanded from... configure.ac:84: the top level configure.ac:88: warning: The macro `AC_STDC_HEADERS' is obsolete. configure.ac:88: You should run autoupdate. ./lib/autoconf/oldnames.m4:75: AC_STDC_HEADERS is expanded from... configure.ac:88: the top level configure.ac:88: warning: The macro `AC_HEADER_STDC' is obsolete. configure.ac:88: You should run autoupdate. ./lib/autoconf/headers.m4:704: AC_HEADER_STDC is expanded from... ./lib/autoconf/oldnames.m4:75: AC_STDC_HEADERS is expanded from... configure.ac:88: the top level configure.ac:285: warning: The macro `AC_HELP_STRING' is obsolete. configure.ac:285: You should run autoupdate. ./lib/autoconf/general.m4:204: AC_HELP_STRING is expanded from... configure.ac:285: the top level configure.ac:303: warning: The macro `AC_HELP_STRING' is obsolete. configure.ac:303: You should run autoupdate. ./lib/autoconf/general.m4:204: AC_HELP_STRING is expanded from... configure.ac:303: the top level configure.ac:365: warning: The macro `AC_TRY_LINK' is obsolete. configure.ac:365: You should run autoupdate. ./lib/autoconf/general.m4:2920: AC_TRY_LINK is expanded from... lib/m4sugar/m4sh.m4:692: _AS_IF_ELSE is expanded from... lib/m4sugar/m4sh.m4:699: AS_IF is expanded from... ./lib/autoconf/general.m4:2249: AC_CACHE_VAL is expanded from... ./lib/autoconf/general.m4:2270: AC_CACHE_CHECK is expanded from... configure.ac:353: GLIB_LC_MESSAGES is expanded from... configure.ac:365: the top level + autoheader + automake -a -c -f --foreign configure.ac:64: installing './compile' configure.ac:32: installing './missing' Makefile.am: installing './depcomp' + ./configure 'LDFLAGS=-Wl,--as-needed -Wl,--no-copy-dt-needed-entries -Wl,-z,relro -Wl,-z,combreloc ' 'CFLAGS=-O2 -fwrapv -pipe -Wformat -Werror=format-security -gdwarf-4 -fno-debug-types-section -fvar-tracking-assignments -g2 -Wp,-D_FORTIFY_SOURCE=2 -fstack-protector-strong --param=ssp-buffer-size=4 -Werror=trampolines -fPIC -mtune=generic -march=x86-64 -gdwarf-4 -fno-debug-types-section -fvar-tracking-assignments -g2 ' 'CXXFLAGS=-O2 -fwrapv -pipe -Wformat -Werror=format-security -gdwarf-4 -fno-debug-types-section -fvar-tracking-assignments -g2 -Wp,-D_FORTIFY_SOURCE=2 -fstack-protector-strong --param=ssp-buffer-size=4 -Werror=trampolines -fPIC -mtune=generic -march=x86-64 -gdwarf-4 -fno-debug-types-section -fvar-tracking-assignments -g2 ' 'FFLAGS=-O2 -fwrapv -pipe -Wformat -Werror=format-security -gdwarf-4 -fno-debug-types-section -fvar-tracking-assignments -g2 -Wp,-D_FORTIFY_SOURCE=2 -fstack-protector-strong --param=ssp-buffer-size=4 -Werror=trampolines -fPIC -mtune=generic -march=x86-64 -gdwarf-4 -fno-debug-types-section -fvar-tracking-assignments -g2 ' 'FCFLAGS=-O2 -fwrapv -pipe -Wformat -Werror=format-security -gdwarf-4 -fno-debug-types-section -fvar-tracking-assignments -g2 -Wp,-D_FORTIFY_SOURCE=2 -fstack-protector-strong --param=ssp-buffer-size=4 -Werror=trampolines -fPIC -mtune=generic -march=x86-64 -gdwarf-4 -fno-debug-types-section -fvar-tracking-assignments -g2 ' 'CPPFLAGS=' 'CC=x86_64-pld-linux-gnux32-gcc' 'CXX=x86_64-pld-linux-gnux32-g++' '--host=x86_64-pld-linux-gnux32' '--build=x86_64-pld-linux-gnux32' '--prefix=/usr' '--exec-prefix=/usr' '--bindir=/usr/bin' '--sbindir=/usr/sbin' '--sysconfdir=/etc' '--datadir=/usr/share' '--includedir=/usr/include' '--libdir=/usr/libx32' '--libexecdir=/usr/libexec' '--localstatedir=/var' '--sharedstatedir=/var/lib' '--mandir=/usr/share/man' '--infodir=/usr/share/info' '--x-libraries=/usr/libx32' 'RUST_TARGET=x86_64-unknown-linux-gnux32' --enable-gtk-doc --enable-introspection --disable-silent-rules --enable-static --enable-vala '--with-html-dir=/usr/share/doc/gtk-doc/html/librsvg' checking for a BSD-compatible install... /usr/bin/install -c checking whether build environment is sane... yes checking for a race-free mkdir -p... /bin/mkdir -p checking for mawk... mawk checking whether make sets $(MAKE)... yes checking whether make supports nested variables... yes checking whether UID '1000' is supported by ustar format... yes checking whether GID '1000' is supported by ustar format... yes checking how to create a ustar tar archive... gnutar checking whether make supports nested variables... (cached) yes checking whether to enable maintainer-specific portions of Makefiles... yes checking for a sed that does not truncate output... /bin/sed checking whether NLS is requested... yes checking for msgfmt... /usr/bin/msgfmt checking for gmsgfmt... /usr/bin/msgfmt checking for xgettext... /usr/bin/xgettext checking for msgmerge... /usr/bin/msgmerge checking whether make supports the include directive... yes (GNU style) checking for x86_64-pld-linux-gnux32-gcc... x86_64-pld-linux-gnux32-gcc checking whether the C compiler works... yes checking for C compiler default output file name... a.out checking for suffix of executables... checking whether we are cross compiling... no checking for suffix of object files... o checking whether the compiler supports GNU C... yes checking whether x86_64-pld-linux-gnux32-gcc accepts -g... yes checking for x86_64-pld-linux-gnux32-gcc option to enable C11 features... none needed checking whether x86_64-pld-linux-gnux32-gcc understands -c and -o together... yes checking dependency style of x86_64-pld-linux-gnux32-gcc... gcc3 checking build system type... x86_64-pld-linux-gnux32 checking host system type... x86_64-pld-linux-gnux32 checking for ld used by x86_64-pld-linux-gnux32-gcc... /usr/bin/ld checking if the linker (/usr/bin/ld) is GNU ld... yes checking for shared library run path origin... done checking 32-bit host C ABI... yes checking how to run the C preprocessor... x86_64-pld-linux-gnux32-gcc -E checking for grep that handles long lines and -e... /bin/grep checking for egrep... /bin/grep -E checking for ELF binary format... yes checking for the common suffixes of directories in the library search path... lib,lib,lib checking for CFPreferencesCopyAppValue... no checking for CFLocaleCopyPreferredLanguages... no checking for GNU gettext in libc... yes checking whether to use NLS... yes checking where the gettext function comes from... libc checking whether ln -s works... yes checking for library containing strerror... none required checking for x86_64-pld-linux-gnux32-gcc... (cached) x86_64-pld-linux-gnux32-gcc checking whether the compiler supports GNU C... (cached) yes checking whether x86_64-pld-linux-gnux32-gcc accepts -g... (cached) yes checking for x86_64-pld-linux-gnux32-gcc option to enable C11 features... (cached) none needed checking whether x86_64-pld-linux-gnux32-gcc understands -c and -o together... (cached) yes checking dependency style of x86_64-pld-linux-gnux32-gcc... (cached) gcc3 checking how to run the C preprocessor... x86_64-pld-linux-gnux32-gcc -E checking for mawk... (cached) mawk checking for stdio.h... yes checking for stdlib.h... yes checking for string.h... yes checking for inttypes.h... yes checking for stdint.h... yes checking for strings.h... yes checking for sys/stat.h... yes checking for sys/types.h... yes checking for unistd.h... yes checking for egrep... (cached) /bin/grep -E checking whether byte ordering is bigendian... no checking for x86_64-pld-linux-gnux32-pkg-config... /usr/bin/x86_64-pld-linux-gnux32-pkg-config checking pkg-config is at least version 0.9.0... yes checking how to print strings... print -r checking for a sed that does not truncate output... (cached) /bin/sed checking for fgrep... /bin/grep -F checking for ld used by x86_64-pld-linux-gnux32-gcc... /usr/bin/ld checking if the linker (/usr/bin/ld) is GNU ld... yes checking for BSD- or MS-compatible name lister (nm)... /usr/bin/nm -B checking the name lister (/usr/bin/nm -B) interface... BSD nm checking the maximum length of command line arguments... 1572864 checking how to convert x86_64-pld-linux-gnux32 file names to x86_64-pld-linux-gnux32 format... func_convert_file_noop checking how to convert x86_64-pld-linux-gnux32 file names to toolchain format... func_convert_file_noop checking for /usr/bin/ld option to reload object files... -r checking for x86_64-pld-linux-gnux32-objdump... no checking for objdump... objdump checking how to recognize dependent libraries... pass_all checking for x86_64-pld-linux-gnux32-dlltool... no checking for dlltool... no checking how to associate runtime and link libraries... print -r -- checking for x86_64-pld-linux-gnux32-ar... no checking for ar... ar checking for archiver @FILE support... @ checking for x86_64-pld-linux-gnux32-strip... no checking for strip... strip checking for x86_64-pld-linux-gnux32-ranlib... no checking for ranlib... ranlib checking command to parse /usr/bin/nm -B output from x86_64-pld-linux-gnux32-gcc object... ok checking for sysroot... no checking for a working dd... /bin/dd checking how to truncate binary pipes... /bin/dd bs=4096 count=1 checking for x86_64-pld-linux-gnux32-mt... no checking for mt... no checking if : is a manifest tool... no checking for dlfcn.h... yes checking for objdir... .libs checking if x86_64-pld-linux-gnux32-gcc supports -fno-rtti -fno-exceptions... no checking for x86_64-pld-linux-gnux32-gcc option to produce PIC... -fPIC -DPIC checking if x86_64-pld-linux-gnux32-gcc PIC flag -fPIC -DPIC works... yes checking if x86_64-pld-linux-gnux32-gcc static flag -static works... yes checking if x86_64-pld-linux-gnux32-gcc supports -c -o file.o... yes checking if x86_64-pld-linux-gnux32-gcc supports -c -o file.o... (cached) yes checking whether the x86_64-pld-linux-gnux32-gcc linker (/usr/bin/ld -m elf32_x86_64) supports shared libraries... yes checking whether -lc should be explicitly linked in... no checking dynamic linker characteristics... GNU/Linux ld.so checking how to hardcode library paths into programs... immediate checking whether stripping libraries is possible... yes checking if libtool supports shared libraries... yes checking whether to build shared libraries... yes checking whether to build static libraries... yes checking for cos in -lm... yes checking for dlopen... no checking for dlopen in -ldl... yes checking for cargo... cargo checking for rustc... rustc checking for some Win32 platform... no checking for native Win32... no checking for darwin... no checking for LIBRSVG... yes checking for GTHREAD... yes checking for GMODULE... yes checking for RSVG_CONVERT... yes checking whether to build the GDK-Pixbuf SVG loader... yes checking for GDK_PIXBUF... yes checking for gdk-pixbuf-query-loaders... no checking for gdk-pixbuf-query-loaders-64... no checking for gdk-pixbuf-query-loaders-32... no checking for gdk-pixbuf-query-loaders-x32... /usr/bin/gdk-pixbuf-query-loaders-x32 checking if x86_64-pld-linux-gnux32-gcc supports "-Wl,-Bsymbolic-functions" flag... yes checking for gtk-doc... yes checking for gtkdoc-check... gtkdoc-check.test checking for gtkdoc-check... /usr/bin/gtkdoc-check checking for gtkdoc-rebase... /usr/bin/gtkdoc-rebase checking for gtkdoc-mkpdf... /usr/bin/gtkdoc-mkpdf checking whether to build gtk-doc documentation... yes checking for GTKDOC_DEPS... yes checking whether to build miscellaneous tools... yes checking whether to build Rust code with debugging information... no checking for gobject-introspection... yes checking for x86_64-pld-linux-gnux32-pkg-config... (cached) /usr/bin/x86_64-pld-linux-gnux32-pkg-config checking pkg-config is at least version 0.9.0... yes checking for vala... yes checking for locale.h... yes checking for LC_MESSAGES... yes checking for PANGOFT2... yes checking for FONTCONFIG... yes checking that generated files are newer than configure... done configure: creating ./config.status config.status: creating librsvg/librsvg-features.h config.status: creating Makefile config.status: creating librsvg-zip config.status: creating gdk-pixbuf-loader/Makefile config.status: creating tests/Makefile config.status: creating tools/Makefile config.status: creating doc/Makefile config.status: creating doc/version.xml config.status: creating win32/Makefile config.status: creating win32/config.h.win32 config.status: creating win32/config-msvc.mak config.status: creating po/Makefile.in config.status: creating librsvg-2.0.pc config.status: creating config.h config.status: executing po-directories commands config.status: creating po/POTFILES config.status: creating po/Makefile config.status: executing depfiles commands config.status: executing libtool commands librsvg-2.50.6 prefix: /usr C compiler: x86_64-pld-linux-gnux32-gcc rustc: rustc 1.52.0 Cairo version: 1.16.0 Pango version: 1.48.5 Freetype version: 23.4.17 Harfbuzz version: 2.8.1 Debugging information for Rust: no Build introspectable bindings: yes Build Vala bindings: yes Build GdkPixbuf loader: yes Build miscellaneous tools: yes Build HTML documentation: yes + /usr/bin/make -Otarget -j9 /usr/bin/make all-recursive Making all in . make[2]: Entering directory '/tmp/B.5g8PtW/BUILD/librsvg-2.50.6' depbase=`echo _rsvg_dummy.lo | sed 's|[^/]*$|.deps/&|;s|\.lo$||'`;\ /bin/sh ./libtool --tag=CC --mode=compile x86_64-pld-linux-gnux32-gcc -DHAVE_CONFIG_H -I. -O2 -fwrapv -pipe -Wformat -Werror=format-security -gdwarf-4 -fno-debug-types-section -fvar-tracking-assignments -g2 -Wp,-D_FORTIFY_SOURCE=2 -fstack-protector-strong --param=ssp-buffer-size=4 -Werror=trampolines -fPIC -mtune=generic -march=x86-64 -gdwarf-4 -fno-debug-types-section -fvar-tracking-assignments -g2 -MT _rsvg_dummy.lo -MD -MP -MF $depbase.Tpo -c -o _rsvg_dummy.lo _rsvg_dummy.c &&\ mv -f $depbase.Tpo $depbase.Plo libtool: compile: x86_64-pld-linux-gnux32-gcc -DHAVE_CONFIG_H -I. -O2 -fwrapv -pipe -Wformat -Werror=format-security -gdwarf-4 -fno-debug-types-section -fvar-tracking-assignments -g2 -Wp,-D_FORTIFY_SOURCE=2 -fstack-protector-strong --param=ssp-buffer-size=4 -Werror=trampolines -fPIC -mtune=generic -march=x86-64 -gdwarf-4 -fno-debug-types-section -fvar-tracking-assignments -g2 -MT _rsvg_dummy.lo -MD -MP -MF .deps/_rsvg_dummy.Tpo -c _rsvg_dummy.c -fPIC -DPIC -o .libs/_rsvg_dummy.o libtool: compile: x86_64-pld-linux-gnux32-gcc -DHAVE_CONFIG_H -I. -O2 -fwrapv -pipe -Wformat -Werror=format-security -gdwarf-4 -fno-debug-types-section -fvar-tracking-assignments -g2 -Wp,-D_FORTIFY_SOURCE=2 -fstack-protector-strong --param=ssp-buffer-size=4 -Werror=trampolines -fPIC -mtune=generic -march=x86-64 -gdwarf-4 -fno-debug-types-section -fvar-tracking-assignments -g2 -MT _rsvg_dummy.lo -MD -MP -MF .deps/_rsvg_dummy.Tpo -c _rsvg_dummy.c -o _rsvg_dummy.o >/dev/null 2>&1 make[2]: Leaving directory '/tmp/B.5g8PtW/BUILD/librsvg-2.50.6' cd ./librsvg && \ PKG_CONFIG_ALLOW_CROSS=1 \ PKG_CONFIG='/usr/bin/x86_64-pld-linux-gnux32-pkg-config' \ CARGO_TARGET_DIR=/tmp/B.5g8PtW/BUILD/librsvg-2.50.6/target \ cargo --locked build --verbose --target=x86_64-unknown-linux-gnux32 --release \ && cd /tmp/B.5g8PtW/BUILD/librsvg-2.50.6 && /bin/sh ./libtool --tag=CC --mode=link x86_64-pld-linux-gnux32-gcc -O2 -fwrapv -pipe -Wformat -Werror=format-security -gdwarf-4 -fno-debug-types-section -fvar-tracking-assignments -g2 -Wp,-D_FORTIFY_SOURCE=2 -fstack-protector-strong --param=ssp-buffer-size=4 -Werror=trampolines -fPIC -mtune=generic -march=x86-64 -gdwarf-4 -fno-debug-types-section -fvar-tracking-assignments -g2 -Wl,--as-needed -Wl,--no-copy-dt-needed-entries -Wl,-z,relro -Wl,-z,combreloc -o librsvg_c_api.la _rsvg_dummy.lo && mv /tmp/B.5g8PtW/BUILD/librsvg-2.50.6/target/x86_64-unknown-linux-gnux32/release/librsvg_c_api.a .libs/librsvg_c_api.a make[2]: Entering directory '/tmp/B.5g8PtW/BUILD/librsvg-2.50.6' x86_64-pld-linux-gnux32-gcc -DHAVE_CONFIG_H -I. -I. -I. -I./librsvg -DLIBRSVG_DATADIR="\"/usr/share\"" -pthread -I/usr/include/gio-unix-2.0 -I/usr/include/gdk-pixbuf-2.0 -I/usr/include/libpng16 -I/usr/include/pango-1.0 -I/usr/include/harfbuzz -I/usr/include/pango-1.0 -I/usr/include/libmount -I/usr/include/blkid -I/usr/include/fribidi -I/usr/include/cairo -I/usr/include/pixman-1 -I/usr/include/uuid -I/usr/include/freetype2 -I/usr/include/harfbuzz -I/usr/include/glib-2.0 -I/usr/libx32/glib-2.0/include -I/usr/include/libpng16 -O2 -fwrapv -pipe -Wformat -Werror=format-security -gdwarf-4 -fno-debug-types-section -fvar-tracking-assignments -g2 -Wp,-D_FORTIFY_SOURCE=2 -fstack-protector-strong --param=ssp-buffer-size=4 -Werror=trampolines -fPIC -mtune=generic -march=x86-64 -gdwarf-4 -fno-debug-types-section -fvar-tracking-assignments -g2 -MT rsvg_convert-rsvg-convert.o -MD -MP -MF .deps/rsvg_convert-rsvg-convert.Tpo -c -o rsvg_convert-rsvg-convert.o `test -f 'rsvg-convert.c' || echo './'`rsvg-convert.c mv -f .deps/rsvg_convert-rsvg-convert.Tpo .deps/rsvg_convert-rsvg-convert.Po make[2]: Leaving directory '/tmp/B.5g8PtW/BUILD/librsvg-2.50.6' make[2]: Entering directory '/tmp/B.5g8PtW/BUILD/librsvg-2.50.6' /bin/sh ./libtool --tag=CC --mode=compile x86_64-pld-linux-gnux32-gcc -DHAVE_CONFIG_H -I. -I. -I. -I./librsvg -DG_LOG_DOMAIN=\"librsvg\" -DLIBRSVG_DATADIR="\"/usr/share\"" -DSRCDIR=\""/tmp/B.5g8PtW/BUILD/librsvg-2.50.6"\" -DRSVG_DISABLE_DEPRECATION_WARNINGS -DRSVG_COMPILATION -pthread -I/usr/include/cairo -I/usr/include/gdk-pixbuf-2.0 -I/usr/include/libpng16 -I/usr/include/libxml2 -I/usr/include/pango-1.0 -I/usr/include/harfbuzz -I/usr/include/pango-1.0 -I/usr/include/libmount -I/usr/include/blkid -I/usr/include/fribidi -I/usr/include/cairo -I/usr/include/pixman-1 -I/usr/include/uuid -I/usr/include/freetype2 -I/usr/include/libpng16 -I/usr/include/harfbuzz -I/usr/include/glib-2.0 -I/usr/libx32/glib-2.0/include -O2 -fwrapv -pipe -Wformat -Werror=format-security -gdwarf-4 -fno-debug-types-section -fvar-tracking-assignments -g2 -Wp,-D_FORTIFY_SOURCE=2 -fstack-protector-strong --param=ssp-buffer-size=4 -Werror=trampolines -fPIC -mtune=generic -march=x86-64 -gdwarf-4 -fno-debug-types-section -fvar-tracking-assignments -g2 -MT librsvg/2_la-librsvg-features.lo -MD -MP -MF librsvg/.deps/2_la-librsvg-features.Tpo -c -o librsvg/2_la-librsvg-features.lo `test -f 'librsvg/librsvg-features.c' || echo './'`librsvg/librsvg-features.c libtool: compile: x86_64-pld-linux-gnux32-gcc -DHAVE_CONFIG_H -I. -I. -I. -I./librsvg -DG_LOG_DOMAIN=\"librsvg\" -DLIBRSVG_DATADIR=\"/usr/share\" -DSRCDIR=\"/tmp/B.5g8PtW/BUILD/librsvg-2.50.6\" -DRSVG_DISABLE_DEPRECATION_WARNINGS -DRSVG_COMPILATION -pthread -I/usr/include/cairo -I/usr/include/gdk-pixbuf-2.0 -I/usr/include/libpng16 -I/usr/include/libxml2 -I/usr/include/pango-1.0 -I/usr/include/harfbuzz -I/usr/include/pango-1.0 -I/usr/include/libmount -I/usr/include/blkid -I/usr/include/fribidi -I/usr/include/cairo -I/usr/include/pixman-1 -I/usr/include/uuid -I/usr/include/freetype2 -I/usr/include/libpng16 -I/usr/include/harfbuzz -I/usr/include/glib-2.0 -I/usr/libx32/glib-2.0/include -O2 -fwrapv -pipe -Wformat -Werror=format-security -gdwarf-4 -fno-debug-types-section -fvar-tracking-assignments -g2 -Wp,-D_FORTIFY_SOURCE=2 -fstack-protector-strong --param=ssp-buffer-size=4 -Werror=trampolines -fPIC -mtune=generic -march=x86-64 -gdwarf-4 -fno-debug-types-section -fvar-tracking-assignments -g2 -MT librsvg/2_la-librsvg-features.lo -MD -MP -MF librsvg/.deps/2_la-librsvg-features.Tpo -c librsvg/librsvg-features.c -fPIC -DPIC -o librsvg/.libs/2_la-librsvg-features.o libtool: compile: x86_64-pld-linux-gnux32-gcc -DHAVE_CONFIG_H -I. -I. -I. -I./librsvg -DG_LOG_DOMAIN=\"librsvg\" -DLIBRSVG_DATADIR=\"/usr/share\" -DSRCDIR=\"/tmp/B.5g8PtW/BUILD/librsvg-2.50.6\" -DRSVG_DISABLE_DEPRECATION_WARNINGS -DRSVG_COMPILATION -pthread -I/usr/include/cairo -I/usr/include/gdk-pixbuf-2.0 -I/usr/include/libpng16 -I/usr/include/libxml2 -I/usr/include/pango-1.0 -I/usr/include/harfbuzz -I/usr/include/pango-1.0 -I/usr/include/libmount -I/usr/include/blkid -I/usr/include/fribidi -I/usr/include/cairo -I/usr/include/pixman-1 -I/usr/include/uuid -I/usr/include/freetype2 -I/usr/include/libpng16 -I/usr/include/harfbuzz -I/usr/include/glib-2.0 -I/usr/libx32/glib-2.0/include -O2 -fwrapv -pipe -Wformat -Werror=format-security -gdwarf-4 -fno-debug-types-section -fvar-tracking-assignments -g2 -Wp,-D_FORTIFY_SOURCE=2 -fstack-protector-strong --param=ssp-buffer-size=4 -Werror=trampolines -fPIC -mtune=generic -march=x86-64 -gdwarf-4 -fno-debug-types-section -fvar-tracking-assignments -g2 -MT librsvg/2_la-librsvg-features.lo -MD -MP -MF librsvg/.deps/2_la-librsvg-features.Tpo -c librsvg/librsvg-features.c -o librsvg/2_la-librsvg-features.o >/dev/null 2>&1 mv -f librsvg/.deps/2_la-librsvg-features.Tpo librsvg/.deps/2_la-librsvg-features.Plo make[2]: Leaving directory '/tmp/B.5g8PtW/BUILD/librsvg-2.50.6' make[2]: Entering directory '/tmp/B.5g8PtW/BUILD/librsvg-2.50.6' /bin/sh ./libtool --tag=CC --mode=compile x86_64-pld-linux-gnux32-gcc -DHAVE_CONFIG_H -I. -I. -I. -I./librsvg -DG_LOG_DOMAIN=\"librsvg\" -DLIBRSVG_DATADIR="\"/usr/share\"" -DSRCDIR=\""/tmp/B.5g8PtW/BUILD/librsvg-2.50.6"\" -DRSVG_DISABLE_DEPRECATION_WARNINGS -DRSVG_COMPILATION -pthread -I/usr/include/cairo -I/usr/include/gdk-pixbuf-2.0 -I/usr/include/libpng16 -I/usr/include/libxml2 -I/usr/include/pango-1.0 -I/usr/include/harfbuzz -I/usr/include/pango-1.0 -I/usr/include/libmount -I/usr/include/blkid -I/usr/include/fribidi -I/usr/include/cairo -I/usr/include/pixman-1 -I/usr/include/uuid -I/usr/include/freetype2 -I/usr/include/libpng16 -I/usr/include/harfbuzz -I/usr/include/glib-2.0 -I/usr/libx32/glib-2.0/include -O2 -fwrapv -pipe -Wformat -Werror=format-security -gdwarf-4 -fno-debug-types-section -fvar-tracking-assignments -g2 -Wp,-D_FORTIFY_SOURCE=2 -fstack-protector-strong --param=ssp-buffer-size=4 -Werror=trampolines -fPIC -mtune=generic -march=x86-64 -gdwarf-4 -fno-debug-types-section -fvar-tracking-assignments -g2 -MT librsvg/2_la-rsvg-pixbuf.lo -MD -MP -MF librsvg/.deps/2_la-rsvg-pixbuf.Tpo -c -o librsvg/2_la-rsvg-pixbuf.lo `test -f 'librsvg/rsvg-pixbuf.c' || echo './'`librsvg/rsvg-pixbuf.c libtool: compile: x86_64-pld-linux-gnux32-gcc -DHAVE_CONFIG_H -I. -I. -I. -I./librsvg -DG_LOG_DOMAIN=\"librsvg\" -DLIBRSVG_DATADIR=\"/usr/share\" -DSRCDIR=\"/tmp/B.5g8PtW/BUILD/librsvg-2.50.6\" -DRSVG_DISABLE_DEPRECATION_WARNINGS -DRSVG_COMPILATION -pthread -I/usr/include/cairo -I/usr/include/gdk-pixbuf-2.0 -I/usr/include/libpng16 -I/usr/include/libxml2 -I/usr/include/pango-1.0 -I/usr/include/harfbuzz -I/usr/include/pango-1.0 -I/usr/include/libmount -I/usr/include/blkid -I/usr/include/fribidi -I/usr/include/cairo -I/usr/include/pixman-1 -I/usr/include/uuid -I/usr/include/freetype2 -I/usr/include/libpng16 -I/usr/include/harfbuzz -I/usr/include/glib-2.0 -I/usr/libx32/glib-2.0/include -O2 -fwrapv -pipe -Wformat -Werror=format-security -gdwarf-4 -fno-debug-types-section -fvar-tracking-assignments -g2 -Wp,-D_FORTIFY_SOURCE=2 -fstack-protector-strong --param=ssp-buffer-size=4 -Werror=trampolines -fPIC -mtune=generic -march=x86-64 -gdwarf-4 -fno-debug-types-section -fvar-tracking-assignments -g2 -MT librsvg/2_la-rsvg-pixbuf.lo -MD -MP -MF librsvg/.deps/2_la-rsvg-pixbuf.Tpo -c librsvg/rsvg-pixbuf.c -fPIC -DPIC -o librsvg/.libs/2_la-rsvg-pixbuf.o libtool: compile: x86_64-pld-linux-gnux32-gcc -DHAVE_CONFIG_H -I. -I. -I. -I./librsvg -DG_LOG_DOMAIN=\"librsvg\" -DLIBRSVG_DATADIR=\"/usr/share\" -DSRCDIR=\"/tmp/B.5g8PtW/BUILD/librsvg-2.50.6\" -DRSVG_DISABLE_DEPRECATION_WARNINGS -DRSVG_COMPILATION -pthread -I/usr/include/cairo -I/usr/include/gdk-pixbuf-2.0 -I/usr/include/libpng16 -I/usr/include/libxml2 -I/usr/include/pango-1.0 -I/usr/include/harfbuzz -I/usr/include/pango-1.0 -I/usr/include/libmount -I/usr/include/blkid -I/usr/include/fribidi -I/usr/include/cairo -I/usr/include/pixman-1 -I/usr/include/uuid -I/usr/include/freetype2 -I/usr/include/libpng16 -I/usr/include/harfbuzz -I/usr/include/glib-2.0 -I/usr/libx32/glib-2.0/include -O2 -fwrapv -pipe -Wformat -Werror=format-security -gdwarf-4 -fno-debug-types-section -fvar-tracking-assignments -g2 -Wp,-D_FORTIFY_SOURCE=2 -fstack-protector-strong --param=ssp-buffer-size=4 -Werror=trampolines -fPIC -mtune=generic -march=x86-64 -gdwarf-4 -fno-debug-types-section -fvar-tracking-assignments -g2 -MT librsvg/2_la-rsvg-pixbuf.lo -MD -MP -MF librsvg/.deps/2_la-rsvg-pixbuf.Tpo -c librsvg/rsvg-pixbuf.c -o librsvg/2_la-rsvg-pixbuf.o >/dev/null 2>&1 mv -f librsvg/.deps/2_la-rsvg-pixbuf.Tpo librsvg/.deps/2_la-rsvg-pixbuf.Plo make[2]: Leaving directory '/tmp/B.5g8PtW/BUILD/librsvg-2.50.6' make[2]: Entering directory '/tmp/B.5g8PtW/BUILD/librsvg-2.50.6' /bin/sh ./libtool --tag=CC --mode=compile x86_64-pld-linux-gnux32-gcc -DHAVE_CONFIG_H -I. -I. -I. -I./librsvg -DG_LOG_DOMAIN=\"librsvg\" -DLIBRSVG_DATADIR="\"/usr/share\"" -DSRCDIR=\""/tmp/B.5g8PtW/BUILD/librsvg-2.50.6"\" -DRSVG_DISABLE_DEPRECATION_WARNINGS -DRSVG_COMPILATION -pthread -I/usr/include/cairo -I/usr/include/gdk-pixbuf-2.0 -I/usr/include/libpng16 -I/usr/include/libxml2 -I/usr/include/pango-1.0 -I/usr/include/harfbuzz -I/usr/include/pango-1.0 -I/usr/include/libmount -I/usr/include/blkid -I/usr/include/fribidi -I/usr/include/cairo -I/usr/include/pixman-1 -I/usr/include/uuid -I/usr/include/freetype2 -I/usr/include/libpng16 -I/usr/include/harfbuzz -I/usr/include/glib-2.0 -I/usr/libx32/glib-2.0/include -O2 -fwrapv -pipe -Wformat -Werror=format-security -gdwarf-4 -fno-debug-types-section -fvar-tracking-assignments -g2 -Wp,-D_FORTIFY_SOURCE=2 -fstack-protector-strong --param=ssp-buffer-size=4 -Werror=trampolines -fPIC -mtune=generic -march=x86-64 -gdwarf-4 -fno-debug-types-section -fvar-tracking-assignments -g2 -MT librsvg/2_la-rsvg-base.lo -MD -MP -MF librsvg/.deps/2_la-rsvg-base.Tpo -c -o librsvg/2_la-rsvg-base.lo `test -f 'librsvg/rsvg-base.c' || echo './'`librsvg/rsvg-base.c libtool: compile: x86_64-pld-linux-gnux32-gcc -DHAVE_CONFIG_H -I. -I. -I. -I./librsvg -DG_LOG_DOMAIN=\"librsvg\" -DLIBRSVG_DATADIR=\"/usr/share\" -DSRCDIR=\"/tmp/B.5g8PtW/BUILD/librsvg-2.50.6\" -DRSVG_DISABLE_DEPRECATION_WARNINGS -DRSVG_COMPILATION -pthread -I/usr/include/cairo -I/usr/include/gdk-pixbuf-2.0 -I/usr/include/libpng16 -I/usr/include/libxml2 -I/usr/include/pango-1.0 -I/usr/include/harfbuzz -I/usr/include/pango-1.0 -I/usr/include/libmount -I/usr/include/blkid -I/usr/include/fribidi -I/usr/include/cairo -I/usr/include/pixman-1 -I/usr/include/uuid -I/usr/include/freetype2 -I/usr/include/libpng16 -I/usr/include/harfbuzz -I/usr/include/glib-2.0 -I/usr/libx32/glib-2.0/include -O2 -fwrapv -pipe -Wformat -Werror=format-security -gdwarf-4 -fno-debug-types-section -fvar-tracking-assignments -g2 -Wp,-D_FORTIFY_SOURCE=2 -fstack-protector-strong --param=ssp-buffer-size=4 -Werror=trampolines -fPIC -mtune=generic -march=x86-64 -gdwarf-4 -fno-debug-types-section -fvar-tracking-assignments -g2 -MT librsvg/2_la-rsvg-base.lo -MD -MP -MF librsvg/.deps/2_la-rsvg-base.Tpo -c librsvg/rsvg-base.c -fPIC -DPIC -o librsvg/.libs/2_la-rsvg-base.o libtool: compile: x86_64-pld-linux-gnux32-gcc -DHAVE_CONFIG_H -I. -I. -I. -I./librsvg -DG_LOG_DOMAIN=\"librsvg\" -DLIBRSVG_DATADIR=\"/usr/share\" -DSRCDIR=\"/tmp/B.5g8PtW/BUILD/librsvg-2.50.6\" -DRSVG_DISABLE_DEPRECATION_WARNINGS -DRSVG_COMPILATION -pthread -I/usr/include/cairo -I/usr/include/gdk-pixbuf-2.0 -I/usr/include/libpng16 -I/usr/include/libxml2 -I/usr/include/pango-1.0 -I/usr/include/harfbuzz -I/usr/include/pango-1.0 -I/usr/include/libmount -I/usr/include/blkid -I/usr/include/fribidi -I/usr/include/cairo -I/usr/include/pixman-1 -I/usr/include/uuid -I/usr/include/freetype2 -I/usr/include/libpng16 -I/usr/include/harfbuzz -I/usr/include/glib-2.0 -I/usr/libx32/glib-2.0/include -O2 -fwrapv -pipe -Wformat -Werror=format-security -gdwarf-4 -fno-debug-types-section -fvar-tracking-assignments -g2 -Wp,-D_FORTIFY_SOURCE=2 -fstack-protector-strong --param=ssp-buffer-size=4 -Werror=trampolines -fPIC -mtune=generic -march=x86-64 -gdwarf-4 -fno-debug-types-section -fvar-tracking-assignments -g2 -MT librsvg/2_la-rsvg-base.lo -MD -MP -MF librsvg/.deps/2_la-rsvg-base.Tpo -c librsvg/rsvg-base.c -o librsvg/2_la-rsvg-base.o >/dev/null 2>&1 mv -f librsvg/.deps/2_la-rsvg-base.Tpo librsvg/.deps/2_la-rsvg-base.Plo make[2]: Leaving directory '/tmp/B.5g8PtW/BUILD/librsvg-2.50.6' make[2]: Entering directory '/tmp/B.5g8PtW/BUILD/librsvg-2.50.6' /bin/sh ./libtool --tag=CC --mode=compile x86_64-pld-linux-gnux32-gcc -DHAVE_CONFIG_H -I. -I. -I. -I./librsvg -DG_LOG_DOMAIN=\"librsvg\" -DLIBRSVG_DATADIR="\"/usr/share\"" -DSRCDIR=\""/tmp/B.5g8PtW/BUILD/librsvg-2.50.6"\" -DRSVG_DISABLE_DEPRECATION_WARNINGS -DRSVG_COMPILATION -pthread -I/usr/include/cairo -I/usr/include/gdk-pixbuf-2.0 -I/usr/include/libpng16 -I/usr/include/libxml2 -I/usr/include/pango-1.0 -I/usr/include/harfbuzz -I/usr/include/pango-1.0 -I/usr/include/libmount -I/usr/include/blkid -I/usr/include/fribidi -I/usr/include/cairo -I/usr/include/pixman-1 -I/usr/include/uuid -I/usr/include/freetype2 -I/usr/include/libpng16 -I/usr/include/harfbuzz -I/usr/include/glib-2.0 -I/usr/libx32/glib-2.0/include -O2 -fwrapv -pipe -Wformat -Werror=format-security -gdwarf-4 -fno-debug-types-section -fvar-tracking-assignments -g2 -Wp,-D_FORTIFY_SOURCE=2 -fstack-protector-strong --param=ssp-buffer-size=4 -Werror=trampolines -fPIC -mtune=generic -march=x86-64 -gdwarf-4 -fno-debug-types-section -fvar-tracking-assignments -g2 -MT librsvg/2_la-rsvg-handle.lo -MD -MP -MF librsvg/.deps/2_la-rsvg-handle.Tpo -c -o librsvg/2_la-rsvg-handle.lo `test -f 'librsvg/rsvg-handle.c' || echo './'`librsvg/rsvg-handle.c libtool: compile: x86_64-pld-linux-gnux32-gcc -DHAVE_CONFIG_H -I. -I. -I. -I./librsvg -DG_LOG_DOMAIN=\"librsvg\" -DLIBRSVG_DATADIR=\"/usr/share\" -DSRCDIR=\"/tmp/B.5g8PtW/BUILD/librsvg-2.50.6\" -DRSVG_DISABLE_DEPRECATION_WARNINGS -DRSVG_COMPILATION -pthread -I/usr/include/cairo -I/usr/include/gdk-pixbuf-2.0 -I/usr/include/libpng16 -I/usr/include/libxml2 -I/usr/include/pango-1.0 -I/usr/include/harfbuzz -I/usr/include/pango-1.0 -I/usr/include/libmount -I/usr/include/blkid -I/usr/include/fribidi -I/usr/include/cairo -I/usr/include/pixman-1 -I/usr/include/uuid -I/usr/include/freetype2 -I/usr/include/libpng16 -I/usr/include/harfbuzz -I/usr/include/glib-2.0 -I/usr/libx32/glib-2.0/include -O2 -fwrapv -pipe -Wformat -Werror=format-security -gdwarf-4 -fno-debug-types-section -fvar-tracking-assignments -g2 -Wp,-D_FORTIFY_SOURCE=2 -fstack-protector-strong --param=ssp-buffer-size=4 -Werror=trampolines -fPIC -mtune=generic -march=x86-64 -gdwarf-4 -fno-debug-types-section -fvar-tracking-assignments -g2 -MT librsvg/2_la-rsvg-handle.lo -MD -MP -MF librsvg/.deps/2_la-rsvg-handle.Tpo -c librsvg/rsvg-handle.c -fPIC -DPIC -o librsvg/.libs/2_la-rsvg-handle.o libtool: compile: x86_64-pld-linux-gnux32-gcc -DHAVE_CONFIG_H -I. -I. -I. -I./librsvg -DG_LOG_DOMAIN=\"librsvg\" -DLIBRSVG_DATADIR=\"/usr/share\" -DSRCDIR=\"/tmp/B.5g8PtW/BUILD/librsvg-2.50.6\" -DRSVG_DISABLE_DEPRECATION_WARNINGS -DRSVG_COMPILATION -pthread -I/usr/include/cairo -I/usr/include/gdk-pixbuf-2.0 -I/usr/include/libpng16 -I/usr/include/libxml2 -I/usr/include/pango-1.0 -I/usr/include/harfbuzz -I/usr/include/pango-1.0 -I/usr/include/libmount -I/usr/include/blkid -I/usr/include/fribidi -I/usr/include/cairo -I/usr/include/pixman-1 -I/usr/include/uuid -I/usr/include/freetype2 -I/usr/include/libpng16 -I/usr/include/harfbuzz -I/usr/include/glib-2.0 -I/usr/libx32/glib-2.0/include -O2 -fwrapv -pipe -Wformat -Werror=format-security -gdwarf-4 -fno-debug-types-section -fvar-tracking-assignments -g2 -Wp,-D_FORTIFY_SOURCE=2 -fstack-protector-strong --param=ssp-buffer-size=4 -Werror=trampolines -fPIC -mtune=generic -march=x86-64 -gdwarf-4 -fno-debug-types-section -fvar-tracking-assignments -g2 -MT librsvg/2_la-rsvg-handle.lo -MD -MP -MF librsvg/.deps/2_la-rsvg-handle.Tpo -c librsvg/rsvg-handle.c -o librsvg/2_la-rsvg-handle.o >/dev/null 2>&1 mv -f librsvg/.deps/2_la-rsvg-handle.Tpo librsvg/.deps/2_la-rsvg-handle.Plo make[2]: Leaving directory '/tmp/B.5g8PtW/BUILD/librsvg-2.50.6' Compiling libc v0.2.95 Compiling autocfg v1.0.1 Compiling pkg-config v0.3.19 Compiling getrandom v0.1.16 Compiling proc-macro2 v1.0.27 Compiling unicode-xid v0.2.2 Compiling proc-macro-hack v0.5.19 Compiling syn v1.0.72 Compiling cfg-if v1.0.0 Running `rustc --crate-name build_script_build /tmp/B.5g8PtW/BUILD/librsvg-2.50.6/vendor/libc/build.rs --error-format=json --json=diagnostic-rendered-ansi --crate-type bin --emit=dep-info,link -C embed-bitcode=no -C debuginfo=2 -C debug-assertions=off --cfg 'feature="default"' --cfg 'feature="std"' -C metadata=d1a5b80eee9782e3 -C extra-filename=-d1a5b80eee9782e3 --out-dir /tmp/B.5g8PtW/BUILD/librsvg-2.50.6/target/release/build/libc-d1a5b80eee9782e3 -L dependency=/tmp/B.5g8PtW/BUILD/librsvg-2.50.6/target/release/deps --cap-lints allow` Running `rustc --crate-name autocfg /tmp/B.5g8PtW/BUILD/librsvg-2.50.6/vendor/autocfg/src/lib.rs --error-format=json --json=diagnostic-rendered-ansi --crate-type lib --emit=dep-info,metadata,link -C embed-bitcode=no -C debuginfo=2 -C debug-assertions=off -C metadata=0a2d8e244a26040b -C extra-filename=-0a2d8e244a26040b --out-dir /tmp/B.5g8PtW/BUILD/librsvg-2.50.6/target/release/deps -L dependency=/tmp/B.5g8PtW/BUILD/librsvg-2.50.6/target/release/deps --cap-lints allow` Running `rustc --crate-name pkg_config /tmp/B.5g8PtW/BUILD/librsvg-2.50.6/vendor/pkg-config/src/lib.rs --error-format=json --json=diagnostic-rendered-ansi --crate-type lib --emit=dep-info,metadata,link -C embed-bitcode=no -C debuginfo=2 -C debug-assertions=off -C metadata=fdb198fade7ac212 -C extra-filename=-fdb198fade7ac212 --out-dir /tmp/B.5g8PtW/BUILD/librsvg-2.50.6/target/release/deps -L dependency=/tmp/B.5g8PtW/BUILD/librsvg-2.50.6/target/release/deps --cap-lints allow` Running `rustc --crate-name build_script_build --edition=2018 /tmp/B.5g8PtW/BUILD/librsvg-2.50.6/vendor/proc-macro2/build.rs --error-format=json --json=diagnostic-rendered-ansi --crate-type bin --emit=dep-info,link -C embed-bitcode=no -C debuginfo=2 -C debug-assertions=off --cfg 'feature="default"' --cfg 'feature="proc-macro"' -C metadata=0d88d1c5894cb4dc -C extra-filename=-0d88d1c5894cb4dc --out-dir /tmp/B.5g8PtW/BUILD/librsvg-2.50.6/target/release/build/proc-macro2-0d88d1c5894cb4dc -L dependency=/tmp/B.5g8PtW/BUILD/librsvg-2.50.6/target/release/deps --cap-lints allow` Running `rustc --crate-name build_script_build --edition=2018 /tmp/B.5g8PtW/BUILD/librsvg-2.50.6/vendor/getrandom-0.1.16/build.rs --error-format=json --json=diagnostic-rendered-ansi --crate-type bin --emit=dep-info,link -C embed-bitcode=no -C debuginfo=2 -C debug-assertions=off --cfg 'feature="std"' -C metadata=f89200e6caabb78a -C extra-filename=-f89200e6caabb78a --out-dir /tmp/B.5g8PtW/BUILD/librsvg-2.50.6/target/release/build/getrandom-f89200e6caabb78a -L dependency=/tmp/B.5g8PtW/BUILD/librsvg-2.50.6/target/release/deps --cap-lints allow` Running `rustc --crate-name unicode_xid /tmp/B.5g8PtW/BUILD/librsvg-2.50.6/vendor/unicode-xid/src/lib.rs --error-format=json --json=diagnostic-rendered-ansi,artifacts --crate-type lib --emit=dep-info,metadata,link -C embed-bitcode=no -C debuginfo=2 -C debug-assertions=off --cfg 'feature="default"' -C metadata=6b2406687329e359 -C extra-filename=-6b2406687329e359 --out-dir /tmp/B.5g8PtW/BUILD/librsvg-2.50.6/target/release/deps -L dependency=/tmp/B.5g8PtW/BUILD/librsvg-2.50.6/target/release/deps --cap-lints allow` Running `rustc --crate-name build_script_build --edition=2018 /tmp/B.5g8PtW/BUILD/librsvg-2.50.6/vendor/proc-macro-hack/build.rs --error-format=json --json=diagnostic-rendered-ansi --crate-type bin --emit=dep-info,link -C embed-bitcode=no -C debuginfo=2 -C debug-assertions=off -C metadata=c5caa49c864fdace -C extra-filename=-c5caa49c864fdace --out-dir /tmp/B.5g8PtW/BUILD/librsvg-2.50.6/target/release/build/proc-macro-hack-c5caa49c864fdace -L dependency=/tmp/B.5g8PtW/BUILD/librsvg-2.50.6/target/release/deps --cap-lints allow` Running `rustc --crate-name build_script_build --edition=2018 /tmp/B.5g8PtW/BUILD/librsvg-2.50.6/vendor/syn/build.rs --error-format=json --json=diagnostic-rendered-ansi --crate-type bin --emit=dep-info,link -C embed-bitcode=no -C debuginfo=2 -C debug-assertions=off --cfg 'feature="clone-impls"' --cfg 'feature="default"' --cfg 'feature="derive"' --cfg 'feature="extra-traits"' --cfg 'feature="fold"' --cfg 'feature="full"' --cfg 'feature="parsing"' --cfg 'feature="printing"' --cfg 'feature="proc-macro"' --cfg 'feature="quote"' --cfg 'feature="visit"' -C metadata=fa8aceaa5c061951 -C extra-filename=-fa8aceaa5c061951 --out-dir /tmp/B.5g8PtW/BUILD/librsvg-2.50.6/target/release/build/syn-fa8aceaa5c061951 -L dependency=/tmp/B.5g8PtW/BUILD/librsvg-2.50.6/target/release/deps --cap-lints allow` Running `rustc --crate-name cfg_if --edition=2018 /tmp/B.5g8PtW/BUILD/librsvg-2.50.6/vendor/cfg-if/src/lib.rs --error-format=json --json=diagnostic-rendered-ansi,artifacts --crate-type lib --emit=dep-info,metadata,link -C embed-bitcode=no -C debuginfo=2 -C debug-assertions=off -C metadata=a7e5f91ded76cf75 -C extra-filename=-a7e5f91ded76cf75 --out-dir /tmp/B.5g8PtW/BUILD/librsvg-2.50.6/target/release/deps -L dependency=/tmp/B.5g8PtW/BUILD/librsvg-2.50.6/target/release/deps --cap-lints allow` error[E0463]: can't find crate for `std` error: aborting due to previous error For more information about this error, try `rustc --explain E0463`. error[E0463]: can't find crate for `std` error: aborting due to previous error For more information about this error, try `rustc --explain E0463`. error[E0463]: can't find crate for `std` error: aborting due to previous error For more information about this error, try `rustc --explain E0463`. error[E0463]: can't find crate for `std` error: aborting due to previous error For more information about this error, try `rustc --explain E0463`. error: could not compile `libc` Caused by: process didn't exit successfully: `rustc --crate-name build_script_build /tmp/B.5g8PtW/BUILD/librsvg-2.50.6/vendor/libc/build.rs --error-format=json --json=diagnostic-rendered-ansi --crate-type bin --emit=dep-info,link -C embed-bitcode=no -C debuginfo=2 -C debug-assertions=off --cfg 'feature="default"' --cfg 'feature="std"' -C metadata=d1a5b80eee9782e3 -C extra-filename=-d1a5b80eee9782e3 --out-dir /tmp/B.5g8PtW/BUILD/librsvg-2.50.6/target/release/build/libc-d1a5b80eee9782e3 -L dependency=/tmp/B.5g8PtW/BUILD/librsvg-2.50.6/target/release/deps --cap-lints allow` (exit code: 1) warning: build failed, waiting for other jobs to finish... error[E0463]: can't find crate for `std` error: aborting due to previous error For more information about this error, try `rustc --explain E0463`. error[E0463]: can't find crate for `std` error: aborting due to previous error For more information about this error, try `rustc --explain E0463`. error[E0463]: can't find crate for `std` error: aborting due to previous error For more information about this error, try `rustc --explain E0463`. error[E0463]: can't find crate for `core` error: aborting due to previous error For more information about this error, try `rustc --explain E0463`. error[E0463]: can't find crate for `core` error: aborting due to previous error For more information about this error, try `rustc --explain E0463`. error: build failed make[2]: *** [Makefile:1780: librsvg_c_api.la] Error 101 make[1]: *** [Makefile:1277: all-recursive] Error 1 make: *** [Makefile:828: all] Error 2 error: Bad exit status from /tmp/B.5g8PtW/BUILD/tmp/rpm-tmp.xzEohA (%build) RPM build errors: line 67: It's not recommended to have unversioned Obsoletes: Obsoletes: librsvg0 line 110: It's not recommended to have unversioned Obsoletes: Obsoletes: librsvg0-devel Could not canonicalize hostname: naiad Bad exit status from /tmp/B.5g8PtW/BUILD/tmp/rpm-tmp.xzEohA (%build) ended at: Thu May 27 22:32:56 2021, done in 0:00:19.087549 error: No files produced. + chmod -R u+rwX /tmp/B.5g8PtW/BUILD + rm -rf /tmp/B.5g8PtW/tmp /tmp/B.5g8PtW/BUILD + rm -rf /tmp/B.5g8PtW Begin-PLD-Builder-Info Build-Time: user:38.91s sys:7.86s real:50.21s (faults io:78 non-io:1240424) End-PLD-Builder-Info
[Back to list of logs] [View rpm -qa of builder]