FailedOk

th/SRPMS[OK]
th/x32[OK]
th/i686[OK]
th/x86_64[OK]

ac/SRPMS[OK]
ac/i386[OK]
ac/i586[OK]
ac/i686[OK]
ac/alpha[OK]
ac/amd64[OK]
ac/athlon[OK]
ac/ppc[OK]
ac/sparc[OK]
ac/sparc64[OK]

Advanced Search
main()
Powered by PLD Linux
(c) 2002-2021 PLD Team
$Revision: 1.37 $
Powered by The Golden Path.
Your IP: 18.206.238.77

lttng-modules 444c2f2c-6658-427f-bd9a-1dd6fbe664c9

Status:Failed
Source URL:https://buildlogs.pld-linux.org/pld/th/x32/FAIL/lttng-modules,444c2f2c-6658-427f-bd9a-1dd6fbe664c9.bz2
text/plain URL:View!
rpm -qa of builder:View!
Date:2021/05/03 04:14:29
Runtime:0:08:11.556035

Toc:

  • prep
  • Executing(%prep): /bin/sh -e /tmp/B.bNSdI9/BUILD/tmp/rpm-tmp.tLYF9m
  • build
  • Executing(%build): /bin/sh -e /tmp/B.bNSdI9/BUILD/tmp/rpm-tmp.NNypre
  • error 1
  • - SSL error:02001002:system library:fopen:No such file or directory: crypto/bio/bss_file.c:69
  • error 2
  • - SSL error:2006D080:BIO routines:BIO_new_file:no such file: crypto/bio/bss_file.c:76
  • error 3
  • - SSL error:02001002:system library:fopen:No such file or directory: crypto/bio/bss_file.c:69
  • error 4
  • - SSL error:2006D080:BIO routines:BIO_new_file:no such file: crypto/bio/bss_file.c:76
  • error 5
  • - SSL error:02001002:system library:fopen:No such file or directory: crypto/bio/bss_file.c:69
  • error 6
  • - SSL error:2006D080:BIO routines:BIO_new_file:no such file: crypto/bio/bss_file.c:76
  • error 7
  • - SSL error:02001002:system library:fopen:No such file or directory: crypto/bio/bss_file.c:69
  • error 8
  • - SSL error:2006D080:BIO routines:BIO_new_file:no such file: crypto/bio/bss_file.c:76
  • error 9
  • - SSL error:02001002:system library:fopen:No such file or directory: crypto/bio/bss_file.c:69
  • error 10
  • - SSL error:2006D080:BIO routines:BIO_new_file:no such file: crypto/bio/bss_file.c:76
  • error 11
  • - SSL error:02001002:system library:fopen:No such file or directory: crypto/bio/bss_file.c:69
  • error 12
  • - SSL error:2006D080:BIO routines:BIO_new_file:no such file: crypto/bio/bss_file.c:76
  • error 13
  • - SSL error:02001002:system library:fopen:No such file or directory: crypto/bio/bss_file.c:69
  • error 14
  • - SSL error:2006D080:BIO routines:BIO_new_file:no such file: crypto/bio/bss_file.c:76
  • error 15
  • - SSL error:02001002:system library:fopen:No such file or directory: crypto/bio/bss_file.c:69
  • error 16
  • - SSL error:2006D080:BIO routines:BIO_new_file:no such file: crypto/bio/bss_file.c:76
  • error 17
  • - SSL error:02001002:system library:fopen:No such file or directory: crypto/bio/bss_file.c:69
  • error 18
  • - SSL error:2006D080:BIO routines:BIO_new_file:no such file: crypto/bio/bss_file.c:76
  • error 19
  • - SSL error:02001002:system library:fopen:No such file or directory: crypto/bio/bss_file.c:69
  • error 20
  • - SSL error:2006D080:BIO routines:BIO_new_file:no such file: crypto/bio/bss_file.c:76
  • error 21
  • - SSL error:02001002:system library:fopen:No such file or directory: crypto/bio/bss_file.c:69
  • error 22
  • - SSL error:2006D080:BIO routines:BIO_new_file:no such file: crypto/bio/bss_file.c:76
  • error 23
  • - SSL error:02001002:system library:fopen:No such file or directory: crypto/bio/bss_file.c:69
  • error 24
  • - SSL error:2006D080:BIO routines:BIO_new_file:no such file: crypto/bio/bss_file.c:76
  • error 25
  • - SSL error:02001002:system library:fopen:No such file or directory: crypto/bio/bss_file.c:69
  • error 26
  • - SSL error:2006D080:BIO routines:BIO_new_file:no such file: crypto/bio/bss_file.c:76
  • error 27
  • - SSL error:02001002:system library:fopen:No such file or directory: crypto/bio/bss_file.c:69
  • error 28
  • - SSL error:2006D080:BIO routines:BIO_new_file:no such file: crypto/bio/bss_file.c:76
  • error 29
  • - SSL error:02001002:system library:fopen:No such file or directory: crypto/bio/bss_file.c:69
  • error 30
  • - SSL error:2006D080:BIO routines:BIO_new_file:no such file: crypto/bio/bss_file.c:76
  • error 31
  • - SSL error:02001002:system library:fopen:No such file or directory: crypto/bio/bss_file.c:69
  • error 32
  • - SSL error:2006D080:BIO routines:BIO_new_file:no such file: crypto/bio/bss_file.c:76
  • error 33
  • - SSL error:02001002:system library:fopen:No such file or directory: crypto/bio/bss_file.c:69
  • error 34
  • - SSL error:2006D080:BIO routines:BIO_new_file:no such file: crypto/bio/bss_file.c:76
  • error 35
  • - SSL error:02001002:system library:fopen:No such file or directory: crypto/bio/bss_file.c:69
  • error 36
  • - SSL error:2006D080:BIO routines:BIO_new_file:no such file: crypto/bio/bss_file.c:76
  • error 37
  • - SSL error:02001002:system library:fopen:No such file or directory: crypto/bio/bss_file.c:69
  • error 38
  • - SSL error:2006D080:BIO routines:BIO_new_file:no such file: crypto/bio/bss_file.c:76
  • error 39
  • - SSL error:02001002:system library:fopen:No such file or directory: crypto/bio/bss_file.c:69
  • error 40
  • - SSL error:2006D080:BIO routines:BIO_new_file:no such file: crypto/bio/bss_file.c:76
  • error 41
  • - SSL error:02001002:system library:fopen:No such file or directory: crypto/bio/bss_file.c:69
  • error 42
  • - SSL error:2006D080:BIO routines:BIO_new_file:no such file: crypto/bio/bss_file.c:76
  • error 43
  • - SSL error:02001002:system library:fopen:No such file or directory: crypto/bio/bss_file.c:69
  • error 44
  • - SSL error:2006D080:BIO routines:BIO_new_file:no such file: crypto/bio/bss_file.c:76
  • error 45
  • - SSL error:02001002:system library:fopen:No such file or directory: crypto/bio/bss_file.c:69
  • error 46
  • - SSL error:2006D080:BIO routines:BIO_new_file:no such file: crypto/bio/bss_file.c:76
  • error 47
  • - SSL error:02001002:system library:fopen:No such file or directory: crypto/bio/bss_file.c:69
  • error 48
  • - SSL error:2006D080:BIO routines:BIO_new_file:no such file: crypto/bio/bss_file.c:76
  • error 49
  • - SSL error:02001002:system library:fopen:No such file or directory: crypto/bio/bss_file.c:69
  • error 50
  • - SSL error:2006D080:BIO routines:BIO_new_file:no such file: crypto/bio/bss_file.c:76
  • error 51
  • - SSL error:02001002:system library:fopen:No such file or directory: crypto/bio/bss_file.c:69
  • error 52
  • - SSL error:2006D080:BIO routines:BIO_new_file:no such file: crypto/bio/bss_file.c:76
  • error 53
  • - SSL error:02001002:system library:fopen:No such file or directory: crypto/bio/bss_file.c:69
  • error 54
  • - SSL error:2006D080:BIO routines:BIO_new_file:no such file: crypto/bio/bss_file.c:76
  • error 55
  • - SSL error:02001002:system library:fopen:No such file or directory: crypto/bio/bss_file.c:69
  • error 56
  • - SSL error:2006D080:BIO routines:BIO_new_file:no such file: crypto/bio/bss_file.c:76
  • error 57
  • - SSL error:02001002:system library:fopen:No such file or directory: crypto/bio/bss_file.c:69
  • error 58
  • - SSL error:2006D080:BIO routines:BIO_new_file:no such file: crypto/bio/bss_file.c:76
  • error 59
  • - SSL error:02001002:system library:fopen:No such file or directory: crypto/bio/bss_file.c:69
  • error 60
  • - SSL error:2006D080:BIO routines:BIO_new_file:no such file: crypto/bio/bss_file.c:76
  • error 61
  • - SSL error:02001002:system library:fopen:No such file or directory: crypto/bio/bss_file.c:69
  • error 62
  • - SSL error:2006D080:BIO routines:BIO_new_file:no such file: crypto/bio/bss_file.c:76
  • error 63
  • - SSL error:02001002:system library:fopen:No such file or directory: crypto/bio/bss_file.c:69
  • error 64
  • - SSL error:2006D080:BIO routines:BIO_new_file:no such file: crypto/bio/bss_file.c:76
  • error 65
  • - SSL error:02001002:system library:fopen:No such file or directory: crypto/bio/bss_file.c:69
  • error 66
  • - SSL error:2006D080:BIO routines:BIO_new_file:no such file: crypto/bio/bss_file.c:76
  • error 67
  • - SSL error:02001002:system library:fopen:No such file or directory: crypto/bio/bss_file.c:69
  • error 68
  • - SSL error:2006D080:BIO routines:BIO_new_file:no such file: crypto/bio/bss_file.c:76
  • error 69
  • - SSL error:02001002:system library:fopen:No such file or directory: crypto/bio/bss_file.c:69
  • error 70
  • - SSL error:2006D080:BIO routines:BIO_new_file:no such file: crypto/bio/bss_file.c:76
  • error 71
  • - SSL error:02001002:system library:fopen:No such file or directory: crypto/bio/bss_file.c:69
  • error 72
  • - SSL error:2006D080:BIO routines:BIO_new_file:no such file: crypto/bio/bss_file.c:76
  • error 73
  • - SSL error:02001002:system library:fopen:No such file or directory: crypto/bio/bss_file.c:69
  • error 74
  • - SSL error:2006D080:BIO routines:BIO_new_file:no such file: crypto/bio/bss_file.c:76
  • error 75
  • - SSL error:02001002:system library:fopen:No such file or directory: crypto/bio/bss_file.c:69
  • error 76
  • - SSL error:2006D080:BIO routines:BIO_new_file:no such file: crypto/bio/bss_file.c:76
  • error 77
  • - SSL error:02001002:system library:fopen:No such file or directory: crypto/bio/bss_file.c:69
  • error 78
  • - SSL error:2006D080:BIO routines:BIO_new_file:no such file: crypto/bio/bss_file.c:76
  • error 79
  • - SSL error:02001002:system library:fopen:No such file or directory: crypto/bio/bss_file.c:69
  • error 80
  • - SSL error:2006D080:BIO routines:BIO_new_file:no such file: crypto/bio/bss_file.c:76
  • error 81
  • - SSL error:02001002:system library:fopen:No such file or directory: crypto/bio/bss_file.c:69
  • error 82
  • - SSL error:2006D080:BIO routines:BIO_new_file:no such file: crypto/bio/bss_file.c:76
  • error 83
  • - SSL error:02001002:system library:fopen:No such file or directory: crypto/bio/bss_file.c:69
  • error 84
  • - SSL error:2006D080:BIO routines:BIO_new_file:no such file: crypto/bio/bss_file.c:76
  • error 85
  • - SSL error:02001002:system library:fopen:No such file or directory: crypto/bio/bss_file.c:69
  • error 86
  • - SSL error:2006D080:BIO routines:BIO_new_file:no such file: crypto/bio/bss_file.c:76
  • error 87
  • - SSL error:02001002:system library:fopen:No such file or directory: crypto/bio/bss_file.c:69
  • error 88
  • - SSL error:2006D080:BIO routines:BIO_new_file:no such file: crypto/bio/bss_file.c:76
  • error 89
  • - SSL error:02001002:system library:fopen:No such file or directory: crypto/bio/bss_file.c:69
  • error 90
  • - SSL error:2006D080:BIO routines:BIO_new_file:no such file: crypto/bio/bss_file.c:76
  • error 91
  • - SSL error:02001002:system library:fopen:No such file or directory: crypto/bio/bss_file.c:69
  • error 92
  • - SSL error:2006D080:BIO routines:BIO_new_file:no such file: crypto/bio/bss_file.c:76
  • error 93
  • - SSL error:02001002:system library:fopen:No such file or directory: crypto/bio/bss_file.c:69
  • error 94
  • - SSL error:2006D080:BIO routines:BIO_new_file:no such file: crypto/bio/bss_file.c:76
  • error 95
  • - SSL error:02001002:system library:fopen:No such file or directory: crypto/bio/bss_file.c:69
  • error 96
  • - SSL error:2006D080:BIO routines:BIO_new_file:no such file: crypto/bio/bss_file.c:76
  • error 97
  • - SSL error:02001002:system library:fopen:No such file or directory: crypto/bio/bss_file.c:69
  • error 98
  • - SSL error:2006D080:BIO routines:BIO_new_file:no such file: crypto/bio/bss_file.c:76
  • error 99
  • - SSL error:02001002:system library:fopen:No such file or directory: crypto/bio/bss_file.c:69
  • error 100
  • - SSL error:2006D080:BIO routines:BIO_new_file:no such file: crypto/bio/bss_file.c:76
  • error 101
  • - SSL error:02001002:system library:fopen:No such file or directory: crypto/bio/bss_file.c:69
  • error 102
  • - SSL error:2006D080:BIO routines:BIO_new_file:no such file: crypto/bio/bss_file.c:76
  • error 103
  • - SSL error:02001002:system library:fopen:No such file or directory: crypto/bio/bss_file.c:69
  • error 104
  • - SSL error:2006D080:BIO routines:BIO_new_file:no such file: crypto/bio/bss_file.c:76
  • error 105
  • - SSL error:02001002:system library:fopen:No such file or directory: crypto/bio/bss_file.c:69
  • error 106
  • - SSL error:2006D080:BIO routines:BIO_new_file:no such file: crypto/bio/bss_file.c:76
  • error 107
  • - SSL error:02001002:system library:fopen:No such file or directory: crypto/bio/bss_file.c:69
  • error 108
  • - SSL error:2006D080:BIO routines:BIO_new_file:no such file: crypto/bio/bss_file.c:76
  • error 109
  • - SSL error:02001002:system library:fopen:No such file or directory: crypto/bio/bss_file.c:69
  • error 110
  • - SSL error:2006D080:BIO routines:BIO_new_file:no such file: crypto/bio/bss_file.c:76
  • error 111
  • - SSL error:02001002:system library:fopen:No such file or directory: crypto/bio/bss_file.c:69
  • error 112
  • - SSL error:2006D080:BIO routines:BIO_new_file:no such file: crypto/bio/bss_file.c:76
  • error 113
  • - SSL error:02001002:system library:fopen:No such file or directory: crypto/bio/bss_file.c:69
  • error 114
  • - SSL error:2006D080:BIO routines:BIO_new_file:no such file: crypto/bio/bss_file.c:76
  • error 115
  • - SSL error:02001002:system library:fopen:No such file or directory: crypto/bio/bss_file.c:69
  • error 116
  • - SSL error:2006D080:BIO routines:BIO_new_file:no such file: crypto/bio/bss_file.c:76
  • error 117
  • - SSL error:02001002:system library:fopen:No such file or directory: crypto/bio/bss_file.c:69
  • error 118
  • - SSL error:2006D080:BIO routines:BIO_new_file:no such file: crypto/bio/bss_file.c:76
  • error 119
  • - SSL error:02001002:system library:fopen:No such file or directory: crypto/bio/bss_file.c:69
  • error 120
  • - SSL error:2006D080:BIO routines:BIO_new_file:no such file: crypto/bio/bss_file.c:76
  • error 121
  • - SSL error:02001002:system library:fopen:No such file or directory: crypto/bio/bss_file.c:69
  • error 122
  • - SSL error:2006D080:BIO routines:BIO_new_file:no such file: crypto/bio/bss_file.c:76
  • error 123
  • - SSL error:02001002:system library:fopen:No such file or directory: crypto/bio/bss_file.c:69
  • error 124
  • - SSL error:2006D080:BIO routines:BIO_new_file:no such file: crypto/bio/bss_file.c:76
  • error 125
  • - SSL error:02001002:system library:fopen:No such file or directory: crypto/bio/bss_file.c:69
  • error 126
  • - SSL error:2006D080:BIO routines:BIO_new_file:no such file: crypto/bio/bss_file.c:76
  • error 127
  • - SSL error:02001002:system library:fopen:No such file or directory: crypto/bio/bss_file.c:69
  • error 128
  • - SSL error:2006D080:BIO routines:BIO_new_file:no such file: crypto/bio/bss_file.c:76
  • error 129
  • - SSL error:02001002:system library:fopen:No such file or directory: crypto/bio/bss_file.c:69
  • error 130
  • - SSL error:2006D080:BIO routines:BIO_new_file:no such file: crypto/bio/bss_file.c:76
  • error 131
  • - SSL error:02001002:system library:fopen:No such file or directory: crypto/bio/bss_file.c:69
  • error 132
  • - SSL error:2006D080:BIO routines:BIO_new_file:no such file: crypto/bio/bss_file.c:76
  • error 133
  • - SSL error:02001002:system library:fopen:No such file or directory: crypto/bio/bss_file.c:69
  • error 134
  • - SSL error:2006D080:BIO routines:BIO_new_file:no such file: crypto/bio/bss_file.c:76
  • error 135
  • - SSL error:02001002:system library:fopen:No such file or directory: crypto/bio/bss_file.c:69
  • error 136
  • - SSL error:2006D080:BIO routines:BIO_new_file:no such file: crypto/bio/bss_file.c:76
  • error 137
  • - SSL error:02001002:system library:fopen:No such file or directory: crypto/bio/bss_file.c:69
  • error 138
  • - SSL error:2006D080:BIO routines:BIO_new_file:no such file: crypto/bio/bss_file.c:76
  • error 139
  • - SSL error:02001002:system library:fopen:No such file or directory: crypto/bio/bss_file.c:69
  • error 140
  • - SSL error:2006D080:BIO routines:BIO_new_file:no such file: crypto/bio/bss_file.c:76
  • error 141
  • - SSL error:02001002:system library:fopen:No such file or directory: crypto/bio/bss_file.c:69
  • error 142
  • - SSL error:2006D080:BIO routines:BIO_new_file:no such file: crypto/bio/bss_file.c:76
  • error 143
  • - SSL error:02001002:system library:fopen:No such file or directory: crypto/bio/bss_file.c:69
  • error 144
  • - SSL error:2006D080:BIO routines:BIO_new_file:no such file: crypto/bio/bss_file.c:76
  • error 145
  • - SSL error:02001002:system library:fopen:No such file or directory: crypto/bio/bss_file.c:69
  • error 146
  • - SSL error:2006D080:BIO routines:BIO_new_file:no such file: crypto/bio/bss_file.c:76
  • error 147
  • - SSL error:02001002:system library:fopen:No such file or directory: crypto/bio/bss_file.c:69
  • error 148
  • - SSL error:2006D080:BIO routines:BIO_new_file:no such file: crypto/bio/bss_file.c:76
  • error 149
  • - SSL error:02001002:system library:fopen:No such file or directory: crypto/bio/bss_file.c:69
  • error 150
  • - SSL error:2006D080:BIO routines:BIO_new_file:no such file: crypto/bio/bss_file.c:76
  • error 151
  • - SSL error:02001002:system library:fopen:No such file or directory: crypto/bio/bss_file.c:69
  • error 152
  • - SSL error:2006D080:BIO routines:BIO_new_file:no such file: crypto/bio/bss_file.c:76
  • error 153
  • - SSL error:02001002:system library:fopen:No such file or directory: crypto/bio/bss_file.c:69
  • error 154
  • - SSL error:2006D080:BIO routines:BIO_new_file:no such file: crypto/bio/bss_file.c:76
  • error 155
  • - SSL error:02001002:system library:fopen:No such file or directory: crypto/bio/bss_file.c:69
  • error 156
  • - SSL error:2006D080:BIO routines:BIO_new_file:no such file: crypto/bio/bss_file.c:76
  • error 157
  • - SSL error:02001002:system library:fopen:No such file or directory: crypto/bio/bss_file.c:69
  • error 158
  • - SSL error:2006D080:BIO routines:BIO_new_file:no such file: crypto/bio/bss_file.c:76
  • error 159
  • - SSL error:02001002:system library:fopen:No such file or directory: crypto/bio/bss_file.c:69
  • error 160
  • - SSL error:2006D080:BIO routines:BIO_new_file:no such file: crypto/bio/bss_file.c:76
  • error 161
  • - SSL error:02001002:system library:fopen:No such file or directory: crypto/bio/bss_file.c:69
  • error 162
  • - SSL error:2006D080:BIO routines:BIO_new_file:no such file: crypto/bio/bss_file.c:76
  • error 163
  • - SSL error:02001002:system library:fopen:No such file or directory: crypto/bio/bss_file.c:69
  • error 164
  • - SSL error:2006D080:BIO routines:BIO_new_file:no such file: crypto/bio/bss_file.c:76
  • error 165
  • - SSL error:02001002:system library:fopen:No such file or directory: crypto/bio/bss_file.c:69
  • error 166
  • - SSL error:2006D080:BIO routines:BIO_new_file:no such file: crypto/bio/bss_file.c:76
  • error 167
  • - SSL error:02001002:system library:fopen:No such file or directory: crypto/bio/bss_file.c:69
  • error 168
  • - SSL error:2006D080:BIO routines:BIO_new_file:no such file: crypto/bio/bss_file.c:76
  • error 169
  • - SSL error:02001002:system library:fopen:No such file or directory: crypto/bio/bss_file.c:69
  • error 170
  • - SSL error:2006D080:BIO routines:BIO_new_file:no such file: crypto/bio/bss_file.c:76
  • error 171
  • - SSL error:02001002:system library:fopen:No such file or directory: crypto/bio/bss_file.c:69
  • error 172
  • - SSL error:2006D080:BIO routines:BIO_new_file:no such file: crypto/bio/bss_file.c:76
  • error 173
  • - SSL error:02001002:system library:fopen:No such file or directory: crypto/bio/bss_file.c:69
  • error 174
  • - SSL error:2006D080:BIO routines:BIO_new_file:no such file: crypto/bio/bss_file.c:76
  • error 175
  • - SSL error:02001002:system library:fopen:No such file or directory: crypto/bio/bss_file.c:69
  • error 176
  • - SSL error:2006D080:BIO routines:BIO_new_file:no such file: crypto/bio/bss_file.c:76
  • error 177
  • - SSL error:02001002:system library:fopen:No such file or directory: crypto/bio/bss_file.c:69
  • error 178
  • - SSL error:2006D080:BIO routines:BIO_new_file:no such file: crypto/bio/bss_file.c:76
  • error 179
  • - SSL error:02001002:system library:fopen:No such file or directory: crypto/bio/bss_file.c:69
  • error 180
  • - SSL error:2006D080:BIO routines:BIO_new_file:no such file: crypto/bio/bss_file.c:76
  • error 181
  • - SSL error:02001002:system library:fopen:No such file or directory: crypto/bio/bss_file.c:69
  • error 182
  • - SSL error:2006D080:BIO routines:BIO_new_file:no such file: crypto/bio/bss_file.c:76
  • error 183
  • - SSL error:02001002:system library:fopen:No such file or directory: crypto/bio/bss_file.c:69
  • error 184
  • - SSL error:2006D080:BIO routines:BIO_new_file:no such file: crypto/bio/bss_file.c:76
  • error 185
  • - SSL error:02001002:system library:fopen:No such file or directory: crypto/bio/bss_file.c:69
  • error 186
  • - SSL error:2006D080:BIO routines:BIO_new_file:no such file: crypto/bio/bss_file.c:76
  • error 187
  • - SSL error:02001002:system library:fopen:No such file or directory: crypto/bio/bss_file.c:69
  • error 188
  • - SSL error:2006D080:BIO routines:BIO_new_file:no such file: crypto/bio/bss_file.c:76
  • error 189
  • - SSL error:02001002:system library:fopen:No such file or directory: crypto/bio/bss_file.c:69
  • error 190
  • - SSL error:2006D080:BIO routines:BIO_new_file:no such file: crypto/bio/bss_file.c:76
  • error 191
  • - SSL error:02001002:system library:fopen:No such file or directory: crypto/bio/bss_file.c:69
  • error 192
  • - SSL error:2006D080:BIO routines:BIO_new_file:no such file: crypto/bio/bss_file.c:76
  • error 193
  • - SSL error:02001002:system library:fopen:No such file or directory: crypto/bio/bss_file.c:69
  • error 194
  • - SSL error:2006D080:BIO routines:BIO_new_file:no such file: crypto/bio/bss_file.c:76
  • error 195
  • - SSL error:02001002:system library:fopen:No such file or directory: crypto/bio/bss_file.c:69
  • error 196
  • - SSL error:2006D080:BIO routines:BIO_new_file:no such file: crypto/bio/bss_file.c:76
  • error 197
  • - SSL error:02001002:system library:fopen:No such file or directory: crypto/bio/bss_file.c:69
  • error 198
  • - SSL error:2006D080:BIO routines:BIO_new_file:no such file: crypto/bio/bss_file.c:76
  • error 199
  • - SSL error:02001002:system library:fopen:No such file or directory: crypto/bio/bss_file.c:69
  • error 200
  • - SSL error:2006D080:BIO routines:BIO_new_file:no such file: crypto/bio/bss_file.c:76
  • error 201
  • - SSL error:02001002:system library:fopen:No such file or directory: crypto/bio/bss_file.c:69
  • error 202
  • - SSL error:2006D080:BIO routines:BIO_new_file:no such file: crypto/bio/bss_file.c:76
  • error 203
  • - SSL error:02001002:system library:fopen:No such file or directory: crypto/bio/bss_file.c:69
  • error 204
  • - SSL error:2006D080:BIO routines:BIO_new_file:no such file: crypto/bio/bss_file.c:76
  • error 205
  • - SSL error:02001002:system library:fopen:No such file or directory: crypto/bio/bss_file.c:69
  • error 206
  • - SSL error:2006D080:BIO routines:BIO_new_file:no such file: crypto/bio/bss_file.c:76
  • error 207
  • - SSL error:02001002:system library:fopen:No such file or directory: crypto/bio/bss_file.c:69
  • error 208
  • - SSL error:2006D080:BIO routines:BIO_new_file:no such file: crypto/bio/bss_file.c:76
  • error 209
  • - SSL error:02001002:system library:fopen:No such file or directory: crypto/bio/bss_file.c:69
  • error 210
  • - SSL error:2006D080:BIO routines:BIO_new_file:no such file: crypto/bio/bss_file.c:76
  • error 211
  • - SSL error:02001002:system library:fopen:No such file or directory: crypto/bio/bss_file.c:69
  • error 212
  • - SSL error:2006D080:BIO routines:BIO_new_file:no such file: crypto/bio/bss_file.c:76
  • error 213
  • - SSL error:02001002:system library:fopen:No such file or directory: crypto/bio/bss_file.c:69
  • error 214
  • - SSL error:2006D080:BIO routines:BIO_new_file:no such file: crypto/bio/bss_file.c:76
  • error 215
  • - SSL error:02001002:system library:fopen:No such file or directory: crypto/bio/bss_file.c:69
  • error 216
  • - SSL error:2006D080:BIO routines:BIO_new_file:no such file: crypto/bio/bss_file.c:76
  • error 217
  • /tmp/B.bNSdI9/BUILD/lttng-modules-2.12.5/lttng-modules-2.12.5/probes/../probes/lttng-tracepoint-event-impl.h:131:6: error: conflicting types for 'trace_kmem_cache_free'
  • error 218
  • make[3]: *** [scripts/Makefile.build:271: /tmp/B.bNSdI9/BUILD/lttng-modules-2.12.5/lttng-modules-2.12.5/probes/lttng-probe-kmem.o] Error 1
  • error 219
  • make[2]: *** [scripts/Makefile.build:514: /tmp/B.bNSdI9/BUILD/lttng-modules-2.12.5/lttng-modules-2.12.5/probes] Error 2
  • error 220
  • make[1]: *** [Makefile:1851: /tmp/B.bNSdI9/BUILD/lttng-modules-2.12.5/lttng-modules-2.12.5] Error 2
  • error 221
  • error: Bad exit status from /tmp/B.bNSdI9/BUILD/tmp/rpm-tmp.NNypre (%build)
  • error 222
  • RPM build errors:
  • error 223
  • error: No files produced.

Content:

request from: baggins
checking if we should skip the build
started at: Mon May  3 04:05:56 2021
killing old processes on a builder
sending signal 9 to pid -1
cleaning up /tmp
fetching https://srcbuilder.pld-linux.org/th//srpms/444c2f2c-6658-427f-bd9a-1dd6fbe664c9/lttng-modules-2.12.5-1%405.12.1_1.src.rpm
fetched 328828 bytes, 830.6 K/s
installing srpm: lttng-modules-2.12.5-1@5.12.1_1.src.rpm
+ install -d /tmp/B.bNSdI9/BUILD /tmp/B.bNSdI9/RPMS
+ LC_ALL=en_US.UTF-8
+ rpm -qp --changelog lttng-modules-2.12.5-1@5.12.1_1.src.rpm
* Sun May 02 2021 PLD Linux Team <feedback@pld-linux.org>
- For complete changelog see: http://git.pld-linux.org/?p=packages/lttng-modules.git;a=log;h=master
* Wed Feb 24 2021 Jan Rękorajski <baggins@pld-linux.org> 783d54c
- up to 2.12.5 * Sat Feb 06 2021 Jan Rękorajski <baggins@pld-linux.org> abf0d8a
- fix building with kernel 4.9.256 - rel 2 * Sat Nov 28 2020 Jan Rękorajski <baggins@pld-linux.org> b704ebb
- up to 2.2.13 + latest fixes * Sat Sep 26 2020 Jan Rękorajski <baggins@pld-linux.org> f9dfa75
- add fixes from upstream git with fixes to build modules on recent kernels - rel 2 * Sun Aug 16 2020 Jan Rękorajski <baggins@pld-linux.org> aa9cd3d
- up to 2.12.2 * Fri Jun 05 2020 Jan Rękorajski <baggins@pld-linux.org> 10babb8
- up to 2.12.1 * Tue Apr 14 2020 Jakub Bogusz <qboosh@pld-linux.org> 9a3ded0
- updated to 2.12.0 (for Linux 3.0+; ftrace integration dropped) - removed obsolete kernel-5.5.3 patch * Sat Apr 04 2020 Jan Rękorajski <baggins@pld-linux.org> 3efbae2
- up to 2.11.2 * Sun Feb 23 2020 Jan Rękorajski <baggins@pld-linux.org> 87b6b5d
- fix version macro * Sun Feb 23 2020 Jan Rękorajski <baggins@pld-linux.org> e66d568
- 4.14 doesn't need this * Sun Feb 23 2020 Jan Rękorajski <baggins@pld-linux.org> 50a7834
- enable fix on all kernels * Sun Feb 23 2020 Jan Rękorajski <baggins@pld-linux.org> 0c8875f
- 5.4 also needs this * Sun Feb 23 2020 Jan Rękorajski <baggins@pld-linux.org> bbbacb5
- fix paths in patch * Sun Feb 23 2020 Jan Rękorajski <baggins@pld-linux.org> d4618bf
- fix building with kernel 5.5.3+ - rel 2 * Wed Jan 29 2020 Jan Rękorajski <baggins@pld-linux.org> 4144a1b
- up to 2.11.1 * Sun Dec 01 2019 Jan Rękorajski <baggins@pld-linux.org> b91196d
- rework build dirs to make sure we clean them between building for different kernels - rel 2 * Sat Nov 30 2019 Jan Rękorajski <baggins@pld-linux.org> 04f5de0
- up to 2.11.0 * Sat Oct 26 2019 Jakub Bogusz <qboosh@pld-linux.org> e3bbd49
- updated to 2.10.12 * Fri Jul 12 2019 Jan Rękorajski <baggins@pld-linux.org> 882dfc8
- up to 2.10.10 * Tue May 07 2019 Jan Rękorajski <baggins@pld-linux.org> 8cdc335
- fix building with kernel 5.1 - rel 2 + rpm -Uhv --nodeps --define '_topdir /tmp/B.bNSdI9' --define '_specdir %{_topdir}' --define '_sourcedir %{_specdir}' --define '_rpmdir %{_topdir}/RPMS' --define '_builddir %{_topdir}/BUILD' --without userspace --define 'build_kernels 5.4,4.9,4.19,4.14,5.10,head' lttng-modules-2.12.5-1@5.12.1_1.src.rpm Updating / installing... lttng-modules-2.12.5-1@5.12.1_1 ######################################## + rm -f lttng-modules-2.12.5-1@5.12.1_1.src.rpm + install -m 700 -d /tmp/B.bNSdI9/BUILD/tmp + TMPDIR=/tmp/B.bNSdI9/BUILD/tmp + exec nice -n 0 rpmbuild -bp --short-circuit --nodeps --define '_topdir /tmp/B.bNSdI9' --define '_specdir %{_topdir}' --define '_sourcedir %{_specdir}' --define '_rpmdir %{_topdir}/RPMS' --define '_builddir %{_topdir}/BUILD' --without userspace --target x32-pld-linux --define 'build_kernels 5.4,4.9,4.19,4.14,5.10,head' --define 'prep exit 0' /tmp/B.bNSdI9/lttng-modules.spec warning: Could not canonicalize hostname: naiad Building target platforms: x32-pld-linux Building for target x32-pld-linux checking BuildConflict-ing packages no BuildConflicts found checking BR rpm: warning: Could not canonicalize hostname: naiad rpm: Building target platforms: x32-pld-linux rpm: Building for target x32-pld-linux no BR needed building RPM using: set -ex; : build-id: 444c2f2c-6658-427f-bd9a-1dd6fbe664c9; TMPDIR=/tmp/B.bNSdI9/BUILD/tmp exec nice -n 0 rpmbuild -bb --define '_smp_mflags -j9' --define '_make_opts -Otarget' --define '_pld_builder 1' --define '_topdir /tmp/B.bNSdI9' --define '_specdir %{_topdir}' --define '_sourcedir %{_specdir}' --define '_rpmdir %{_topdir}/RPMS' --define '_builddir %{_topdir}/BUILD' --without userspace --target x32-pld-linux --define 'build_kernels 5.4,4.9,4.19,4.14,5.10,head' /tmp/B.bNSdI9/lttng-modules.spec + : build-id: 444c2f2c-6658-427f-bd9a-1dd6fbe664c9 + TMPDIR=/tmp/B.bNSdI9/BUILD/tmp + exec nice -n 0 rpmbuild -bb --define '_smp_mflags -j9' --define '_make_opts -Otarget' --define '_pld_builder 1' --define '_topdir /tmp/B.bNSdI9' --define '_specdir %{_topdir}' --define '_sourcedir %{_specdir}' --define '_rpmdir %{_topdir}/RPMS' --define '_builddir %{_topdir}/BUILD' --without userspace --target x32-pld-linux --define 'build_kernels 5.4,4.9,4.19,4.14,5.10,head' /tmp/B.bNSdI9/lttng-modules.spec warning: Could not canonicalize hostname: naiad Building target platforms: x32-pld-linux Building for target x32-pld-linux Executing(%prep): /bin/sh -e /tmp/B.bNSdI9/BUILD/tmp/rpm-tmp.tLYF9m + umask 022 + cd /tmp/B.bNSdI9/BUILD + cd /tmp/B.bNSdI9/BUILD + rm -rf lttng-modules-2.12.5 + /bin/mkdir -p lttng-modules-2.12.5 + cd lttng-modules-2.12.5 + /usr/bin/bzip2 -dc /tmp/B.bNSdI9/lttng-modules-2.12.5.tar.bz2 + /bin/tar -xof - + STATUS=0 + '[' 0 -ne 0 ']' + /bin/chmod -Rf a+rX,u+w,g-w,o-w . + cd lttng-modules-2.12.5 + echo 'Patch #0 (build.patch):' Patch #0 (build.patch): + </tmp/B.bNSdI9/build.patch + /usr/bin/patch -s -p1 '--fuzz=0' + RPM_EC=0 + jobs -p + exit 0 Executing(%build): /bin/sh -e /tmp/B.bNSdI9/BUILD/tmp/rpm-tmp.NNypre HOME=/home/users/builder PATH=/home/users/builder/GNUstep/Tools:/bin:/usr/bin:/usr/local/bin TMPDIR=/tmp/B.bNSdI9/BUILD/tmp + umask 022 + cd /tmp/B.bNSdI9/BUILD + cd lttng-modules-2.12.5 + cd lttng-modules-2.12.5 + /usr/bin/make -Otarget -j9 clean 'KERNELDIR=/usr/src/linux-5.4' /usr/bin/make -C /usr/src/linux-5.4 M=/tmp/B.bNSdI9/BUILD/lttng-modules-2.12.5/lttng-modules-2.12.5 clean + /usr/bin/make -Otarget -j9 'KERNELDIR=/usr/src/linux-5.4' /usr/bin/make -C /usr/src/linux-5.4 M=/tmp/B.bNSdI9/BUILD/lttng-modules-2.12.5/lttng-modules-2.12.5 CONFIG_LTTNG=m CONFIG_LTTNG_CLOCK_PLUGIN_TEST=m modules CC [M] /tmp/B.bNSdI9/BUILD/lttng-modules-2.12.5/lttng-modules-2.12.5/lttng-ring-buffer-metadata-client.o CC [M] /tmp/B.bNSdI9/BUILD/lttng-modules-2.12.5/lttng-modules-2.12.5/lttng-ring-buffer-metadata-mmap-client.o CC [M] /tmp/B.bNSdI9/BUILD/lttng-modules-2.12.5/lttng-modules-2.12.5/tests/probes/lttng-test.o CC [M] /tmp/B.bNSdI9/BUILD/lttng-modules-2.12.5/lttng-modules-2.12.5/lttng-ring-buffer-client-discard.o CC [M] /tmp/B.bNSdI9/BUILD/lttng-modules-2.12.5/lttng-modules-2.12.5/lttng-ring-buffer-client-overwrite.o CC [M] /tmp/B.bNSdI9/BUILD/lttng-modules-2.12.5/lttng-modules-2.12.5/lttng-ring-buffer-client-mmap-discard.o CC [M] /tmp/B.bNSdI9/BUILD/lttng-modules-2.12.5/lttng-modules-2.12.5/lttng-ring-buffer-client-mmap-overwrite.o CC [M] /tmp/B.bNSdI9/BUILD/lttng-modules-2.12.5/lttng-modules-2.12.5/tests/clock-plugin/lttng-clock-plugin-test.o CC [M] /tmp/B.bNSdI9/BUILD/lttng-modules-2.12.5/lttng-modules-2.12.5/probes/lttng-probe-sched.o LD [M] /tmp/B.bNSdI9/BUILD/lttng-modules-2.12.5/lttng-modules-2.12.5/tests/lttng-test.o LD [M] /tmp/B.bNSdI9/BUILD/lttng-modules-2.12.5/lttng-modules-2.12.5/tests/lttng-clock-plugin-test.o CC [M] /tmp/B.bNSdI9/BUILD/lttng-modules-2.12.5/lttng-modules-2.12.5/lib/ringbuffer/ring_buffer_backend.o CC [M] /tmp/B.bNSdI9/BUILD/lttng-modules-2.12.5/lttng-modules-2.12.5/probes/lttng-probe-irq.o CC [M] /tmp/B.bNSdI9/BUILD/lttng-modules-2.12.5/lttng-modules-2.12.5/lttng-clock.o CC [M] /tmp/B.bNSdI9/BUILD/lttng-modules-2.12.5/lttng-modules-2.12.5/lttng-abi.o CC [M] /tmp/B.bNSdI9/BUILD/lttng-modules-2.12.5/lttng-modules-2.12.5/lttng-string-utils.o CC [M] /tmp/B.bNSdI9/BUILD/lttng-modules-2.12.5/lttng-modules-2.12.5/probes/lttng-probe-timer.o CC [M] /tmp/B.bNSdI9/BUILD/lttng-modules-2.12.5/lttng-modules-2.12.5/probes/lttng-probe-kmem.o CC [M] /tmp/B.bNSdI9/BUILD/lttng-modules-2.12.5/lttng-modules-2.12.5/probes/lttng-probe-module.o CC [M] /tmp/B.bNSdI9/BUILD/lttng-modules-2.12.5/lttng-modules-2.12.5/probes/lttng-probe-power.o CC [M] /tmp/B.bNSdI9/BUILD/lttng-modules-2.12.5/lttng-modules-2.12.5/probes/lttng-probe-9p.o CC [M] /tmp/B.bNSdI9/BUILD/lttng-modules-2.12.5/lttng-modules-2.12.5/lttng-events.o CC [M] /tmp/B.bNSdI9/BUILD/lttng-modules-2.12.5/lttng-modules-2.12.5/lib/ringbuffer/ring_buffer_frontend.o CC [M] /tmp/B.bNSdI9/BUILD/lttng-modules-2.12.5/lttng-modules-2.12.5/probes/lttng-probe-i2c.o CC [M] /tmp/B.bNSdI9/BUILD/lttng-modules-2.12.5/lttng-modules-2.12.5/lttng-probes.o CC [M] /tmp/B.bNSdI9/BUILD/lttng-modules-2.12.5/lttng-modules-2.12.5/lib/ringbuffer/ring_buffer_iterator.o CC [M] /tmp/B.bNSdI9/BUILD/lttng-modules-2.12.5/lttng-modules-2.12.5/lib/ringbuffer/ring_buffer_vfs.o CC [M] /tmp/B.bNSdI9/BUILD/lttng-modules-2.12.5/lttng-modules-2.12.5/lttng-context.o CC [M] /tmp/B.bNSdI9/BUILD/lttng-modules-2.12.5/lttng-modules-2.12.5/probes/lttng-probe-kvm.o CC [M] /tmp/B.bNSdI9/BUILD/lttng-modules-2.12.5/lttng-modules-2.12.5/lttng-context-pid.o CC [M] /tmp/B.bNSdI9/BUILD/lttng-modules-2.12.5/lttng-modules-2.12.5/probes/lttng-probe-statedump.o CC [M] /tmp/B.bNSdI9/BUILD/lttng-modules-2.12.5/lttng-modules-2.12.5/lttng-context-procname.o CC [M] /tmp/B.bNSdI9/BUILD/lttng-modules-2.12.5/lttng-modules-2.12.5/lib/ringbuffer/ring_buffer_splice.o CC [M] /tmp/B.bNSdI9/BUILD/lttng-modules-2.12.5/lttng-modules-2.12.5/probes/lttng-probe-kvm-x86-mmu.o CC [M] /tmp/B.bNSdI9/BUILD/lttng-modules-2.12.5/lttng-modules-2.12.5/probes/lttng-probe-x86-exceptions.o CC [M] /tmp/B.bNSdI9/BUILD/lttng-modules-2.12.5/lttng-modules-2.12.5/probes/lttng-probe-x86-irq-vectors.o CC [M] /tmp/B.bNSdI9/BUILD/lttng-modules-2.12.5/lttng-modules-2.12.5/lttng-context-prio.o CC [M] /tmp/B.bNSdI9/BUILD/lttng-modules-2.12.5/lttng-modules-2.12.5/lttng-context-nice.o CC [M] /tmp/B.bNSdI9/BUILD/lttng-modules-2.12.5/lttng-modules-2.12.5/lttng-context-vpid.o CC [M] /tmp/B.bNSdI9/BUILD/lttng-modules-2.12.5/lttng-modules-2.12.5/probes/lttng-probe-signal.o CC [M] /tmp/B.bNSdI9/BUILD/lttng-modules-2.12.5/lttng-modules-2.12.5/lib/../wrapper/splice.o CC [M] /tmp/B.bNSdI9/BUILD/lttng-modules-2.12.5/lttng-modules-2.12.5/probes/lttng-probe-kvm-x86.o CC [M] /tmp/B.bNSdI9/BUILD/lttng-modules-2.12.5/lttng-modules-2.12.5/lib/ringbuffer/ring_buffer_mmap.o CC [M] /tmp/B.bNSdI9/BUILD/lttng-modules-2.12.5/lttng-modules-2.12.5/lib/prio_heap/lttng_prio_heap.o LD [M] /tmp/B.bNSdI9/BUILD/lttng-modules-2.12.5/lttng-modules-2.12.5/lib/lttng-lib-ring-buffer.o CC [M] /tmp/B.bNSdI9/BUILD/lttng-modules-2.12.5/lttng-modules-2.12.5/probes/lttng-probe-napi.o CC [M] /tmp/B.bNSdI9/BUILD/lttng-modules-2.12.5/lttng-modules-2.12.5/probes/lttng-probe-skb.o CC [M] /tmp/B.bNSdI9/BUILD/lttng-modules-2.12.5/lttng-modules-2.12.5/lttng-context-tid.o CC [M] /tmp/B.bNSdI9/BUILD/lttng-modules-2.12.5/lttng-modules-2.12.5/lttng-context-vtid.o CC [M] /tmp/B.bNSdI9/BUILD/lttng-modules-2.12.5/lttng-modules-2.12.5/lttng-context-ppid.o CC [M] /tmp/B.bNSdI9/BUILD/lttng-modules-2.12.5/lttng-modules-2.12.5/probes/lttng-probe-sock.o CC [M] /tmp/B.bNSdI9/BUILD/lttng-modules-2.12.5/lttng-modules-2.12.5/probes/lttng-probe-net.o CC [M] /tmp/B.bNSdI9/BUILD/lttng-modules-2.12.5/lttng-modules-2.12.5/lttng-context-vppid.o CC [M] /tmp/B.bNSdI9/BUILD/lttng-modules-2.12.5/lttng-modules-2.12.5/probes/lttng-probe-block.o CC [M] /tmp/B.bNSdI9/BUILD/lttng-modules-2.12.5/lttng-modules-2.12.5/probes/lttng-probe-gpio.o CC [M] /tmp/B.bNSdI9/BUILD/lttng-modules-2.12.5/lttng-modules-2.12.5/probes/lttng-probe-udp.o CC [M] /tmp/B.bNSdI9/BUILD/lttng-modules-2.12.5/lttng-modules-2.12.5/probes/lttng-probe-asoc.o CC [M] /tmp/B.bNSdI9/BUILD/lttng-modules-2.12.5/lttng-modules-2.12.5/lttng-context-cpu-id.o CC [M] /tmp/B.bNSdI9/BUILD/lttng-modules-2.12.5/lttng-modules-2.12.5/lttng-context-uid.o CC [M] /tmp/B.bNSdI9/BUILD/lttng-modules-2.12.5/lttng-modules-2.12.5/lttng-context-euid.o CC [M] /tmp/B.bNSdI9/BUILD/lttng-modules-2.12.5/lttng-modules-2.12.5/lttng-context-suid.o CC [M] /tmp/B.bNSdI9/BUILD/lttng-modules-2.12.5/lttng-modules-2.12.5/probes/lttng-probe-regulator.o CC [M] /tmp/B.bNSdI9/BUILD/lttng-modules-2.12.5/lttng-modules-2.12.5/probes/lttng-probe-jbd2.o CC [M] /tmp/B.bNSdI9/BUILD/lttng-modules-2.12.5/lttng-modules-2.12.5/lttng-context-gid.o CC [M] /tmp/B.bNSdI9/BUILD/lttng-modules-2.12.5/lttng-modules-2.12.5/probes/lttng-probe-scsi.o CC [M] /tmp/B.bNSdI9/BUILD/lttng-modules-2.12.5/lttng-modules-2.12.5/lttng-context-egid.o CC [M] /tmp/B.bNSdI9/BUILD/lttng-modules-2.12.5/lttng-modules-2.12.5/lttng-context-sgid.o CC [M] /tmp/B.bNSdI9/BUILD/lttng-modules-2.12.5/lttng-modules-2.12.5/probes/lttng-probe-compaction.o CC [M] /tmp/B.bNSdI9/BUILD/lttng-modules-2.12.5/lttng-modules-2.12.5/probes/lttng-probe-printk.o CC [M] /tmp/B.bNSdI9/BUILD/lttng-modules-2.12.5/lttng-modules-2.12.5/lttng-context-vuid.o CC [M] /tmp/B.bNSdI9/BUILD/lttng-modules-2.12.5/lttng-modules-2.12.5/probes/lttng-probe-vmscan.o CC [M] /tmp/B.bNSdI9/BUILD/lttng-modules-2.12.5/lttng-modules-2.12.5/probes/lttng-probe-random.o CC [M] /tmp/B.bNSdI9/BUILD/lttng-modules-2.12.5/lttng-modules-2.12.5/probes/lttng-probe-rcu.o CC [M] /tmp/B.bNSdI9/BUILD/lttng-modules-2.12.5/lttng-modules-2.12.5/lttng-context-veuid.o CC [M] /tmp/B.bNSdI9/BUILD/lttng-modules-2.12.5/lttng-modules-2.12.5/lttng-context-vsuid.o CC [M] /tmp/B.bNSdI9/BUILD/lttng-modules-2.12.5/lttng-modules-2.12.5/probes/lttng-probe-regmap.o CC [M] /tmp/B.bNSdI9/BUILD/lttng-modules-2.12.5/lttng-modules-2.12.5/lttng-context-vgid.o CC [M] /tmp/B.bNSdI9/BUILD/lttng-modules-2.12.5/lttng-modules-2.12.5/probes/lttng-probe-workqueue.o CC [M] /tmp/B.bNSdI9/BUILD/lttng-modules-2.12.5/lttng-modules-2.12.5/probes/lttng-probe-v4l2.o CC [M] /tmp/B.bNSdI9/BUILD/lttng-modules-2.12.5/lttng-modules-2.12.5/probes/lttng-kprobes.o CC [M] /tmp/B.bNSdI9/BUILD/lttng-modules-2.12.5/lttng-modules-2.12.5/probes/lttng-probe-sunrpc.o CC [M] /tmp/B.bNSdI9/BUILD/lttng-modules-2.12.5/lttng-modules-2.12.5/probes/lttng-probe-btrfs.o CC [M] /tmp/B.bNSdI9/BUILD/lttng-modules-2.12.5/lttng-modules-2.12.5/probes/lttng-uprobes.o CC [M] /tmp/B.bNSdI9/BUILD/lttng-modules-2.12.5/lttng-modules-2.12.5/lttng-context-vegid.o CC [M] /tmp/B.bNSdI9/BUILD/lttng-modules-2.12.5/lttng-modules-2.12.5/probes/lttng-kretprobes.o CC [M] /tmp/B.bNSdI9/BUILD/lttng-modules-2.12.5/lttng-modules-2.12.5/lttng-context-vsgid.o CC [M] /tmp/B.bNSdI9/BUILD/lttng-modules-2.12.5/lttng-modules-2.12.5/lttng-context-interruptible.o CC [M] /tmp/B.bNSdI9/BUILD/lttng-modules-2.12.5/lttng-modules-2.12.5/lttng-context-need-reschedule.o CC [M] /tmp/B.bNSdI9/BUILD/lttng-modules-2.12.5/lttng-modules-2.12.5/lttng-calibrate.o CC [M] /tmp/B.bNSdI9/BUILD/lttng-modules-2.12.5/lttng-modules-2.12.5/probes/lttng-probe-writeback.o In file included from /tmp/B.bNSdI9/BUILD/lttng-modules-2.12.5/lttng-modules-2.12.5/probes/lttng-probe-writeback.c:38: /tmp/B.bNSdI9/BUILD/lttng-modules-2.12.5/lttng-modules-2.12.5/probes/../instrumentation/events/lttng-module/writeback.h:83: warning: "show_inode_state" redefined 83 | #define show_inode_state(state) \ | In file included from /tmp/B.bNSdI9/BUILD/lttng-modules-2.12.5/lttng-modules-2.12.5/probes/lttng-probe-writeback.c:20: ./include/trace/events/writeback.h:12: note: this is the location of the previous definition 12 | #define show_inode_state(state) \ | CC [M] /tmp/B.bNSdI9/BUILD/lttng-modules-2.12.5/lttng-modules-2.12.5/lttng-context-callstack.o CC [M] /tmp/B.bNSdI9/BUILD/lttng-modules-2.12.5/lttng-modules-2.12.5/probes/lttng.o CC [M] /tmp/B.bNSdI9/BUILD/lttng-modules-2.12.5/lttng-modules-2.12.5/lttng-filter.o CC [M] /tmp/B.bNSdI9/BUILD/lttng-modules-2.12.5/lttng-modules-2.12.5/lttng-context-hostname.o CC [M] /tmp/B.bNSdI9/BUILD/lttng-modules-2.12.5/lttng-modules-2.12.5/lttng-tracker-id.o CC [M] /tmp/B.bNSdI9/BUILD/lttng-modules-2.12.5/lttng-modules-2.12.5/probes/lttng-probe-user.o CC [M] /tmp/B.bNSdI9/BUILD/lttng-modules-2.12.5/lttng-modules-2.12.5/lttng-tp-mempool.o CC [M] /tmp/B.bNSdI9/BUILD/lttng-modules-2.12.5/lttng-modules-2.12.5/lttng-filter-specialize.o CC [M] /tmp/B.bNSdI9/BUILD/lttng-modules-2.12.5/lttng-modules-2.12.5/lttng-filter-interpreter.o CC [M] /tmp/B.bNSdI9/BUILD/lttng-modules-2.12.5/lttng-modules-2.12.5/lttng-filter-validator.o CC [M] /tmp/B.bNSdI9/BUILD/lttng-modules-2.12.5/lttng-modules-2.12.5/lttng-tracepoint.o CC [M] /tmp/B.bNSdI9/BUILD/lttng-modules-2.12.5/lttng-modules-2.12.5/lttng-context-perf-counters.o CC [M] /tmp/B.bNSdI9/BUILD/lttng-modules-2.12.5/lttng-modules-2.12.5/lttng-context-cgroup-ns.o CC [M] /tmp/B.bNSdI9/BUILD/lttng-modules-2.12.5/lttng-modules-2.12.5/lttng-context-ipc-ns.o CC [M] /tmp/B.bNSdI9/BUILD/lttng-modules-2.12.5/lttng-modules-2.12.5/lttng-context-mnt-ns.o CC [M] /tmp/B.bNSdI9/BUILD/lttng-modules-2.12.5/lttng-modules-2.12.5/lttng-context-pid-ns.o CC [M] /tmp/B.bNSdI9/BUILD/lttng-modules-2.12.5/lttng-modules-2.12.5/lttng-context-net-ns.o CC [M] /tmp/B.bNSdI9/BUILD/lttng-modules-2.12.5/lttng-modules-2.12.5/probes/lttng-probe-ext4.o CC [M] /tmp/B.bNSdI9/BUILD/lttng-modules-2.12.5/lttng-modules-2.12.5/lttng-context-user-ns.o CC [M] /tmp/B.bNSdI9/BUILD/lttng-modules-2.12.5/lttng-modules-2.12.5/lttng-context-uts-ns.o CC [M] /tmp/B.bNSdI9/BUILD/lttng-modules-2.12.5/lttng-modules-2.12.5/wrapper/trace-clock.o CC [M] /tmp/B.bNSdI9/BUILD/lttng-modules-2.12.5/lttng-modules-2.12.5/wrapper/random.o CC [M] /tmp/B.bNSdI9/BUILD/lttng-modules-2.12.5/lttng-modules-2.12.5/wrapper/page_alloc.o CC [M] /tmp/B.bNSdI9/BUILD/lttng-modules-2.12.5/lttng-modules-2.12.5/wrapper/kallsyms.o CC [M] /tmp/B.bNSdI9/BUILD/lttng-modules-2.12.5/lttng-modules-2.12.5/wrapper/fdtable.o CC [M] /tmp/B.bNSdI9/BUILD/lttng-modules-2.12.5/lttng-modules-2.12.5/wrapper/irqdesc.o CC [M] /tmp/B.bNSdI9/BUILD/lttng-modules-2.12.5/lttng-modules-2.12.5/lttng-wrapper-impl.o LD [M] /tmp/B.bNSdI9/BUILD/lttng-modules-2.12.5/lttng-modules-2.12.5/lttng-wrapper.o CC [M] /tmp/B.bNSdI9/BUILD/lttng-modules-2.12.5/lttng-modules-2.12.5/lttng-statedump-impl.o LD [M] /tmp/B.bNSdI9/BUILD/lttng-modules-2.12.5/lttng-modules-2.12.5/lttng-statedump.o CC [M] /tmp/B.bNSdI9/BUILD/lttng-modules-2.12.5/lttng-modules-2.12.5/lttng-syscalls.o LD [M] /tmp/B.bNSdI9/BUILD/lttng-modules-2.12.5/lttng-modules-2.12.5/lttng-tracer.o Building modules, stage 2. MODPOST 54 modules CC [M] /tmp/B.bNSdI9/BUILD/lttng-modules-2.12.5/lttng-modules-2.12.5/lttng-ring-buffer-metadata-client.mod.o CC [M] /tmp/B.bNSdI9/BUILD/lttng-modules-2.12.5/lttng-modules-2.12.5/lttng-ring-buffer-client-overwrite.mod.o CC [M] /tmp/B.bNSdI9/BUILD/lttng-modules-2.12.5/lttng-modules-2.12.5/lttng-ring-buffer-client-mmap-overwrite.mod.o CC [M] /tmp/B.bNSdI9/BUILD/lttng-modules-2.12.5/lttng-modules-2.12.5/lttng-statedump.mod.o CC [M] /tmp/B.bNSdI9/BUILD/lttng-modules-2.12.5/lttng-modules-2.12.5/lib/lttng-lib-ring-buffer.mod.o CC [M] /tmp/B.bNSdI9/BUILD/lttng-modules-2.12.5/lttng-modules-2.12.5/lttng-ring-buffer-client-discard.mod.o CC [M] /tmp/B.bNSdI9/BUILD/lttng-modules-2.12.5/lttng-modules-2.12.5/lttng-clock.mod.o CC [M] /tmp/B.bNSdI9/BUILD/lttng-modules-2.12.5/lttng-modules-2.12.5/lttng-ring-buffer-client-mmap-discard.mod.o CC [M] /tmp/B.bNSdI9/BUILD/lttng-modules-2.12.5/lttng-modules-2.12.5/lttng-ring-buffer-metadata-mmap-client.mod.o CC [M] /tmp/B.bNSdI9/BUILD/lttng-modules-2.12.5/lttng-modules-2.12.5/lttng-tracer.mod.o CC [M] /tmp/B.bNSdI9/BUILD/lttng-modules-2.12.5/lttng-modules-2.12.5/lttng-wrapper.mod.o CC [M] /tmp/B.bNSdI9/BUILD/lttng-modules-2.12.5/lttng-modules-2.12.5/probes/lttng-kprobes.mod.o CC [M] /tmp/B.bNSdI9/BUILD/lttng-modules-2.12.5/lttng-modules-2.12.5/probes/lttng-probe-asoc.mod.o CC [M] /tmp/B.bNSdI9/BUILD/lttng-modules-2.12.5/lttng-modules-2.12.5/probes/lttng-probe-9p.mod.o CC [M] /tmp/B.bNSdI9/BUILD/lttng-modules-2.12.5/lttng-modules-2.12.5/probes/lttng-kretprobes.mod.o CC [M] /tmp/B.bNSdI9/BUILD/lttng-modules-2.12.5/lttng-modules-2.12.5/probes/lttng-probe-block.mod.o CC [M] /tmp/B.bNSdI9/BUILD/lttng-modules-2.12.5/lttng-modules-2.12.5/probes/lttng-probe-btrfs.mod.o CC [M] /tmp/B.bNSdI9/BUILD/lttng-modules-2.12.5/lttng-modules-2.12.5/probes/lttng-probe-compaction.mod.o CC [M] /tmp/B.bNSdI9/BUILD/lttng-modules-2.12.5/lttng-modules-2.12.5/probes/lttng-probe-i2c.mod.o CC [M] /tmp/B.bNSdI9/BUILD/lttng-modules-2.12.5/lttng-modules-2.12.5/probes/lttng-probe-jbd2.mod.o CC [M] /tmp/B.bNSdI9/BUILD/lttng-modules-2.12.5/lttng-modules-2.12.5/probes/lttng-probe-gpio.mod.o CC [M] /tmp/B.bNSdI9/BUILD/lttng-modules-2.12.5/lttng-modules-2.12.5/probes/lttng-probe-irq.mod.o CC [M] /tmp/B.bNSdI9/BUILD/lttng-modules-2.12.5/lttng-modules-2.12.5/probes/lttng-probe-ext4.mod.o CC [M] /tmp/B.bNSdI9/BUILD/lttng-modules-2.12.5/lttng-modules-2.12.5/probes/lttng-probe-kmem.mod.o CC [M] /tmp/B.bNSdI9/BUILD/lttng-modules-2.12.5/lttng-modules-2.12.5/probes/lttng-probe-kvm-x86-mmu.mod.o CC [M] /tmp/B.bNSdI9/BUILD/lttng-modules-2.12.5/lttng-modules-2.12.5/probes/lttng-probe-kvm-x86.mod.o CC [M] /tmp/B.bNSdI9/BUILD/lttng-modules-2.12.5/lttng-modules-2.12.5/probes/lttng-probe-module.mod.o CC [M] /tmp/B.bNSdI9/BUILD/lttng-modules-2.12.5/lttng-modules-2.12.5/probes/lttng-probe-kvm.mod.o CC [M] /tmp/B.bNSdI9/BUILD/lttng-modules-2.12.5/lttng-modules-2.12.5/probes/lttng-probe-napi.mod.o CC [M] /tmp/B.bNSdI9/BUILD/lttng-modules-2.12.5/lttng-modules-2.12.5/probes/lttng-probe-power.mod.o CC [M] /tmp/B.bNSdI9/BUILD/lttng-modules-2.12.5/lttng-modules-2.12.5/probes/lttng-probe-net.mod.o CC [M] /tmp/B.bNSdI9/BUILD/lttng-modules-2.12.5/lttng-modules-2.12.5/probes/lttng-probe-printk.mod.o CC [M] /tmp/B.bNSdI9/BUILD/lttng-modules-2.12.5/lttng-modules-2.12.5/probes/lttng-probe-random.mod.o CC [M] /tmp/B.bNSdI9/BUILD/lttng-modules-2.12.5/lttng-modules-2.12.5/probes/lttng-probe-rcu.mod.o CC [M] /tmp/B.bNSdI9/BUILD/lttng-modules-2.12.5/lttng-modules-2.12.5/probes/lttng-probe-regmap.mod.o CC [M] /tmp/B.bNSdI9/BUILD/lttng-modules-2.12.5/lttng-modules-2.12.5/probes/lttng-probe-sched.mod.o CC [M] /tmp/B.bNSdI9/BUILD/lttng-modules-2.12.5/lttng-modules-2.12.5/probes/lttng-probe-scsi.mod.o CC [M] /tmp/B.bNSdI9/BUILD/lttng-modules-2.12.5/lttng-modules-2.12.5/probes/lttng-probe-signal.mod.o CC [M] /tmp/B.bNSdI9/BUILD/lttng-modules-2.12.5/lttng-modules-2.12.5/probes/lttng-probe-regulator.mod.o CC [M] /tmp/B.bNSdI9/BUILD/lttng-modules-2.12.5/lttng-modules-2.12.5/probes/lttng-probe-sock.mod.o CC [M] /tmp/B.bNSdI9/BUILD/lttng-modules-2.12.5/lttng-modules-2.12.5/probes/lttng-probe-skb.mod.o CC [M] /tmp/B.bNSdI9/BUILD/lttng-modules-2.12.5/lttng-modules-2.12.5/probes/lttng-probe-statedump.mod.o CC [M] /tmp/B.bNSdI9/BUILD/lttng-modules-2.12.5/lttng-modules-2.12.5/probes/lttng-probe-sunrpc.mod.o CC [M] /tmp/B.bNSdI9/BUILD/lttng-modules-2.12.5/lttng-modules-2.12.5/probes/lttng-probe-timer.mod.o CC [M] /tmp/B.bNSdI9/BUILD/lttng-modules-2.12.5/lttng-modules-2.12.5/probes/lttng-probe-v4l2.mod.o CC [M] /tmp/B.bNSdI9/BUILD/lttng-modules-2.12.5/lttng-modules-2.12.5/probes/lttng-probe-workqueue.mod.o LD [M] /tmp/B.bNSdI9/BUILD/lttng-modules-2.12.5/lttng-modules-2.12.5/lib/lttng-lib-ring-buffer.ko CC [M] /tmp/B.bNSdI9/BUILD/lttng-modules-2.12.5/lttng-modules-2.12.5/probes/lttng-probe-udp.mod.o CC [M] /tmp/B.bNSdI9/BUILD/lttng-modules-2.12.5/lttng-modules-2.12.5/probes/lttng-probe-vmscan.mod.o LD [M] /tmp/B.bNSdI9/BUILD/lttng-modules-2.12.5/lttng-modules-2.12.5/lttng-clock.ko LD [M] /tmp/B.bNSdI9/BUILD/lttng-modules-2.12.5/lttng-modules-2.12.5/lttng-ring-buffer-client-discard.ko LD [M] /tmp/B.bNSdI9/BUILD/lttng-modules-2.12.5/lttng-modules-2.12.5/lttng-ring-buffer-client-mmap-discard.ko LD [M] /tmp/B.bNSdI9/BUILD/lttng-modules-2.12.5/lttng-modules-2.12.5/lttng-ring-buffer-client-mmap-overwrite.ko LD [M] /tmp/B.bNSdI9/BUILD/lttng-modules-2.12.5/lttng-modules-2.12.5/lttng-ring-buffer-client-overwrite.ko LD [M] /tmp/B.bNSdI9/BUILD/lttng-modules-2.12.5/lttng-modules-2.12.5/lttng-ring-buffer-metadata-client.ko LD [M] /tmp/B.bNSdI9/BUILD/lttng-modules-2.12.5/lttng-modules-2.12.5/lttng-ring-buffer-metadata-mmap-client.ko LD [M] /tmp/B.bNSdI9/BUILD/lttng-modules-2.12.5/lttng-modules-2.12.5/lttng-statedump.ko LD [M] /tmp/B.bNSdI9/BUILD/lttng-modules-2.12.5/lttng-modules-2.12.5/lttng-tracer.ko LD [M] /tmp/B.bNSdI9/BUILD/lttng-modules-2.12.5/lttng-modules-2.12.5/lttng-wrapper.ko CC [M] /tmp/B.bNSdI9/BUILD/lttng-modules-2.12.5/lttng-modules-2.12.5/probes/lttng-probe-x86-exceptions.mod.o LD [M] /tmp/B.bNSdI9/BUILD/lttng-modules-2.12.5/lttng-modules-2.12.5/probes/lttng-kprobes.ko LD [M] /tmp/B.bNSdI9/BUILD/lttng-modules-2.12.5/lttng-modules-2.12.5/probes/lttng-kretprobes.ko LD [M] /tmp/B.bNSdI9/BUILD/lttng-modules-2.12.5/lttng-modules-2.12.5/probes/lttng-probe-9p.ko LD [M] /tmp/B.bNSdI9/BUILD/lttng-modules-2.12.5/lttng-modules-2.12.5/probes/lttng-probe-asoc.ko LD [M] /tmp/B.bNSdI9/BUILD/lttng-modules-2.12.5/lttng-modules-2.12.5/probes/lttng-probe-block.ko LD [M] /tmp/B.bNSdI9/BUILD/lttng-modules-2.12.5/lttng-modules-2.12.5/probes/lttng-probe-btrfs.ko LD [M] /tmp/B.bNSdI9/BUILD/lttng-modules-2.12.5/lttng-modules-2.12.5/probes/lttng-probe-compaction.ko CC [M] /tmp/B.bNSdI9/BUILD/lttng-modules-2.12.5/lttng-modules-2.12.5/probes/lttng-probe-writeback.mod.o LD [M] /tmp/B.bNSdI9/BUILD/lttng-modules-2.12.5/lttng-modules-2.12.5/probes/lttng-probe-ext4.ko LD [M] /tmp/B.bNSdI9/BUILD/lttng-modules-2.12.5/lttng-modules-2.12.5/probes/lttng-probe-gpio.ko LD [M] /tmp/B.bNSdI9/BUILD/lttng-modules-2.12.5/lttng-modules-2.12.5/probes/lttng-probe-i2c.ko LD [M] /tmp/B.bNSdI9/BUILD/lttng-modules-2.12.5/lttng-modules-2.12.5/probes/lttng-probe-irq.ko LD [M] /tmp/B.bNSdI9/BUILD/lttng-modules-2.12.5/lttng-modules-2.12.5/probes/lttng-probe-jbd2.ko LD [M] /tmp/B.bNSdI9/BUILD/lttng-modules-2.12.5/lttng-modules-2.12.5/probes/lttng-probe-kmem.ko LD [M] /tmp/B.bNSdI9/BUILD/lttng-modules-2.12.5/lttng-modules-2.12.5/probes/lttng-probe-kvm-x86-mmu.ko LD [M] /tmp/B.bNSdI9/BUILD/lttng-modules-2.12.5/lttng-modules-2.12.5/probes/lttng-probe-kvm-x86.ko LD [M] /tmp/B.bNSdI9/BUILD/lttng-modules-2.12.5/lttng-modules-2.12.5/probes/lttng-probe-kvm.ko LD [M] /tmp/B.bNSdI9/BUILD/lttng-modules-2.12.5/lttng-modules-2.12.5/probes/lttng-probe-module.ko LD [M] /tmp/B.bNSdI9/BUILD/lttng-modules-2.12.5/lttng-modules-2.12.5/probes/lttng-probe-napi.ko LD [M] /tmp/B.bNSdI9/BUILD/lttng-modules-2.12.5/lttng-modules-2.12.5/probes/lttng-probe-net.ko LD [M] /tmp/B.bNSdI9/BUILD/lttng-modules-2.12.5/lttng-modules-2.12.5/probes/lttng-probe-power.ko LD [M] /tmp/B.bNSdI9/BUILD/lttng-modules-2.12.5/lttng-modules-2.12.5/probes/lttng-probe-printk.ko LD [M] /tmp/B.bNSdI9/BUILD/lttng-modules-2.12.5/lttng-modules-2.12.5/probes/lttng-probe-random.ko LD [M] /tmp/B.bNSdI9/BUILD/lttng-modules-2.12.5/lttng-modules-2.12.5/probes/lttng-probe-rcu.ko LD [M] /tmp/B.bNSdI9/BUILD/lttng-modules-2.12.5/lttng-modules-2.12.5/probes/lttng-probe-regmap.ko LD [M] /tmp/B.bNSdI9/BUILD/lttng-modules-2.12.5/lttng-modules-2.12.5/probes/lttng-probe-regulator.ko LD [M] /tmp/B.bNSdI9/BUILD/lttng-modules-2.12.5/lttng-modules-2.12.5/probes/lttng-probe-sched.ko LD [M] /tmp/B.bNSdI9/BUILD/lttng-modules-2.12.5/lttng-modules-2.12.5/probes/lttng-probe-scsi.ko LD [M] /tmp/B.bNSdI9/BUILD/lttng-modules-2.12.5/lttng-modules-2.12.5/probes/lttng-probe-signal.ko LD [M] /tmp/B.bNSdI9/BUILD/lttng-modules-2.12.5/lttng-modules-2.12.5/probes/lttng-probe-sock.ko LD [M] /tmp/B.bNSdI9/BUILD/lttng-modules-2.12.5/lttng-modules-2.12.5/probes/lttng-probe-skb.ko LD [M] /tmp/B.bNSdI9/BUILD/lttng-modules-2.12.5/lttng-modules-2.12.5/probes/lttng-probe-statedump.ko LD [M] /tmp/B.bNSdI9/BUILD/lttng-modules-2.12.5/lttng-modules-2.12.5/probes/lttng-probe-sunrpc.ko LD [M] /tmp/B.bNSdI9/BUILD/lttng-modules-2.12.5/lttng-modules-2.12.5/probes/lttng-probe-timer.ko LD [M] /tmp/B.bNSdI9/BUILD/lttng-modules-2.12.5/lttng-modules-2.12.5/probes/lttng-probe-udp.ko LD [M] /tmp/B.bNSdI9/BUILD/lttng-modules-2.12.5/lttng-modules-2.12.5/probes/lttng-probe-v4l2.ko LD [M] /tmp/B.bNSdI9/BUILD/lttng-modules-2.12.5/lttng-modules-2.12.5/probes/lttng-probe-vmscan.ko LD [M] /tmp/B.bNSdI9/BUILD/lttng-modules-2.12.5/lttng-modules-2.12.5/probes/lttng-probe-writeback.ko LD [M] /tmp/B.bNSdI9/BUILD/lttng-modules-2.12.5/lttng-modules-2.12.5/probes/lttng-probe-workqueue.ko LD [M] /tmp/B.bNSdI9/BUILD/lttng-modules-2.12.5/lttng-modules-2.12.5/probes/lttng-probe-x86-exceptions.ko CC [M] /tmp/B.bNSdI9/BUILD/lttng-modules-2.12.5/lttng-modules-2.12.5/probes/lttng-probe-x86-irq-vectors.mod.o LD [M] /tmp/B.bNSdI9/BUILD/lttng-modules-2.12.5/lttng-modules-2.12.5/probes/lttng-probe-x86-irq-vectors.ko CC [M] /tmp/B.bNSdI9/BUILD/lttng-modules-2.12.5/lttng-modules-2.12.5/probes/lttng-uprobes.mod.o LD [M] /tmp/B.bNSdI9/BUILD/lttng-modules-2.12.5/lttng-modules-2.12.5/probes/lttng-uprobes.ko CC [M] /tmp/B.bNSdI9/BUILD/lttng-modules-2.12.5/lttng-modules-2.12.5/tests/lttng-clock-plugin-test.mod.o LD [M] /tmp/B.bNSdI9/BUILD/lttng-modules-2.12.5/lttng-modules-2.12.5/tests/lttng-clock-plugin-test.ko CC [M] /tmp/B.bNSdI9/BUILD/lttng-modules-2.12.5/lttng-modules-2.12.5/tests/lttng-test.mod.o LD [M] /tmp/B.bNSdI9/BUILD/lttng-modules-2.12.5/lttng-modules-2.12.5/tests/lttng-test.ko + pwd + p=/tmp/B.bNSdI9/BUILD/lttng-modules-2.12.5/lttng-modules-2.12.5 + /usr/bin/make -Otarget -j9 modules_install 'INSTALL_MOD_PATH=/tmp/B.bNSdI9/BUILD/lttng-modules-2.12.5/lttng-modules-2.12.5/../installed' 'INSTALL_MOD_DIR=kernel/lttng' 'KERNELDIR=/usr/src/linux-5.4' /usr/bin/make -C /usr/src/linux-5.4 M=/tmp/B.bNSdI9/BUILD/lttng-modules-2.12.5/lttng-modules-2.12.5 CONFIG_LTTNG=m CONFIG_LTTNG_CLOCK_PLUGIN_TEST=m modules_install INSTALL /tmp/B.bNSdI9/BUILD/lttng-modules-2.12.5/lttng-modules-2.12.5/lttng-clock.ko At main.c:160: - SSL error:02001002:system library:fopen:No such file or directory: crypto/bio/bss_file.c:69 - SSL error:2006D080:BIO routines:BIO_new_file:no such file: crypto/bio/bss_file.c:76 sign-file: certs/signing_key.pem: No such file or directory INSTALL /tmp/B.bNSdI9/BUILD/lttng-modules-2.12.5/lttng-modules-2.12.5/lttng-ring-buffer-metadata-mmap-client.ko At main.c:160: - SSL error:02001002:system library:fopen:No such file or directory: crypto/bio/bss_file.c:69 - SSL error:2006D080:BIO routines:BIO_new_file:no such file: crypto/bio/bss_file.c:76 sign-file: certs/signing_key.pem: No such file or directory INSTALL /tmp/B.bNSdI9/BUILD/lttng-modules-2.12.5/lttng-modules-2.12.5/lttng-ring-buffer-metadata-client.ko At main.c:160: - SSL error:02001002:system library:fopen:No such file or directory: crypto/bio/bss_file.c:69 - SSL error:2006D080:BIO routines:BIO_new_file:no such file: crypto/bio/bss_file.c:76 sign-file: certs/signing_key.pem: No such file or directory INSTALL /tmp/B.bNSdI9/BUILD/lttng-modules-2.12.5/lttng-modules-2.12.5/lttng-ring-buffer-client-mmap-discard.ko At main.c:160: - SSL error:02001002:system library:fopen:No such file or directory: crypto/bio/bss_file.c:69 - SSL error:2006D080:BIO routines:BIO_new_file:no such file: crypto/bio/bss_file.c:76 sign-file: certs/signing_key.pem: No such file or directory INSTALL /tmp/B.bNSdI9/BUILD/lttng-modules-2.12.5/lttng-modules-2.12.5/lttng-ring-buffer-client-discard.ko At main.c:160: - SSL error:02001002:system library:fopen:No such file or directory: crypto/bio/bss_file.c:69 - SSL error:2006D080:BIO routines:BIO_new_file:no such file: crypto/bio/bss_file.c:76 sign-file: certs/signing_key.pem: No such file or directory INSTALL /tmp/B.bNSdI9/BUILD/lttng-modules-2.12.5/lttng-modules-2.12.5/lttng-ring-buffer-client-mmap-overwrite.ko At main.c:160: - SSL error:02001002:system library:fopen:No such file or directory: crypto/bio/bss_file.c:69 - SSL error:2006D080:BIO routines:BIO_new_file:no such file: crypto/bio/bss_file.c:76 sign-file: certs/signing_key.pem: No such file or directory INSTALL /tmp/B.bNSdI9/BUILD/lttng-modules-2.12.5/lttng-modules-2.12.5/lttng-statedump.ko At main.c:160: - SSL error:02001002:system library:fopen:No such file or directory: crypto/bio/bss_file.c:69 - SSL error:2006D080:BIO routines:BIO_new_file:no such file: crypto/bio/bss_file.c:76 sign-file: certs/signing_key.pem: No such file or directory INSTALL /tmp/B.bNSdI9/BUILD/lttng-modules-2.12.5/lttng-modules-2.12.5/lttng-ring-buffer-client-overwrite.ko At main.c:160: - SSL error:02001002:system library:fopen:No such file or directory: crypto/bio/bss_file.c:69 - SSL error:2006D080:BIO routines:BIO_new_file:no such file: crypto/bio/bss_file.c:76 sign-file: certs/signing_key.pem: No such file or directory INSTALL /tmp/B.bNSdI9/BUILD/lttng-modules-2.12.5/lttng-modules-2.12.5/lttng-wrapper.ko At main.c:160: - SSL error:02001002:system library:fopen:No such file or directory: crypto/bio/bss_file.c:69 - SSL error:2006D080:BIO routines:BIO_new_file:no such file: crypto/bio/bss_file.c:76 sign-file: certs/signing_key.pem: No such file or directory INSTALL /tmp/B.bNSdI9/BUILD/lttng-modules-2.12.5/lttng-modules-2.12.5/probes/lttng-kretprobes.ko At main.c:160: - SSL error:02001002:system library:fopen:No such file or directory: crypto/bio/bss_file.c:69 - SSL error:2006D080:BIO routines:BIO_new_file:no such file: crypto/bio/bss_file.c:76 sign-file: certs/signing_key.pem: No such file or directory INSTALL /tmp/B.bNSdI9/BUILD/lttng-modules-2.12.5/lttng-modules-2.12.5/probes/lttng-kprobes.ko At main.c:160: - SSL error:02001002:system library:fopen:No such file or directory: crypto/bio/bss_file.c:69 - SSL error:2006D080:BIO routines:BIO_new_file:no such file: crypto/bio/bss_file.c:76 sign-file: certs/signing_key.pem: No such file or directory INSTALL /tmp/B.bNSdI9/BUILD/lttng-modules-2.12.5/lttng-modules-2.12.5/probes/lttng-probe-9p.ko At main.c:160: - SSL error:02001002:system library:fopen:No such file or directory: crypto/bio/bss_file.c:69 - SSL error:2006D080:BIO routines:BIO_new_file:no such file: crypto/bio/bss_file.c:76 sign-file: certs/signing_key.pem: No such file or directory INSTALL /tmp/B.bNSdI9/BUILD/lttng-modules-2.12.5/lttng-modules-2.12.5/probes/lttng-probe-compaction.ko At main.c:160: - SSL error:02001002:system library:fopen:No such file or directory: crypto/bio/bss_file.c:69 - SSL error:2006D080:BIO routines:BIO_new_file:no such file: crypto/bio/bss_file.c:76 sign-file: certs/signing_key.pem: No such file or directory INSTALL /tmp/B.bNSdI9/BUILD/lttng-modules-2.12.5/lttng-modules-2.12.5/probes/lttng-probe-asoc.ko At main.c:160: - SSL error:02001002:system library:fopen:No such file or directory: crypto/bio/bss_file.c:69 - SSL error:2006D080:BIO routines:BIO_new_file:no such file: crypto/bio/bss_file.c:76 sign-file: certs/signing_key.pem: No such file or directory INSTALL /tmp/B.bNSdI9/BUILD/lttng-modules-2.12.5/lttng-modules-2.12.5/probes/lttng-probe-i2c.ko At main.c:160: - SSL error:02001002:system library:fopen:No such file or directory: crypto/bio/bss_file.c:69 - SSL error:2006D080:BIO routines:BIO_new_file:no such file: crypto/bio/bss_file.c:76 sign-file: certs/signing_key.pem: No such file or directory INSTALL /tmp/B.bNSdI9/BUILD/lttng-modules-2.12.5/lttng-modules-2.12.5/probes/lttng-probe-irq.ko At main.c:160: - SSL error:02001002:system library:fopen:No such file or directory: crypto/bio/bss_file.c:69 - SSL error:2006D080:BIO routines:BIO_new_file:no such file: crypto/bio/bss_file.c:76 sign-file: certs/signing_key.pem: No such file or directory INSTALL /tmp/B.bNSdI9/BUILD/lttng-modules-2.12.5/lttng-modules-2.12.5/probes/lttng-probe-gpio.ko At main.c:160: - SSL error:02001002:system library:fopen:No such file or directory: crypto/bio/bss_file.c:69 - SSL error:2006D080:BIO routines:BIO_new_file:no such file: crypto/bio/bss_file.c:76 sign-file: certs/signing_key.pem: No such file or directory INSTALL /tmp/B.bNSdI9/BUILD/lttng-modules-2.12.5/lttng-modules-2.12.5/probes/lttng-probe-block.ko At main.c:160: - SSL error:02001002:system library:fopen:No such file or directory: crypto/bio/bss_file.c:69 - SSL error:2006D080:BIO routines:BIO_new_file:no such file: crypto/bio/bss_file.c:76 sign-file: certs/signing_key.pem: No such file or directory INSTALL /tmp/B.bNSdI9/BUILD/lttng-modules-2.12.5/lttng-modules-2.12.5/lib/lttng-lib-ring-buffer.ko At main.c:160: - SSL error:02001002:system library:fopen:No such file or directory: crypto/bio/bss_file.c:69 - SSL error:2006D080:BIO routines:BIO_new_file:no such file: crypto/bio/bss_file.c:76 sign-file: certs/signing_key.pem: No such file or directory INSTALL /tmp/B.bNSdI9/BUILD/lttng-modules-2.12.5/lttng-modules-2.12.5/probes/lttng-probe-jbd2.ko At main.c:160: - SSL error:02001002:system library:fopen:No such file or directory: crypto/bio/bss_file.c:69 - SSL error:2006D080:BIO routines:BIO_new_file:no such file: crypto/bio/bss_file.c:76 sign-file: certs/signing_key.pem: No such file or directory INSTALL /tmp/B.bNSdI9/BUILD/lttng-modules-2.12.5/lttng-modules-2.12.5/probes/lttng-probe-btrfs.ko At main.c:160: - SSL error:02001002:system library:fopen:No such file or directory: crypto/bio/bss_file.c:69 - SSL error:2006D080:BIO routines:BIO_new_file:no such file: crypto/bio/bss_file.c:76 sign-file: certs/signing_key.pem: No such file or directory INSTALL /tmp/B.bNSdI9/BUILD/lttng-modules-2.12.5/lttng-modules-2.12.5/probes/lttng-probe-kmem.ko At main.c:160: - SSL error:02001002:system library:fopen:No such file or directory: crypto/bio/bss_file.c:69 - SSL error:2006D080:BIO routines:BIO_new_file:no such file: crypto/bio/bss_file.c:76 sign-file: certs/signing_key.pem: No such file or directory INSTALL /tmp/B.bNSdI9/BUILD/lttng-modules-2.12.5/lttng-modules-2.12.5/probes/lttng-probe-kvm-x86-mmu.ko At main.c:160: - SSL error:02001002:system library:fopen:No such file or directory: crypto/bio/bss_file.c:69 - SSL error:2006D080:BIO routines:BIO_new_file:no such file: crypto/bio/bss_file.c:76 sign-file: certs/signing_key.pem: No such file or directory INSTALL /tmp/B.bNSdI9/BUILD/lttng-modules-2.12.5/lttng-modules-2.12.5/probes/lttng-probe-napi.ko At main.c:160: - SSL error:02001002:system library:fopen:No such file or directory: crypto/bio/bss_file.c:69 - SSL error:2006D080:BIO routines:BIO_new_file:no such file: crypto/bio/bss_file.c:76 sign-file: certs/signing_key.pem: No such file or directory INSTALL /tmp/B.bNSdI9/BUILD/lttng-modules-2.12.5/lttng-modules-2.12.5/probes/lttng-probe-kvm.ko At main.c:160: - SSL error:02001002:system library:fopen:No such file or directory: crypto/bio/bss_file.c:69 - SSL error:2006D080:BIO routines:BIO_new_file:no such file: crypto/bio/bss_file.c:76 sign-file: certs/signing_key.pem: No such file or directory INSTALL /tmp/B.bNSdI9/BUILD/lttng-modules-2.12.5/lttng-modules-2.12.5/probes/lttng-probe-module.ko At main.c:160: - SSL error:02001002:system library:fopen:No such file or directory: crypto/bio/bss_file.c:69 - SSL error:2006D080:BIO routines:BIO_new_file:no such file: crypto/bio/bss_file.c:76 sign-file: certs/signing_key.pem: No such file or directory INSTALL /tmp/B.bNSdI9/BUILD/lttng-modules-2.12.5/lttng-modules-2.12.5/probes/lttng-probe-printk.ko At main.c:160: - SSL error:02001002:system library:fopen:No such file or directory: crypto/bio/bss_file.c:69 - SSL error:2006D080:BIO routines:BIO_new_file:no such file: crypto/bio/bss_file.c:76 sign-file: certs/signing_key.pem: No such file or directory INSTALL /tmp/B.bNSdI9/BUILD/lttng-modules-2.12.5/lttng-modules-2.12.5/probes/lttng-probe-net.ko At main.c:160: - SSL error:02001002:system library:fopen:No such file or directory: crypto/bio/bss_file.c:69 - SSL error:2006D080:BIO routines:BIO_new_file:no such file: crypto/bio/bss_file.c:76 sign-file: certs/signing_key.pem: No such file or directory INSTALL /tmp/B.bNSdI9/BUILD/lttng-modules-2.12.5/lttng-modules-2.12.5/probes/lttng-probe-rcu.ko At main.c:160: - SSL error:02001002:system library:fopen:No such file or directory: crypto/bio/bss_file.c:69 - SSL error:2006D080:BIO routines:BIO_new_file:no such file: crypto/bio/bss_file.c:76 sign-file: certs/signing_key.pem: No such file or directory INSTALL /tmp/B.bNSdI9/BUILD/lttng-modules-2.12.5/lttng-modules-2.12.5/probes/lttng-probe-power.ko At main.c:160: - SSL error:02001002:system library:fopen:No such file or directory: crypto/bio/bss_file.c:69 - SSL error:2006D080:BIO routines:BIO_new_file:no such file: crypto/bio/bss_file.c:76 sign-file: certs/signing_key.pem: No such file or directory INSTALL /tmp/B.bNSdI9/BUILD/lttng-modules-2.12.5/lttng-modules-2.12.5/probes/lttng-probe-random.ko At main.c:160: - SSL error:02001002:system library:fopen:No such file or directory: crypto/bio/bss_file.c:69 - SSL error:2006D080:BIO routines:BIO_new_file:no such file: crypto/bio/bss_file.c:76 sign-file: certs/signing_key.pem: No such file or directory INSTALL /tmp/B.bNSdI9/BUILD/lttng-modules-2.12.5/lttng-modules-2.12.5/probes/lttng-probe-regulator.ko At main.c:160: - SSL error:02001002:system library:fopen:No such file or directory: crypto/bio/bss_file.c:69 - SSL error:2006D080:BIO routines:BIO_new_file:no such file: crypto/bio/bss_file.c:76 sign-file: certs/signing_key.pem: No such file or directory INSTALL /tmp/B.bNSdI9/BUILD/lttng-modules-2.12.5/lttng-modules-2.12.5/probes/lttng-probe-regmap.ko At main.c:160: - SSL error:02001002:system library:fopen:No such file or directory: crypto/bio/bss_file.c:69 - SSL error:2006D080:BIO routines:BIO_new_file:no such file: crypto/bio/bss_file.c:76 sign-file: certs/signing_key.pem: No such file or directory INSTALL /tmp/B.bNSdI9/BUILD/lttng-modules-2.12.5/lttng-modules-2.12.5/probes/lttng-probe-kvm-x86.ko At main.c:160: - SSL error:02001002:system library:fopen:No such file or directory: crypto/bio/bss_file.c:69 - SSL error:2006D080:BIO routines:BIO_new_file:no such file: crypto/bio/bss_file.c:76 sign-file: certs/signing_key.pem: No such file or directory INSTALL /tmp/B.bNSdI9/BUILD/lttng-modules-2.12.5/lttng-modules-2.12.5/probes/lttng-probe-signal.ko At main.c:160: - SSL error:02001002:system library:fopen:No such file or directory: crypto/bio/bss_file.c:69 - SSL error:2006D080:BIO routines:BIO_new_file:no such file: crypto/bio/bss_file.c:76 sign-file: certs/signing_key.pem: No such file or directory INSTALL /tmp/B.bNSdI9/BUILD/lttng-modules-2.12.5/lttng-modules-2.12.5/probes/lttng-probe-scsi.ko At main.c:160: - SSL error:02001002:system library:fopen:No such file or directory: crypto/bio/bss_file.c:69 - SSL error:2006D080:BIO routines:BIO_new_file:no such file: crypto/bio/bss_file.c:76 sign-file: certs/signing_key.pem: No such file or directory INSTALL /tmp/B.bNSdI9/BUILD/lttng-modules-2.12.5/lttng-modules-2.12.5/probes/lttng-probe-sock.ko At main.c:160: - SSL error:02001002:system library:fopen:No such file or directory: crypto/bio/bss_file.c:69 - SSL error:2006D080:BIO routines:BIO_new_file:no such file: crypto/bio/bss_file.c:76 sign-file: certs/signing_key.pem: No such file or directory INSTALL /tmp/B.bNSdI9/BUILD/lttng-modules-2.12.5/lttng-modules-2.12.5/probes/lttng-probe-skb.ko At main.c:160: - SSL error:02001002:system library:fopen:No such file or directory: crypto/bio/bss_file.c:69 - SSL error:2006D080:BIO routines:BIO_new_file:no such file: crypto/bio/bss_file.c:76 sign-file: certs/signing_key.pem: No such file or directory INSTALL /tmp/B.bNSdI9/BUILD/lttng-modules-2.12.5/lttng-modules-2.12.5/probes/lttng-probe-sched.ko At main.c:160: - SSL error:02001002:system library:fopen:No such file or directory: crypto/bio/bss_file.c:69 - SSL error:2006D080:BIO routines:BIO_new_file:no such file: crypto/bio/bss_file.c:76 sign-file: certs/signing_key.pem: No such file or directory INSTALL /tmp/B.bNSdI9/BUILD/lttng-modules-2.12.5/lttng-modules-2.12.5/probes/lttng-probe-sunrpc.ko At main.c:160: - SSL error:02001002:system library:fopen:No such file or directory: crypto/bio/bss_file.c:69 - SSL error:2006D080:BIO routines:BIO_new_file:no such file: crypto/bio/bss_file.c:76 sign-file: certs/signing_key.pem: No such file or directory INSTALL /tmp/B.bNSdI9/BUILD/lttng-modules-2.12.5/lttng-modules-2.12.5/probes/lttng-probe-v4l2.ko At main.c:160: - SSL error:02001002:system library:fopen:No such file or directory: crypto/bio/bss_file.c:69 - SSL error:2006D080:BIO routines:BIO_new_file:no such file: crypto/bio/bss_file.c:76 sign-file: certs/signing_key.pem: No such file or directory INSTALL /tmp/B.bNSdI9/BUILD/lttng-modules-2.12.5/lttng-modules-2.12.5/probes/lttng-probe-udp.ko At main.c:160: - SSL error:02001002:system library:fopen:No such file or directory: crypto/bio/bss_file.c:69 - SSL error:2006D080:BIO routines:BIO_new_file:no such file: crypto/bio/bss_file.c:76 sign-file: certs/signing_key.pem: No such file or directory INSTALL /tmp/B.bNSdI9/BUILD/lttng-modules-2.12.5/lttng-modules-2.12.5/probes/lttng-probe-timer.ko At main.c:160: - SSL error:02001002:system library:fopen:No such file or directory: crypto/bio/bss_file.c:69 - SSL error:2006D080:BIO routines:BIO_new_file:no such file: crypto/bio/bss_file.c:76 sign-file: certs/signing_key.pem: No such file or directory INSTALL /tmp/B.bNSdI9/BUILD/lttng-modules-2.12.5/lttng-modules-2.12.5/probes/lttng-probe-x86-exceptions.ko At main.c:160: - SSL error:02001002:system library:fopen:No such file or directory: crypto/bio/bss_file.c:69 - SSL error:2006D080:BIO routines:BIO_new_file:no such file: crypto/bio/bss_file.c:76 sign-file: certs/signing_key.pem: No such file or directory INSTALL /tmp/B.bNSdI9/BUILD/lttng-modules-2.12.5/lttng-modules-2.12.5/probes/lttng-probe-workqueue.ko At main.c:160: - SSL error:02001002:system library:fopen:No such file or directory: crypto/bio/bss_file.c:69 - SSL error:2006D080:BIO routines:BIO_new_file:no such file: crypto/bio/bss_file.c:76 sign-file: certs/signing_key.pem: No such file or directory INSTALL /tmp/B.bNSdI9/BUILD/lttng-modules-2.12.5/lttng-modules-2.12.5/probes/lttng-probe-vmscan.ko At main.c:160: - SSL error:02001002:system library:fopen:No such file or directory: crypto/bio/bss_file.c:69 - SSL error:2006D080:BIO routines:BIO_new_file:no such file: crypto/bio/bss_file.c:76 sign-file: certs/signing_key.pem: No such file or directory INSTALL /tmp/B.bNSdI9/BUILD/lttng-modules-2.12.5/lttng-modules-2.12.5/probes/lttng-probe-statedump.ko At main.c:160: - SSL error:02001002:system library:fopen:No such file or directory: crypto/bio/bss_file.c:69 - SSL error:2006D080:BIO routines:BIO_new_file:no such file: crypto/bio/bss_file.c:76 sign-file: certs/signing_key.pem: No such file or directory INSTALL /tmp/B.bNSdI9/BUILD/lttng-modules-2.12.5/lttng-modules-2.12.5/probes/lttng-uprobes.ko At main.c:160: - SSL error:02001002:system library:fopen:No such file or directory: crypto/bio/bss_file.c:69 - SSL error:2006D080:BIO routines:BIO_new_file:no such file: crypto/bio/bss_file.c:76 sign-file: certs/signing_key.pem: No such file or directory INSTALL /tmp/B.bNSdI9/BUILD/lttng-modules-2.12.5/lttng-modules-2.12.5/tests/lttng-clock-plugin-test.ko At main.c:160: - SSL error:02001002:system library:fopen:No such file or directory: crypto/bio/bss_file.c:69 - SSL error:2006D080:BIO routines:BIO_new_file:no such file: crypto/bio/bss_file.c:76 sign-file: certs/signing_key.pem: No such file or directory INSTALL /tmp/B.bNSdI9/BUILD/lttng-modules-2.12.5/lttng-modules-2.12.5/probes/lttng-probe-ext4.ko At main.c:160: - SSL error:02001002:system library:fopen:No such file or directory: crypto/bio/bss_file.c:69 - SSL error:2006D080:BIO routines:BIO_new_file:no such file: crypto/bio/bss_file.c:76 sign-file: certs/signing_key.pem: No such file or directory INSTALL /tmp/B.bNSdI9/BUILD/lttng-modules-2.12.5/lttng-modules-2.12.5/probes/lttng-probe-x86-irq-vectors.ko At main.c:160: - SSL error:02001002:system library:fopen:No such file or directory: crypto/bio/bss_file.c:69 - SSL error:2006D080:BIO routines:BIO_new_file:no such file: crypto/bio/bss_file.c:76 sign-file: certs/signing_key.pem: No such file or directory INSTALL /tmp/B.bNSdI9/BUILD/lttng-modules-2.12.5/lttng-modules-2.12.5/tests/lttng-test.ko At main.c:160: - SSL error:02001002:system library:fopen:No such file or directory: crypto/bio/bss_file.c:69 - SSL error:2006D080:BIO routines:BIO_new_file:no such file: crypto/bio/bss_file.c:76 sign-file: certs/signing_key.pem: No such file or directory INSTALL /tmp/B.bNSdI9/BUILD/lttng-modules-2.12.5/lttng-modules-2.12.5/probes/lttng-probe-writeback.ko At main.c:160: - SSL error:02001002:system library:fopen:No such file or directory: crypto/bio/bss_file.c:69 - SSL error:2006D080:BIO routines:BIO_new_file:no such file: crypto/bio/bss_file.c:76 sign-file: certs/signing_key.pem: No such file or directory INSTALL /tmp/B.bNSdI9/BUILD/lttng-modules-2.12.5/lttng-modules-2.12.5/lttng-tracer.ko At main.c:160: - SSL error:02001002:system library:fopen:No such file or directory: crypto/bio/bss_file.c:69 - SSL error:2006D080:BIO routines:BIO_new_file:no such file: crypto/bio/bss_file.c:76 sign-file: certs/signing_key.pem: No such file or directory make[1]: Entering directory '/usr/src/linux-5.4-5.4.116' DEPMOD 5.4.116-1 Warning: modules_install: missing 'System.map' file. Skipping depmod. make[1]: Leaving directory '/usr/src/linux-5.4-5.4.116' + /usr/bin/make -Otarget -j9 clean 'KERNELDIR=/usr/src/linux-4.9' /usr/bin/make -C /usr/src/linux-4.9 M=/tmp/B.bNSdI9/BUILD/lttng-modules-2.12.5/lttng-modules-2.12.5 clean make[1]: Entering directory '/usr/src/linux-4.9-4.9.268' CLEAN /tmp/B.bNSdI9/BUILD/lttng-modules-2.12.5/lttng-modules-2.12.5/Module.symvers make[1]: Leaving directory '/usr/src/linux-4.9-4.9.268' + /usr/bin/make -Otarget -j9 'KERNELDIR=/usr/src/linux-4.9' /usr/bin/make -C /usr/src/linux-4.9 M=/tmp/B.bNSdI9/BUILD/lttng-modules-2.12.5/lttng-modules-2.12.5 CONFIG_LTTNG=m CONFIG_LTTNG_CLOCK_PLUGIN_TEST=m modules CC [M] /tmp/B.bNSdI9/BUILD/lttng-modules-2.12.5/lttng-modules-2.12.5/lttng-clock.o CC [M] /tmp/B.bNSdI9/BUILD/lttng-modules-2.12.5/lttng-modules-2.12.5/lttng-string-utils.o CC [M] /tmp/B.bNSdI9/BUILD/lttng-modules-2.12.5/lttng-modules-2.12.5/lttng-ring-buffer-metadata-client.o CC [M] /tmp/B.bNSdI9/BUILD/lttng-modules-2.12.5/lttng-modules-2.12.5/lttng-ring-buffer-metadata-mmap-client.o CC [M] /tmp/B.bNSdI9/BUILD/lttng-modules-2.12.5/lttng-modules-2.12.5/lttng-ring-buffer-client-overwrite.o CC [M] /tmp/B.bNSdI9/BUILD/lttng-modules-2.12.5/lttng-modules-2.12.5/lttng-ring-buffer-client-mmap-discard.o CC [M] /tmp/B.bNSdI9/BUILD/lttng-modules-2.12.5/lttng-modules-2.12.5/lttng-abi.o CC [M] /tmp/B.bNSdI9/BUILD/lttng-modules-2.12.5/lttng-modules-2.12.5/lttng-ring-buffer-client-mmap-overwrite.o CC [M] /tmp/B.bNSdI9/BUILD/lttng-modules-2.12.5/lttng-modules-2.12.5/lttng-context-pid.o CC [M] /tmp/B.bNSdI9/BUILD/lttng-modules-2.12.5/lttng-modules-2.12.5/lttng-ring-buffer-client-discard.o CC [M] /tmp/B.bNSdI9/BUILD/lttng-modules-2.12.5/lttng-modules-2.12.5/lttng-probes.o CC [M] /tmp/B.bNSdI9/BUILD/lttng-modules-2.12.5/lttng-modules-2.12.5/lttng-context-procname.o CC [M] /tmp/B.bNSdI9/BUILD/lttng-modules-2.12.5/lttng-modules-2.12.5/lttng-context-prio.o CC [M] /tmp/B.bNSdI9/BUILD/lttng-modules-2.12.5/lttng-modules-2.12.5/lttng-context-nice.o CC [M] /tmp/B.bNSdI9/BUILD/lttng-modules-2.12.5/lttng-modules-2.12.5/lttng-context.o CC [M] /tmp/B.bNSdI9/BUILD/lttng-modules-2.12.5/lttng-modules-2.12.5/lttng-events.o CC [M] /tmp/B.bNSdI9/BUILD/lttng-modules-2.12.5/lttng-modules-2.12.5/lttng-context-vpid.o CC [M] /tmp/B.bNSdI9/BUILD/lttng-modules-2.12.5/lttng-modules-2.12.5/lttng-context-tid.o CC [M] /tmp/B.bNSdI9/BUILD/lttng-modules-2.12.5/lttng-modules-2.12.5/lttng-context-vtid.o CC [M] /tmp/B.bNSdI9/BUILD/lttng-modules-2.12.5/lttng-modules-2.12.5/lttng-context-ppid.o CC [M] /tmp/B.bNSdI9/BUILD/lttng-modules-2.12.5/lttng-modules-2.12.5/lttng-context-cpu-id.o CC [M] /tmp/B.bNSdI9/BUILD/lttng-modules-2.12.5/lttng-modules-2.12.5/lttng-context-vppid.o CC [M] /tmp/B.bNSdI9/BUILD/lttng-modules-2.12.5/lttng-modules-2.12.5/lttng-context-uid.o CC [M] /tmp/B.bNSdI9/BUILD/lttng-modules-2.12.5/lttng-modules-2.12.5/lttng-context-suid.o CC [M] /tmp/B.bNSdI9/BUILD/lttng-modules-2.12.5/lttng-modules-2.12.5/lttng-context-euid.o CC [M] /tmp/B.bNSdI9/BUILD/lttng-modules-2.12.5/lttng-modules-2.12.5/lttng-context-gid.o CC [M] /tmp/B.bNSdI9/BUILD/lttng-modules-2.12.5/lttng-modules-2.12.5/lttng-context-egid.o CC [M] /tmp/B.bNSdI9/BUILD/lttng-modules-2.12.5/lttng-modules-2.12.5/lttng-context-sgid.o CC [M] /tmp/B.bNSdI9/BUILD/lttng-modules-2.12.5/lttng-modules-2.12.5/lttng-context-vuid.o CC [M] /tmp/B.bNSdI9/BUILD/lttng-modules-2.12.5/lttng-modules-2.12.5/lttng-context-veuid.o CC [M] /tmp/B.bNSdI9/BUILD/lttng-modules-2.12.5/lttng-modules-2.12.5/lttng-context-vgid.o CC [M] /tmp/B.bNSdI9/BUILD/lttng-modules-2.12.5/lttng-modules-2.12.5/lttng-context-vsuid.o CC [M] /tmp/B.bNSdI9/BUILD/lttng-modules-2.12.5/lttng-modules-2.12.5/lttng-context-vegid.o CC [M] /tmp/B.bNSdI9/BUILD/lttng-modules-2.12.5/lttng-modules-2.12.5/lttng-context-vsgid.o CC [M] /tmp/B.bNSdI9/BUILD/lttng-modules-2.12.5/lttng-modules-2.12.5/lttng-context-interruptible.o CC [M] /tmp/B.bNSdI9/BUILD/lttng-modules-2.12.5/lttng-modules-2.12.5/lttng-context-need-reschedule.o CC [M] /tmp/B.bNSdI9/BUILD/lttng-modules-2.12.5/lttng-modules-2.12.5/lttng-calibrate.o CC [M] /tmp/B.bNSdI9/BUILD/lttng-modules-2.12.5/lttng-modules-2.12.5/lttng-context-callstack.o CC [M] /tmp/B.bNSdI9/BUILD/lttng-modules-2.12.5/lttng-modules-2.12.5/lttng-context-hostname.o CC [M] /tmp/B.bNSdI9/BUILD/lttng-modules-2.12.5/lttng-modules-2.12.5/lttng-tracker-id.o CC [M] /tmp/B.bNSdI9/BUILD/lttng-modules-2.12.5/lttng-modules-2.12.5/probes/lttng.o CC [M] /tmp/B.bNSdI9/BUILD/lttng-modules-2.12.5/lttng-modules-2.12.5/probes/lttng-probe-user.o CC [M] /tmp/B.bNSdI9/BUILD/lttng-modules-2.12.5/lttng-modules-2.12.5/lttng-filter.o CC [M] /tmp/B.bNSdI9/BUILD/lttng-modules-2.12.5/lttng-modules-2.12.5/lttng-tp-mempool.o CC [M] /tmp/B.bNSdI9/BUILD/lttng-modules-2.12.5/lttng-modules-2.12.5/lttng-filter-validator.o CC [M] /tmp/B.bNSdI9/BUILD/lttng-modules-2.12.5/lttng-modules-2.12.5/lttng-context-cgroup-ns.o CC [M] /tmp/B.bNSdI9/BUILD/lttng-modules-2.12.5/lttng-modules-2.12.5/lttng-filter-specialize.o CC [M] /tmp/B.bNSdI9/BUILD/lttng-modules-2.12.5/lttng-modules-2.12.5/lttng-tracepoint.o CC [M] /tmp/B.bNSdI9/BUILD/lttng-modules-2.12.5/lttng-modules-2.12.5/lttng-context-ipc-ns.o CC [M] /tmp/B.bNSdI9/BUILD/lttng-modules-2.12.5/lttng-modules-2.12.5/lttng-filter-interpreter.o CC [M] /tmp/B.bNSdI9/BUILD/lttng-modules-2.12.5/lttng-modules-2.12.5/lttng-context-perf-counters.o CC [M] /tmp/B.bNSdI9/BUILD/lttng-modules-2.12.5/lttng-modules-2.12.5/lttng-context-mnt-ns.o CC [M] /tmp/B.bNSdI9/BUILD/lttng-modules-2.12.5/lttng-modules-2.12.5/wrapper/page_alloc.o CC [M] /tmp/B.bNSdI9/BUILD/lttng-modules-2.12.5/lttng-modules-2.12.5/wrapper/trace-clock.o CC [M] /tmp/B.bNSdI9/BUILD/lttng-modules-2.12.5/lttng-modules-2.12.5/wrapper/random.o CC [M] /tmp/B.bNSdI9/BUILD/lttng-modules-2.12.5/lttng-modules-2.12.5/lttng-context-uts-ns.o CC [M] /tmp/B.bNSdI9/BUILD/lttng-modules-2.12.5/lttng-modules-2.12.5/lttng-context-pid-ns.o CC [M] /tmp/B.bNSdI9/BUILD/lttng-modules-2.12.5/lttng-modules-2.12.5/lttng-context-net-ns.o CC [M] /tmp/B.bNSdI9/BUILD/lttng-modules-2.12.5/lttng-modules-2.12.5/lttng-context-user-ns.o CC [M] /tmp/B.bNSdI9/BUILD/lttng-modules-2.12.5/lttng-modules-2.12.5/wrapper/kallsyms.o CC [M] /tmp/B.bNSdI9/BUILD/lttng-modules-2.12.5/lttng-modules-2.12.5/wrapper/irqdesc.o CC [M] /tmp/B.bNSdI9/BUILD/lttng-modules-2.12.5/lttng-modules-2.12.5/wrapper/fdtable.o CC [M] /tmp/B.bNSdI9/BUILD/lttng-modules-2.12.5/lttng-modules-2.12.5/lttng-wrapper-impl.o CC [M] /tmp/B.bNSdI9/BUILD/lttng-modules-2.12.5/lttng-modules-2.12.5/tests/clock-plugin/lttng-clock-plugin-test.o CC [M] /tmp/B.bNSdI9/BUILD/lttng-modules-2.12.5/lttng-modules-2.12.5/tests/probes/lttng-test.o LD [M] /tmp/B.bNSdI9/BUILD/lttng-modules-2.12.5/lttng-modules-2.12.5/tests/lttng-clock-plugin-test.o LD [M] /tmp/B.bNSdI9/BUILD/lttng-modules-2.12.5/lttng-modules-2.12.5/tests/lttng-test.o CC [M] /tmp/B.bNSdI9/BUILD/lttng-modules-2.12.5/lttng-modules-2.12.5/lttng-statedump-impl.o CC [M] /tmp/B.bNSdI9/BUILD/lttng-modules-2.12.5/lttng-modules-2.12.5/probes/lttng-probe-irq.o CC [M] /tmp/B.bNSdI9/BUILD/lttng-modules-2.12.5/lttng-modules-2.12.5/lib/ringbuffer/ring_buffer_backend.o CC [M] /tmp/B.bNSdI9/BUILD/lttng-modules-2.12.5/lttng-modules-2.12.5/lib/ringbuffer/ring_buffer_frontend.o CC [M] /tmp/B.bNSdI9/BUILD/lttng-modules-2.12.5/lttng-modules-2.12.5/probes/lttng-probe-sched.o CC [M] /tmp/B.bNSdI9/BUILD/lttng-modules-2.12.5/lttng-modules-2.12.5/probes/lttng-probe-timer.o CC [M] /tmp/B.bNSdI9/BUILD/lttng-modules-2.12.5/lttng-modules-2.12.5/probes/lttng-probe-module.o CC [M] /tmp/B.bNSdI9/BUILD/lttng-modules-2.12.5/lttng-modules-2.12.5/probes/lttng-probe-kmem.o CC [M] /tmp/B.bNSdI9/BUILD/lttng-modules-2.12.5/lttng-modules-2.12.5/lib/ringbuffer/ring_buffer_iterator.o CC [M] /tmp/B.bNSdI9/BUILD/lttng-modules-2.12.5/lttng-modules-2.12.5/probes/lttng-probe-power.o CC [M] /tmp/B.bNSdI9/BUILD/lttng-modules-2.12.5/lttng-modules-2.12.5/lib/ringbuffer/ring_buffer_vfs.o CC [M] /tmp/B.bNSdI9/BUILD/lttng-modules-2.12.5/lttng-modules-2.12.5/probes/lttng-probe-9p.o CC [M] /tmp/B.bNSdI9/BUILD/lttng-modules-2.12.5/lttng-modules-2.12.5/lib/ringbuffer/ring_buffer_splice.o CC [M] /tmp/B.bNSdI9/BUILD/lttng-modules-2.12.5/lttng-modules-2.12.5/lib/ringbuffer/ring_buffer_mmap.o CC [M] /tmp/B.bNSdI9/BUILD/lttng-modules-2.12.5/lttng-modules-2.12.5/probes/lttng-probe-i2c.o CC [M] /tmp/B.bNSdI9/BUILD/lttng-modules-2.12.5/lttng-modules-2.12.5/lib/prio_heap/lttng_prio_heap.o CC [M] /tmp/B.bNSdI9/BUILD/lttng-modules-2.12.5/lttng-modules-2.12.5/lib/../wrapper/splice.o LD [M] /tmp/B.bNSdI9/BUILD/lttng-modules-2.12.5/lttng-modules-2.12.5/lib/lttng-lib-ring-buffer.o CC [M] /tmp/B.bNSdI9/BUILD/lttng-modules-2.12.5/lttng-modules-2.12.5/probes/lttng-probe-x86-irq-vectors.o CC [M] /tmp/B.bNSdI9/BUILD/lttng-modules-2.12.5/lttng-modules-2.12.5/probes/lttng-probe-kvm.o LD [M] /tmp/B.bNSdI9/BUILD/lttng-modules-2.12.5/lttng-modules-2.12.5/lttng-wrapper.o LD [M] /tmp/B.bNSdI9/BUILD/lttng-modules-2.12.5/lttng-modules-2.12.5/lttng-statedump.o CC [M] /tmp/B.bNSdI9/BUILD/lttng-modules-2.12.5/lttng-modules-2.12.5/probes/lttng-probe-statedump.o CC [M] /tmp/B.bNSdI9/BUILD/lttng-modules-2.12.5/lttng-modules-2.12.5/probes/lttng-probe-x86-exceptions.o CC [M] /tmp/B.bNSdI9/BUILD/lttng-modules-2.12.5/lttng-modules-2.12.5/probes/lttng-probe-kvm-x86-mmu.o CC [M] /tmp/B.bNSdI9/BUILD/lttng-modules-2.12.5/lttng-modules-2.12.5/probes/lttng-probe-signal.o CC [M] /tmp/B.bNSdI9/BUILD/lttng-modules-2.12.5/lttng-modules-2.12.5/probes/lttng-probe-napi.o CC [M] /tmp/B.bNSdI9/BUILD/lttng-modules-2.12.5/lttng-modules-2.12.5/probes/lttng-probe-skb.o CC [M] /tmp/B.bNSdI9/BUILD/lttng-modules-2.12.5/lttng-modules-2.12.5/probes/lttng-probe-sock.o CC [M] /tmp/B.bNSdI9/BUILD/lttng-modules-2.12.5/lttng-modules-2.12.5/probes/lttng-probe-kvm-x86.o CC [M] /tmp/B.bNSdI9/BUILD/lttng-modules-2.12.5/lttng-modules-2.12.5/probes/lttng-probe-net.o CC [M] /tmp/B.bNSdI9/BUILD/lttng-modules-2.12.5/lttng-modules-2.12.5/probes/lttng-probe-udp.o CC [M] /tmp/B.bNSdI9/BUILD/lttng-modules-2.12.5/lttng-modules-2.12.5/probes/lttng-probe-gpio.o CC [M] /tmp/B.bNSdI9/BUILD/lttng-modules-2.12.5/lttng-modules-2.12.5/probes/lttng-probe-asoc.o CC [M] /tmp/B.bNSdI9/BUILD/lttng-modules-2.12.5/lttng-modules-2.12.5/probes/lttng-probe-block.o CC [M] /tmp/B.bNSdI9/BUILD/lttng-modules-2.12.5/lttng-modules-2.12.5/probes/lttng-probe-regulator.o CC [M] /tmp/B.bNSdI9/BUILD/lttng-modules-2.12.5/lttng-modules-2.12.5/probes/lttng-probe-jbd2.o CC [M] /tmp/B.bNSdI9/BUILD/lttng-modules-2.12.5/lttng-modules-2.12.5/probes/lttng-probe-scsi.o CC [M] /tmp/B.bNSdI9/BUILD/lttng-modules-2.12.5/lttng-modules-2.12.5/probes/lttng-probe-compaction.o CC [M] /tmp/B.bNSdI9/BUILD/lttng-modules-2.12.5/lttng-modules-2.12.5/probes/lttng-probe-printk.o CC [M] /tmp/B.bNSdI9/BUILD/lttng-modules-2.12.5/lttng-modules-2.12.5/probes/lttng-probe-vmscan.o CC [M] /tmp/B.bNSdI9/BUILD/lttng-modules-2.12.5/lttng-modules-2.12.5/probes/lttng-probe-random.o CC [M] /tmp/B.bNSdI9/BUILD/lttng-modules-2.12.5/lttng-modules-2.12.5/probes/lttng-probe-rcu.o CC [M] /tmp/B.bNSdI9/BUILD/lttng-modules-2.12.5/lttng-modules-2.12.5/probes/lttng-probe-v4l2.o CC [M] /tmp/B.bNSdI9/BUILD/lttng-modules-2.12.5/lttng-modules-2.12.5/probes/lttng-probe-regmap.o CC [M] /tmp/B.bNSdI9/BUILD/lttng-modules-2.12.5/lttng-modules-2.12.5/probes/lttng-probe-workqueue.o CC [M] /tmp/B.bNSdI9/BUILD/lttng-modules-2.12.5/lttng-modules-2.12.5/probes/lttng-kprobes.o CC [M] /tmp/B.bNSdI9/BUILD/lttng-modules-2.12.5/lttng-modules-2.12.5/probes/lttng-probe-sunrpc.o CC [M] /tmp/B.bNSdI9/BUILD/lttng-modules-2.12.5/lttng-modules-2.12.5/probes/lttng-uprobes.o CC [M] /tmp/B.bNSdI9/BUILD/lttng-modules-2.12.5/lttng-modules-2.12.5/probes/lttng-probe-btrfs.o CC [M] /tmp/B.bNSdI9/BUILD/lttng-modules-2.12.5/lttng-modules-2.12.5/probes/lttng-kretprobes.o CC [M] /tmp/B.bNSdI9/BUILD/lttng-modules-2.12.5/lttng-modules-2.12.5/probes/lttng-probe-writeback.o CC [M] /tmp/B.bNSdI9/BUILD/lttng-modules-2.12.5/lttng-modules-2.12.5/probes/lttng-probe-ext4.o CC [M] /tmp/B.bNSdI9/BUILD/lttng-modules-2.12.5/lttng-modules-2.12.5/lttng-syscalls.o LD [M] /tmp/B.bNSdI9/BUILD/lttng-modules-2.12.5/lttng-modules-2.12.5/lttng-tracer.o make[1]: Entering directory '/usr/src/linux-4.9-4.9.268' Building modules, stage 2. make[1]: Leaving directory '/usr/src/linux-4.9-4.9.268' MODPOST 54 modules CC /tmp/B.bNSdI9/BUILD/lttng-modules-2.12.5/lttng-modules-2.12.5/lttng-ring-buffer-client-discard.mod.o CC /tmp/B.bNSdI9/BUILD/lttng-modules-2.12.5/lttng-modules-2.12.5/lttng-ring-buffer-client-mmap-overwrite.mod.o CC /tmp/B.bNSdI9/BUILD/lttng-modules-2.12.5/lttng-modules-2.12.5/lib/lttng-lib-ring-buffer.mod.o CC /tmp/B.bNSdI9/BUILD/lttng-modules-2.12.5/lttng-modules-2.12.5/lttng-ring-buffer-metadata-client.mod.o CC /tmp/B.bNSdI9/BUILD/lttng-modules-2.12.5/lttng-modules-2.12.5/lttng-statedump.mod.o CC /tmp/B.bNSdI9/BUILD/lttng-modules-2.12.5/lttng-modules-2.12.5/lttng-clock.mod.o CC /tmp/B.bNSdI9/BUILD/lttng-modules-2.12.5/lttng-modules-2.12.5/lttng-ring-buffer-client-overwrite.mod.o CC /tmp/B.bNSdI9/BUILD/lttng-modules-2.12.5/lttng-modules-2.12.5/lttng-ring-buffer-client-mmap-discard.mod.o CC /tmp/B.bNSdI9/BUILD/lttng-modules-2.12.5/lttng-modules-2.12.5/lttng-ring-buffer-metadata-mmap-client.mod.o CC /tmp/B.bNSdI9/BUILD/lttng-modules-2.12.5/lttng-modules-2.12.5/probes/lttng-kprobes.mod.o CC /tmp/B.bNSdI9/BUILD/lttng-modules-2.12.5/lttng-modules-2.12.5/probes/lttng-probe-9p.mod.o CC /tmp/B.bNSdI9/BUILD/lttng-modules-2.12.5/lttng-modules-2.12.5/lttng-wrapper.mod.o CC /tmp/B.bNSdI9/BUILD/lttng-modules-2.12.5/lttng-modules-2.12.5/probes/lttng-kretprobes.mod.o CC /tmp/B.bNSdI9/BUILD/lttng-modules-2.12.5/lttng-modules-2.12.5/probes/lttng-probe-asoc.mod.o CC /tmp/B.bNSdI9/BUILD/lttng-modules-2.12.5/lttng-modules-2.12.5/lttng-tracer.mod.o CC /tmp/B.bNSdI9/BUILD/lttng-modules-2.12.5/lttng-modules-2.12.5/probes/lttng-probe-btrfs.mod.o CC /tmp/B.bNSdI9/BUILD/lttng-modules-2.12.5/lttng-modules-2.12.5/probes/lttng-probe-block.mod.o CC /tmp/B.bNSdI9/BUILD/lttng-modules-2.12.5/lttng-modules-2.12.5/probes/lttng-probe-compaction.mod.o CC /tmp/B.bNSdI9/BUILD/lttng-modules-2.12.5/lttng-modules-2.12.5/probes/lttng-probe-irq.mod.o CC /tmp/B.bNSdI9/BUILD/lttng-modules-2.12.5/lttng-modules-2.12.5/probes/lttng-probe-i2c.mod.o CC /tmp/B.bNSdI9/BUILD/lttng-modules-2.12.5/lttng-modules-2.12.5/probes/lttng-probe-gpio.mod.o CC /tmp/B.bNSdI9/BUILD/lttng-modules-2.12.5/lttng-modules-2.12.5/probes/lttng-probe-ext4.mod.o CC /tmp/B.bNSdI9/BUILD/lttng-modules-2.12.5/lttng-modules-2.12.5/probes/lttng-probe-kmem.mod.o CC /tmp/B.bNSdI9/BUILD/lttng-modules-2.12.5/lttng-modules-2.12.5/probes/lttng-probe-jbd2.mod.o CC /tmp/B.bNSdI9/BUILD/lttng-modules-2.12.5/lttng-modules-2.12.5/probes/lttng-probe-kvm-x86-mmu.mod.o CC /tmp/B.bNSdI9/BUILD/lttng-modules-2.12.5/lttng-modules-2.12.5/probes/lttng-probe-kvm-x86.mod.o CC /tmp/B.bNSdI9/BUILD/lttng-modules-2.12.5/lttng-modules-2.12.5/probes/lttng-probe-kvm.mod.o CC /tmp/B.bNSdI9/BUILD/lttng-modules-2.12.5/lttng-modules-2.12.5/probes/lttng-probe-module.mod.o CC /tmp/B.bNSdI9/BUILD/lttng-modules-2.12.5/lttng-modules-2.12.5/probes/lttng-probe-net.mod.o CC /tmp/B.bNSdI9/BUILD/lttng-modules-2.12.5/lttng-modules-2.12.5/probes/lttng-probe-napi.mod.o CC /tmp/B.bNSdI9/BUILD/lttng-modules-2.12.5/lttng-modules-2.12.5/probes/lttng-probe-power.mod.o CC /tmp/B.bNSdI9/BUILD/lttng-modules-2.12.5/lttng-modules-2.12.5/probes/lttng-probe-printk.mod.o CC /tmp/B.bNSdI9/BUILD/lttng-modules-2.12.5/lttng-modules-2.12.5/probes/lttng-probe-random.mod.o CC /tmp/B.bNSdI9/BUILD/lttng-modules-2.12.5/lttng-modules-2.12.5/probes/lttng-probe-regmap.mod.o CC /tmp/B.bNSdI9/BUILD/lttng-modules-2.12.5/lttng-modules-2.12.5/probes/lttng-probe-rcu.mod.o CC /tmp/B.bNSdI9/BUILD/lttng-modules-2.12.5/lttng-modules-2.12.5/probes/lttng-probe-regulator.mod.o CC /tmp/B.bNSdI9/BUILD/lttng-modules-2.12.5/lttng-modules-2.12.5/probes/lttng-probe-scsi.mod.o CC /tmp/B.bNSdI9/BUILD/lttng-modules-2.12.5/lttng-modules-2.12.5/probes/lttng-probe-sched.mod.o CC /tmp/B.bNSdI9/BUILD/lttng-modules-2.12.5/lttng-modules-2.12.5/probes/lttng-probe-signal.mod.o CC /tmp/B.bNSdI9/BUILD/lttng-modules-2.12.5/lttng-modules-2.12.5/probes/lttng-probe-sock.mod.o CC /tmp/B.bNSdI9/BUILD/lttng-modules-2.12.5/lttng-modules-2.12.5/probes/lttng-probe-skb.mod.o CC /tmp/B.bNSdI9/BUILD/lttng-modules-2.12.5/lttng-modules-2.12.5/probes/lttng-probe-statedump.mod.o CC /tmp/B.bNSdI9/BUILD/lttng-modules-2.12.5/lttng-modules-2.12.5/probes/lttng-probe-sunrpc.mod.o CC /tmp/B.bNSdI9/BUILD/lttng-modules-2.12.5/lttng-modules-2.12.5/probes/lttng-probe-timer.mod.o CC /tmp/B.bNSdI9/BUILD/lttng-modules-2.12.5/lttng-modules-2.12.5/probes/lttng-probe-udp.mod.o CC /tmp/B.bNSdI9/BUILD/lttng-modules-2.12.5/lttng-modules-2.12.5/probes/lttng-probe-v4l2.mod.o LD [M] /tmp/B.bNSdI9/BUILD/lttng-modules-2.12.5/lttng-modules-2.12.5/lib/lttng-lib-ring-buffer.ko CC /tmp/B.bNSdI9/BUILD/lttng-modules-2.12.5/lttng-modules-2.12.5/probes/lttng-probe-vmscan.mod.o LD [M] /tmp/B.bNSdI9/BUILD/lttng-modules-2.12.5/lttng-modules-2.12.5/lttng-clock.ko CC /tmp/B.bNSdI9/BUILD/lttng-modules-2.12.5/lttng-modules-2.12.5/probes/lttng-probe-workqueue.mod.o LD [M] /tmp/B.bNSdI9/BUILD/lttng-modules-2.12.5/lttng-modules-2.12.5/lttng-ring-buffer-client-discard.ko LD [M] /tmp/B.bNSdI9/BUILD/lttng-modules-2.12.5/lttng-modules-2.12.5/lttng-ring-buffer-client-mmap-discard.ko LD [M] /tmp/B.bNSdI9/BUILD/lttng-modules-2.12.5/lttng-modules-2.12.5/lttng-ring-buffer-client-mmap-overwrite.ko LD [M] /tmp/B.bNSdI9/BUILD/lttng-modules-2.12.5/lttng-modules-2.12.5/lttng-ring-buffer-client-overwrite.ko LD [M] /tmp/B.bNSdI9/BUILD/lttng-modules-2.12.5/lttng-modules-2.12.5/lttng-ring-buffer-metadata-client.ko LD [M] /tmp/B.bNSdI9/BUILD/lttng-modules-2.12.5/lttng-modules-2.12.5/lttng-ring-buffer-metadata-mmap-client.ko LD [M] /tmp/B.bNSdI9/BUILD/lttng-modules-2.12.5/lttng-modules-2.12.5/lttng-statedump.ko LD [M] /tmp/B.bNSdI9/BUILD/lttng-modules-2.12.5/lttng-modules-2.12.5/lttng-tracer.ko CC /tmp/B.bNSdI9/BUILD/lttng-modules-2.12.5/lttng-modules-2.12.5/probes/lttng-probe-writeback.mod.o LD [M] /tmp/B.bNSdI9/BUILD/lttng-modules-2.12.5/lttng-modules-2.12.5/lttng-wrapper.ko LD [M] /tmp/B.bNSdI9/BUILD/lttng-modules-2.12.5/lttng-modules-2.12.5/probes/lttng-kprobes.ko LD [M] /tmp/B.bNSdI9/BUILD/lttng-modules-2.12.5/lttng-modules-2.12.5/probes/lttng-kretprobes.ko LD [M] /tmp/B.bNSdI9/BUILD/lttng-modules-2.12.5/lttng-modules-2.12.5/probes/lttng-probe-9p.ko LD [M] /tmp/B.bNSdI9/BUILD/lttng-modules-2.12.5/lttng-modules-2.12.5/probes/lttng-probe-asoc.ko LD [M] /tmp/B.bNSdI9/BUILD/lttng-modules-2.12.5/lttng-modules-2.12.5/probes/lttng-probe-block.ko LD [M] /tmp/B.bNSdI9/BUILD/lttng-modules-2.12.5/lttng-modules-2.12.5/probes/lttng-probe-btrfs.ko CC /tmp/B.bNSdI9/BUILD/lttng-modules-2.12.5/lttng-modules-2.12.5/probes/lttng-probe-x86-exceptions.mod.o CC /tmp/B.bNSdI9/BUILD/lttng-modules-2.12.5/lttng-modules-2.12.5/probes/lttng-probe-x86-irq-vectors.mod.o LD [M] /tmp/B.bNSdI9/BUILD/lttng-modules-2.12.5/lttng-modules-2.12.5/probes/lttng-probe-compaction.ko LD [M] /tmp/B.bNSdI9/BUILD/lttng-modules-2.12.5/lttng-modules-2.12.5/probes/lttng-probe-ext4.ko LD [M] /tmp/B.bNSdI9/BUILD/lttng-modules-2.12.5/lttng-modules-2.12.5/probes/lttng-probe-gpio.ko LD [M] /tmp/B.bNSdI9/BUILD/lttng-modules-2.12.5/lttng-modules-2.12.5/probes/lttng-probe-i2c.ko LD [M] /tmp/B.bNSdI9/BUILD/lttng-modules-2.12.5/lttng-modules-2.12.5/probes/lttng-probe-irq.ko LD [M] /tmp/B.bNSdI9/BUILD/lttng-modules-2.12.5/lttng-modules-2.12.5/probes/lttng-probe-jbd2.ko LD [M] /tmp/B.bNSdI9/BUILD/lttng-modules-2.12.5/lttng-modules-2.12.5/probes/lttng-probe-kmem.ko LD [M] /tmp/B.bNSdI9/BUILD/lttng-modules-2.12.5/lttng-modules-2.12.5/probes/lttng-probe-kvm-x86-mmu.ko LD [M] /tmp/B.bNSdI9/BUILD/lttng-modules-2.12.5/lttng-modules-2.12.5/probes/lttng-probe-kvm-x86.ko LD [M] /tmp/B.bNSdI9/BUILD/lttng-modules-2.12.5/lttng-modules-2.12.5/probes/lttng-probe-kvm.ko LD [M] /tmp/B.bNSdI9/BUILD/lttng-modules-2.12.5/lttng-modules-2.12.5/probes/lttng-probe-module.ko LD [M] /tmp/B.bNSdI9/BUILD/lttng-modules-2.12.5/lttng-modules-2.12.5/probes/lttng-probe-napi.ko LD [M] /tmp/B.bNSdI9/BUILD/lttng-modules-2.12.5/lttng-modules-2.12.5/probes/lttng-probe-power.ko LD [M] /tmp/B.bNSdI9/BUILD/lttng-modules-2.12.5/lttng-modules-2.12.5/probes/lttng-probe-net.ko LD [M] /tmp/B.bNSdI9/BUILD/lttng-modules-2.12.5/lttng-modules-2.12.5/probes/lttng-probe-printk.ko LD [M] /tmp/B.bNSdI9/BUILD/lttng-modules-2.12.5/lttng-modules-2.12.5/probes/lttng-probe-random.ko LD [M] /tmp/B.bNSdI9/BUILD/lttng-modules-2.12.5/lttng-modules-2.12.5/probes/lttng-probe-rcu.ko LD [M] /tmp/B.bNSdI9/BUILD/lttng-modules-2.12.5/lttng-modules-2.12.5/probes/lttng-probe-regmap.ko LD [M] /tmp/B.bNSdI9/BUILD/lttng-modules-2.12.5/lttng-modules-2.12.5/probes/lttng-probe-regulator.ko LD [M] /tmp/B.bNSdI9/BUILD/lttng-modules-2.12.5/lttng-modules-2.12.5/probes/lttng-probe-sched.ko LD [M] /tmp/B.bNSdI9/BUILD/lttng-modules-2.12.5/lttng-modules-2.12.5/probes/lttng-probe-scsi.ko LD [M] /tmp/B.bNSdI9/BUILD/lttng-modules-2.12.5/lttng-modules-2.12.5/probes/lttng-probe-signal.ko LD [M] /tmp/B.bNSdI9/BUILD/lttng-modules-2.12.5/lttng-modules-2.12.5/probes/lttng-probe-skb.ko LD [M] /tmp/B.bNSdI9/BUILD/lttng-modules-2.12.5/lttng-modules-2.12.5/probes/lttng-probe-sock.ko LD [M] /tmp/B.bNSdI9/BUILD/lttng-modules-2.12.5/lttng-modules-2.12.5/probes/lttng-probe-sunrpc.ko LD [M] /tmp/B.bNSdI9/BUILD/lttng-modules-2.12.5/lttng-modules-2.12.5/probes/lttng-probe-timer.ko LD [M] /tmp/B.bNSdI9/BUILD/lttng-modules-2.12.5/lttng-modules-2.12.5/probes/lttng-probe-statedump.ko LD [M] /tmp/B.bNSdI9/BUILD/lttng-modules-2.12.5/lttng-modules-2.12.5/probes/lttng-probe-udp.ko LD [M] /tmp/B.bNSdI9/BUILD/lttng-modules-2.12.5/lttng-modules-2.12.5/probes/lttng-probe-v4l2.ko LD [M] /tmp/B.bNSdI9/BUILD/lttng-modules-2.12.5/lttng-modules-2.12.5/probes/lttng-probe-vmscan.ko LD [M] /tmp/B.bNSdI9/BUILD/lttng-modules-2.12.5/lttng-modules-2.12.5/probes/lttng-probe-workqueue.ko LD [M] /tmp/B.bNSdI9/BUILD/lttng-modules-2.12.5/lttng-modules-2.12.5/probes/lttng-probe-writeback.ko LD [M] /tmp/B.bNSdI9/BUILD/lttng-modules-2.12.5/lttng-modules-2.12.5/probes/lttng-probe-x86-exceptions.ko LD [M] /tmp/B.bNSdI9/BUILD/lttng-modules-2.12.5/lttng-modules-2.12.5/probes/lttng-probe-x86-irq-vectors.ko CC /tmp/B.bNSdI9/BUILD/lttng-modules-2.12.5/lttng-modules-2.12.5/probes/lttng-uprobes.mod.o LD [M] /tmp/B.bNSdI9/BUILD/lttng-modules-2.12.5/lttng-modules-2.12.5/probes/lttng-uprobes.ko CC /tmp/B.bNSdI9/BUILD/lttng-modules-2.12.5/lttng-modules-2.12.5/tests/lttng-clock-plugin-test.mod.o LD [M] /tmp/B.bNSdI9/BUILD/lttng-modules-2.12.5/lttng-modules-2.12.5/tests/lttng-clock-plugin-test.ko CC /tmp/B.bNSdI9/BUILD/lttng-modules-2.12.5/lttng-modules-2.12.5/tests/lttng-test.mod.o LD [M] /tmp/B.bNSdI9/BUILD/lttng-modules-2.12.5/lttng-modules-2.12.5/tests/lttng-test.ko + pwd + p=/tmp/B.bNSdI9/BUILD/lttng-modules-2.12.5/lttng-modules-2.12.5 + /usr/bin/make -Otarget -j9 modules_install 'INSTALL_MOD_PATH=/tmp/B.bNSdI9/BUILD/lttng-modules-2.12.5/lttng-modules-2.12.5/../installed' 'INSTALL_MOD_DIR=kernel/lttng' 'KERNELDIR=/usr/src/linux-4.9' /usr/bin/make -C /usr/src/linux-4.9 M=/tmp/B.bNSdI9/BUILD/lttng-modules-2.12.5/lttng-modules-2.12.5 CONFIG_LTTNG=m CONFIG_LTTNG_CLOCK_PLUGIN_TEST=m modules_install INSTALL /tmp/B.bNSdI9/BUILD/lttng-modules-2.12.5/lttng-modules-2.12.5/lttng-clock.ko INSTALL /tmp/B.bNSdI9/BUILD/lttng-modules-2.12.5/lttng-modules-2.12.5/lttng-ring-buffer-metadata-mmap-client.ko INSTALL /tmp/B.bNSdI9/BUILD/lttng-modules-2.12.5/lttng-modules-2.12.5/lttng-ring-buffer-client-mmap-overwrite.ko INSTALL /tmp/B.bNSdI9/BUILD/lttng-modules-2.12.5/lttng-modules-2.12.5/lttng-ring-buffer-client-discard.ko INSTALL /tmp/B.bNSdI9/BUILD/lttng-modules-2.12.5/lttng-modules-2.12.5/lttng-ring-buffer-client-overwrite.ko INSTALL /tmp/B.bNSdI9/BUILD/lttng-modules-2.12.5/lttng-modules-2.12.5/lttng-ring-buffer-metadata-client.ko INSTALL /tmp/B.bNSdI9/BUILD/lttng-modules-2.12.5/lttng-modules-2.12.5/lttng-statedump.ko INSTALL /tmp/B.bNSdI9/BUILD/lttng-modules-2.12.5/lttng-modules-2.12.5/lttng-wrapper.ko INSTALL /tmp/B.bNSdI9/BUILD/lttng-modules-2.12.5/lttng-modules-2.12.5/lttng-ring-buffer-client-mmap-discard.ko INSTALL /tmp/B.bNSdI9/BUILD/lttng-modules-2.12.5/lttng-modules-2.12.5/probes/lttng-kprobes.ko INSTALL /tmp/B.bNSdI9/BUILD/lttng-modules-2.12.5/lttng-modules-2.12.5/probes/lttng-kretprobes.ko INSTALL /tmp/B.bNSdI9/BUILD/lttng-modules-2.12.5/lttng-modules-2.12.5/probes/lttng-probe-9p.ko INSTALL /tmp/B.bNSdI9/BUILD/lttng-modules-2.12.5/lttng-modules-2.12.5/probes/lttng-probe-asoc.ko INSTALL /tmp/B.bNSdI9/BUILD/lttng-modules-2.12.5/lttng-modules-2.12.5/probes/lttng-probe-compaction.ko INSTALL /tmp/B.bNSdI9/BUILD/lttng-modules-2.12.5/lttng-modules-2.12.5/probes/lttng-probe-gpio.ko INSTALL /tmp/B.bNSdI9/BUILD/lttng-modules-2.12.5/lttng-modules-2.12.5/lib/lttng-lib-ring-buffer.ko INSTALL /tmp/B.bNSdI9/BUILD/lttng-modules-2.12.5/lttng-modules-2.12.5/probes/lttng-probe-block.ko INSTALL /tmp/B.bNSdI9/BUILD/lttng-modules-2.12.5/lttng-modules-2.12.5/probes/lttng-probe-i2c.ko INSTALL /tmp/B.bNSdI9/BUILD/lttng-modules-2.12.5/lttng-modules-2.12.5/probes/lttng-probe-irq.ko INSTALL /tmp/B.bNSdI9/BUILD/lttng-modules-2.12.5/lttng-modules-2.12.5/probes/lttng-probe-btrfs.ko INSTALL /tmp/B.bNSdI9/BUILD/lttng-modules-2.12.5/lttng-modules-2.12.5/probes/lttng-probe-kmem.ko INSTALL /tmp/B.bNSdI9/BUILD/lttng-modules-2.12.5/lttng-modules-2.12.5/probes/lttng-probe-napi.ko INSTALL /tmp/B.bNSdI9/BUILD/lttng-modules-2.12.5/lttng-modules-2.12.5/probes/lttng-probe-kvm-x86-mmu.ko INSTALL /tmp/B.bNSdI9/BUILD/lttng-modules-2.12.5/lttng-modules-2.12.5/probes/lttng-probe-jbd2.ko INSTALL /tmp/B.bNSdI9/BUILD/lttng-modules-2.12.5/lttng-modules-2.12.5/probes/lttng-probe-module.ko INSTALL /tmp/B.bNSdI9/BUILD/lttng-modules-2.12.5/lttng-modules-2.12.5/probes/lttng-probe-net.ko INSTALL /tmp/B.bNSdI9/BUILD/lttng-modules-2.12.5/lttng-modules-2.12.5/probes/lttng-probe-kvm.ko INSTALL /tmp/B.bNSdI9/BUILD/lttng-modules-2.12.5/lttng-modules-2.12.5/probes/lttng-probe-printk.ko INSTALL /tmp/B.bNSdI9/BUILD/lttng-modules-2.12.5/lttng-modules-2.12.5/probes/lttng-probe-rcu.ko INSTALL /tmp/B.bNSdI9/BUILD/lttng-modules-2.12.5/lttng-modules-2.12.5/probes/lttng-probe-power.ko INSTALL /tmp/B.bNSdI9/BUILD/lttng-modules-2.12.5/lttng-modules-2.12.5/probes/lttng-probe-random.ko INSTALL /tmp/B.bNSdI9/BUILD/lttng-modules-2.12.5/lttng-modules-2.12.5/probes/lttng-probe-regulator.ko INSTALL /tmp/B.bNSdI9/BUILD/lttng-modules-2.12.5/lttng-modules-2.12.5/probes/lttng-probe-scsi.ko INSTALL /tmp/B.bNSdI9/BUILD/lttng-modules-2.12.5/lttng-modules-2.12.5/probes/lttng-probe-signal.ko INSTALL /tmp/B.bNSdI9/BUILD/lttng-modules-2.12.5/lttng-modules-2.12.5/probes/lttng-probe-regmap.ko INSTALL /tmp/B.bNSdI9/BUILD/lttng-modules-2.12.5/lttng-modules-2.12.5/probes/lttng-probe-skb.ko INSTALL /tmp/B.bNSdI9/BUILD/lttng-modules-2.12.5/lttng-modules-2.12.5/probes/lttng-probe-sched.ko INSTALL /tmp/B.bNSdI9/BUILD/lttng-modules-2.12.5/lttng-modules-2.12.5/probes/lttng-probe-sock.ko INSTALL /tmp/B.bNSdI9/BUILD/lttng-modules-2.12.5/lttng-modules-2.12.5/probes/lttng-probe-v4l2.ko INSTALL /tmp/B.bNSdI9/BUILD/lttng-modules-2.12.5/lttng-modules-2.12.5/probes/lttng-probe-kvm-x86.ko INSTALL /tmp/B.bNSdI9/BUILD/lttng-modules-2.12.5/lttng-modules-2.12.5/probes/lttng-probe-sunrpc.ko INSTALL /tmp/B.bNSdI9/BUILD/lttng-modules-2.12.5/lttng-modules-2.12.5/probes/lttng-probe-udp.ko INSTALL /tmp/B.bNSdI9/BUILD/lttng-modules-2.12.5/lttng-modules-2.12.5/probes/lttng-probe-timer.ko INSTALL /tmp/B.bNSdI9/BUILD/lttng-modules-2.12.5/lttng-modules-2.12.5/probes/lttng-probe-workqueue.ko INSTALL /tmp/B.bNSdI9/BUILD/lttng-modules-2.12.5/lttng-modules-2.12.5/probes/lttng-probe-vmscan.ko INSTALL /tmp/B.bNSdI9/BUILD/lttng-modules-2.12.5/lttng-modules-2.12.5/probes/lttng-probe-x86-exceptions.ko INSTALL /tmp/B.bNSdI9/BUILD/lttng-modules-2.12.5/lttng-modules-2.12.5/probes/lttng-probe-x86-irq-vectors.ko INSTALL /tmp/B.bNSdI9/BUILD/lttng-modules-2.12.5/lttng-modules-2.12.5/tests/lttng-clock-plugin-test.ko INSTALL /tmp/B.bNSdI9/BUILD/lttng-modules-2.12.5/lttng-modules-2.12.5/probes/lttng-probe-statedump.ko INSTALL /tmp/B.bNSdI9/BUILD/lttng-modules-2.12.5/lttng-modules-2.12.5/probes/lttng-uprobes.ko INSTALL /tmp/B.bNSdI9/BUILD/lttng-modules-2.12.5/lttng-modules-2.12.5/probes/lttng-probe-ext4.ko INSTALL /tmp/B.bNSdI9/BUILD/lttng-modules-2.12.5/lttng-modules-2.12.5/tests/lttng-test.ko INSTALL /tmp/B.bNSdI9/BUILD/lttng-modules-2.12.5/lttng-modules-2.12.5/probes/lttng-probe-writeback.ko INSTALL /tmp/B.bNSdI9/BUILD/lttng-modules-2.12.5/lttng-modules-2.12.5/lttng-tracer.ko make[1]: Entering directory '/usr/src/linux-4.9-4.9.268' DEPMOD 4.9.268-1 make[1]: Leaving directory '/usr/src/linux-4.9-4.9.268' + /usr/bin/make -Otarget -j9 clean 'KERNELDIR=/usr/src/linux-4.19' /usr/bin/make -C /usr/src/linux-4.19 M=/tmp/B.bNSdI9/BUILD/lttng-modules-2.12.5/lttng-modules-2.12.5 clean make[1]: Entering directory '/usr/src/linux-4.19-4.19.189' CLEAN /tmp/B.bNSdI9/BUILD/lttng-modules-2.12.5/lttng-modules-2.12.5/.tmp_versions CLEAN /tmp/B.bNSdI9/BUILD/lttng-modules-2.12.5/lttng-modules-2.12.5/Module.symvers make[1]: Leaving directory '/usr/src/linux-4.19-4.19.189' + /usr/bin/make -Otarget -j9 'KERNELDIR=/usr/src/linux-4.19' /usr/bin/make -C /usr/src/linux-4.19 M=/tmp/B.bNSdI9/BUILD/lttng-modules-2.12.5/lttng-modules-2.12.5 CONFIG_LTTNG=m CONFIG_LTTNG_CLOCK_PLUGIN_TEST=m modules CC [M] /tmp/B.bNSdI9/BUILD/lttng-modules-2.12.5/lttng-modules-2.12.5/lttng-ring-buffer-metadata-client.o CC [M] /tmp/B.bNSdI9/BUILD/lttng-modules-2.12.5/lttng-modules-2.12.5/lttng-ring-buffer-metadata-mmap-client.o CC [M] /tmp/B.bNSdI9/BUILD/lttng-modules-2.12.5/lttng-modules-2.12.5/tests/probes/lttng-test.o CC [M] /tmp/B.bNSdI9/BUILD/lttng-modules-2.12.5/lttng-modules-2.12.5/lttng-ring-buffer-client-mmap-overwrite.o CC [M] /tmp/B.bNSdI9/BUILD/lttng-modules-2.12.5/lttng-modules-2.12.5/lttng-ring-buffer-client-overwrite.o CC [M] /tmp/B.bNSdI9/BUILD/lttng-modules-2.12.5/lttng-modules-2.12.5/lttng-ring-buffer-client-mmap-discard.o CC [M] /tmp/B.bNSdI9/BUILD/lttng-modules-2.12.5/lttng-modules-2.12.5/lttng-ring-buffer-client-discard.o CC [M] /tmp/B.bNSdI9/BUILD/lttng-modules-2.12.5/lttng-modules-2.12.5/tests/clock-plugin/lttng-clock-plugin-test.o LD [M] /tmp/B.bNSdI9/BUILD/lttng-modules-2.12.5/lttng-modules-2.12.5/tests/lttng-test.o LD [M] /tmp/B.bNSdI9/BUILD/lttng-modules-2.12.5/lttng-modules-2.12.5/tests/lttng-clock-plugin-test.o CC [M] /tmp/B.bNSdI9/BUILD/lttng-modules-2.12.5/lttng-modules-2.12.5/probes/lttng-probe-sched.o CC [M] /tmp/B.bNSdI9/BUILD/lttng-modules-2.12.5/lttng-modules-2.12.5/probes/lttng-probe-irq.o CC [M] /tmp/B.bNSdI9/BUILD/lttng-modules-2.12.5/lttng-modules-2.12.5/lib/ringbuffer/ring_buffer_backend.o CC [M] /tmp/B.bNSdI9/BUILD/lttng-modules-2.12.5/lttng-modules-2.12.5/lttng-string-utils.o CC [M] /tmp/B.bNSdI9/BUILD/lttng-modules-2.12.5/lttng-modules-2.12.5/lttng-clock.o CC [M] /tmp/B.bNSdI9/BUILD/lttng-modules-2.12.5/lttng-modules-2.12.5/lttng-abi.o CC [M] /tmp/B.bNSdI9/BUILD/lttng-modules-2.12.5/lttng-modules-2.12.5/lib/ringbuffer/ring_buffer_iterator.o CC [M] /tmp/B.bNSdI9/BUILD/lttng-modules-2.12.5/lttng-modules-2.12.5/lib/ringbuffer/ring_buffer_frontend.o CC [M] /tmp/B.bNSdI9/BUILD/lttng-modules-2.12.5/lttng-modules-2.12.5/lttng-probes.o CC [M] /tmp/B.bNSdI9/BUILD/lttng-modules-2.12.5/lttng-modules-2.12.5/probes/lttng-probe-module.o CC [M] /tmp/B.bNSdI9/BUILD/lttng-modules-2.12.5/lttng-modules-2.12.5/probes/lttng-probe-timer.o CC [M] /tmp/B.bNSdI9/BUILD/lttng-modules-2.12.5/lttng-modules-2.12.5/lib/ringbuffer/ring_buffer_vfs.o CC [M] /tmp/B.bNSdI9/BUILD/lttng-modules-2.12.5/lttng-modules-2.12.5/probes/lttng-probe-kmem.o CC [M] /tmp/B.bNSdI9/BUILD/lttng-modules-2.12.5/lttng-modules-2.12.5/lttng-events.o CC [M] /tmp/B.bNSdI9/BUILD/lttng-modules-2.12.5/lttng-modules-2.12.5/probes/lttng-probe-power.o CC [M] /tmp/B.bNSdI9/BUILD/lttng-modules-2.12.5/lttng-modules-2.12.5/lttng-context.o CC [M] /tmp/B.bNSdI9/BUILD/lttng-modules-2.12.5/lttng-modules-2.12.5/lib/ringbuffer/ring_buffer_splice.o CC [M] /tmp/B.bNSdI9/BUILD/lttng-modules-2.12.5/lttng-modules-2.12.5/lttng-context-pid.o CC [M] /tmp/B.bNSdI9/BUILD/lttng-modules-2.12.5/lttng-modules-2.12.5/probes/lttng-probe-9p.o CC [M] /tmp/B.bNSdI9/BUILD/lttng-modules-2.12.5/lttng-modules-2.12.5/lttng-context-procname.o CC [M] /tmp/B.bNSdI9/BUILD/lttng-modules-2.12.5/lttng-modules-2.12.5/lttng-context-prio.o CC [M] /tmp/B.bNSdI9/BUILD/lttng-modules-2.12.5/lttng-modules-2.12.5/lttng-context-nice.o CC [M] /tmp/B.bNSdI9/BUILD/lttng-modules-2.12.5/lttng-modules-2.12.5/lib/../wrapper/splice.o CC [M] /tmp/B.bNSdI9/BUILD/lttng-modules-2.12.5/lttng-modules-2.12.5/probes/lttng-probe-i2c.o CC [M] /tmp/B.bNSdI9/BUILD/lttng-modules-2.12.5/lttng-modules-2.12.5/lib/prio_heap/lttng_prio_heap.o CC [M] /tmp/B.bNSdI9/BUILD/lttng-modules-2.12.5/lttng-modules-2.12.5/lib/ringbuffer/ring_buffer_mmap.o LD [M] /tmp/B.bNSdI9/BUILD/lttng-modules-2.12.5/lttng-modules-2.12.5/lib/lttng-lib-ring-buffer.o CC [M] /tmp/B.bNSdI9/BUILD/lttng-modules-2.12.5/lttng-modules-2.12.5/probes/lttng-probe-statedump.o CC [M] /tmp/B.bNSdI9/BUILD/lttng-modules-2.12.5/lttng-modules-2.12.5/probes/lttng-probe-kvm.o CC [M] /tmp/B.bNSdI9/BUILD/lttng-modules-2.12.5/lttng-modules-2.12.5/lttng-context-vpid.o CC [M] /tmp/B.bNSdI9/BUILD/lttng-modules-2.12.5/lttng-modules-2.12.5/probes/lttng-probe-x86-irq-vectors.o CC [M] /tmp/B.bNSdI9/BUILD/lttng-modules-2.12.5/lttng-modules-2.12.5/lttng-context-tid.o CC [M] /tmp/B.bNSdI9/BUILD/lttng-modules-2.12.5/lttng-modules-2.12.5/probes/lttng-probe-x86-exceptions.o CC [M] /tmp/B.bNSdI9/BUILD/lttng-modules-2.12.5/lttng-modules-2.12.5/probes/lttng-probe-kvm-x86-mmu.o CC [M] /tmp/B.bNSdI9/BUILD/lttng-modules-2.12.5/lttng-modules-2.12.5/lttng-context-vtid.o CC [M] /tmp/B.bNSdI9/BUILD/lttng-modules-2.12.5/lttng-modules-2.12.5/lttng-context-ppid.o CC [M] /tmp/B.bNSdI9/BUILD/lttng-modules-2.12.5/lttng-modules-2.12.5/probes/lttng-probe-signal.o CC [M] /tmp/B.bNSdI9/BUILD/lttng-modules-2.12.5/lttng-modules-2.12.5/lttng-context-cpu-id.o CC [M] /tmp/B.bNSdI9/BUILD/lttng-modules-2.12.5/lttng-modules-2.12.5/lttng-context-vppid.o CC [M] /tmp/B.bNSdI9/BUILD/lttng-modules-2.12.5/lttng-modules-2.12.5/lttng-context-uid.o CC [M] /tmp/B.bNSdI9/BUILD/lttng-modules-2.12.5/lttng-modules-2.12.5/probes/lttng-probe-napi.o CC [M] /tmp/B.bNSdI9/BUILD/lttng-modules-2.12.5/lttng-modules-2.12.5/probes/lttng-probe-kvm-x86.o CC [M] /tmp/B.bNSdI9/BUILD/lttng-modules-2.12.5/lttng-modules-2.12.5/lttng-context-euid.o CC [M] /tmp/B.bNSdI9/BUILD/lttng-modules-2.12.5/lttng-modules-2.12.5/lttng-context-suid.o CC [M] /tmp/B.bNSdI9/BUILD/lttng-modules-2.12.5/lttng-modules-2.12.5/lttng-context-gid.o CC [M] /tmp/B.bNSdI9/BUILD/lttng-modules-2.12.5/lttng-modules-2.12.5/lttng-context-egid.o CC [M] /tmp/B.bNSdI9/BUILD/lttng-modules-2.12.5/lttng-modules-2.12.5/probes/lttng-probe-skb.o CC [M] /tmp/B.bNSdI9/BUILD/lttng-modules-2.12.5/lttng-modules-2.12.5/lttng-context-sgid.o CC [M] /tmp/B.bNSdI9/BUILD/lttng-modules-2.12.5/lttng-modules-2.12.5/probes/lttng-probe-block.o CC [M] /tmp/B.bNSdI9/BUILD/lttng-modules-2.12.5/lttng-modules-2.12.5/lttng-context-vuid.o CC [M] /tmp/B.bNSdI9/BUILD/lttng-modules-2.12.5/lttng-modules-2.12.5/lttng-context-vsuid.o CC [M] /tmp/B.bNSdI9/BUILD/lttng-modules-2.12.5/lttng-modules-2.12.5/probes/lttng-probe-net.o CC [M] /tmp/B.bNSdI9/BUILD/lttng-modules-2.12.5/lttng-modules-2.12.5/lttng-context-veuid.o CC [M] /tmp/B.bNSdI9/BUILD/lttng-modules-2.12.5/lttng-modules-2.12.5/probes/lttng-probe-sock.o CC [M] /tmp/B.bNSdI9/BUILD/lttng-modules-2.12.5/lttng-modules-2.12.5/probes/lttng-probe-udp.o CC [M] /tmp/B.bNSdI9/BUILD/lttng-modules-2.12.5/lttng-modules-2.12.5/probes/lttng-probe-gpio.o CC [M] /tmp/B.bNSdI9/BUILD/lttng-modules-2.12.5/lttng-modules-2.12.5/lttng-context-vgid.o CC [M] /tmp/B.bNSdI9/BUILD/lttng-modules-2.12.5/lttng-modules-2.12.5/lttng-context-vegid.o CC [M] /tmp/B.bNSdI9/BUILD/lttng-modules-2.12.5/lttng-modules-2.12.5/probes/lttng-probe-asoc.o CC [M] /tmp/B.bNSdI9/BUILD/lttng-modules-2.12.5/lttng-modules-2.12.5/lttng-context-vsgid.o CC [M] /tmp/B.bNSdI9/BUILD/lttng-modules-2.12.5/lttng-modules-2.12.5/lttng-context-interruptible.o CC [M] /tmp/B.bNSdI9/BUILD/lttng-modules-2.12.5/lttng-modules-2.12.5/probes/lttng-probe-regulator.o CC [M] /tmp/B.bNSdI9/BUILD/lttng-modules-2.12.5/lttng-modules-2.12.5/lttng-context-need-reschedule.o CC [M] /tmp/B.bNSdI9/BUILD/lttng-modules-2.12.5/lttng-modules-2.12.5/probes/lttng-probe-jbd2.o CC [M] /tmp/B.bNSdI9/BUILD/lttng-modules-2.12.5/lttng-modules-2.12.5/lttng-context-callstack.o CC [M] /tmp/B.bNSdI9/BUILD/lttng-modules-2.12.5/lttng-modules-2.12.5/probes/lttng-probe-scsi.o CC [M] /tmp/B.bNSdI9/BUILD/lttng-modules-2.12.5/lttng-modules-2.12.5/lttng-calibrate.o CC [M] /tmp/B.bNSdI9/BUILD/lttng-modules-2.12.5/lttng-modules-2.12.5/probes/lttng-probe-compaction.o CC [M] /tmp/B.bNSdI9/BUILD/lttng-modules-2.12.5/lttng-modules-2.12.5/probes/lttng.o CC [M] /tmp/B.bNSdI9/BUILD/lttng-modules-2.12.5/lttng-modules-2.12.5/lttng-context-hostname.o CC [M] /tmp/B.bNSdI9/BUILD/lttng-modules-2.12.5/lttng-modules-2.12.5/lttng-filter.o CC [M] /tmp/B.bNSdI9/BUILD/lttng-modules-2.12.5/lttng-modules-2.12.5/probes/lttng-probe-vmscan.o CC [M] /tmp/B.bNSdI9/BUILD/lttng-modules-2.12.5/lttng-modules-2.12.5/lttng-tracker-id.o CC [M] /tmp/B.bNSdI9/BUILD/lttng-modules-2.12.5/lttng-modules-2.12.5/lttng-filter-specialize.o CC [M] /tmp/B.bNSdI9/BUILD/lttng-modules-2.12.5/lttng-modules-2.12.5/lttng-tp-mempool.o CC [M] /tmp/B.bNSdI9/BUILD/lttng-modules-2.12.5/lttng-modules-2.12.5/probes/lttng-probe-user.o CC [M] /tmp/B.bNSdI9/BUILD/lttng-modules-2.12.5/lttng-modules-2.12.5/lttng-filter-interpreter.o CC [M] /tmp/B.bNSdI9/BUILD/lttng-modules-2.12.5/lttng-modules-2.12.5/lttng-filter-validator.o CC [M] /tmp/B.bNSdI9/BUILD/lttng-modules-2.12.5/lttng-modules-2.12.5/lttng-tracepoint.o CC [M] /tmp/B.bNSdI9/BUILD/lttng-modules-2.12.5/lttng-modules-2.12.5/probes/lttng-probe-printk.o CC [M] /tmp/B.bNSdI9/BUILD/lttng-modules-2.12.5/lttng-modules-2.12.5/lttng-context-perf-counters.o CC [M] /tmp/B.bNSdI9/BUILD/lttng-modules-2.12.5/lttng-modules-2.12.5/lttng-context-cgroup-ns.o CC [M] /tmp/B.bNSdI9/BUILD/lttng-modules-2.12.5/lttng-modules-2.12.5/lttng-context-ipc-ns.o CC [M] /tmp/B.bNSdI9/BUILD/lttng-modules-2.12.5/lttng-modules-2.12.5/probes/lttng-probe-btrfs.o CC [M] /tmp/B.bNSdI9/BUILD/lttng-modules-2.12.5/lttng-modules-2.12.5/probes/lttng-probe-rcu.o CC [M] /tmp/B.bNSdI9/BUILD/lttng-modules-2.12.5/lttng-modules-2.12.5/lttng-context-mnt-ns.o CC [M] /tmp/B.bNSdI9/BUILD/lttng-modules-2.12.5/lttng-modules-2.12.5/probes/lttng-probe-random.o CC [M] /tmp/B.bNSdI9/BUILD/lttng-modules-2.12.5/lttng-modules-2.12.5/lttng-context-net-ns.o CC [M] /tmp/B.bNSdI9/BUILD/lttng-modules-2.12.5/lttng-modules-2.12.5/probes/lttng-probe-regmap.o CC [M] /tmp/B.bNSdI9/BUILD/lttng-modules-2.12.5/lttng-modules-2.12.5/lttng-context-pid-ns.o CC [M] /tmp/B.bNSdI9/BUILD/lttng-modules-2.12.5/lttng-modules-2.12.5/lttng-context-user-ns.o CC [M] /tmp/B.bNSdI9/BUILD/lttng-modules-2.12.5/lttng-modules-2.12.5/lttng-context-uts-ns.o CC [M] /tmp/B.bNSdI9/BUILD/lttng-modules-2.12.5/lttng-modules-2.12.5/probes/lttng-probe-v4l2.o CC [M] /tmp/B.bNSdI9/BUILD/lttng-modules-2.12.5/lttng-modules-2.12.5/wrapper/page_alloc.o CC [M] /tmp/B.bNSdI9/BUILD/lttng-modules-2.12.5/lttng-modules-2.12.5/probes/lttng-probe-sunrpc.o CC [M] /tmp/B.bNSdI9/BUILD/lttng-modules-2.12.5/lttng-modules-2.12.5/wrapper/trace-clock.o CC [M] /tmp/B.bNSdI9/BUILD/lttng-modules-2.12.5/lttng-modules-2.12.5/wrapper/kallsyms.o CC [M] /tmp/B.bNSdI9/BUILD/lttng-modules-2.12.5/lttng-modules-2.12.5/wrapper/random.o CC [M] /tmp/B.bNSdI9/BUILD/lttng-modules-2.12.5/lttng-modules-2.12.5/probes/lttng-probe-workqueue.o CC [M] /tmp/B.bNSdI9/BUILD/lttng-modules-2.12.5/lttng-modules-2.12.5/wrapper/irqdesc.o CC [M] /tmp/B.bNSdI9/BUILD/lttng-modules-2.12.5/lttng-modules-2.12.5/wrapper/fdtable.o CC [M] /tmp/B.bNSdI9/BUILD/lttng-modules-2.12.5/lttng-modules-2.12.5/lttng-wrapper-impl.o LD [M] /tmp/B.bNSdI9/BUILD/lttng-modules-2.12.5/lttng-modules-2.12.5/lttng-wrapper.o CC [M] /tmp/B.bNSdI9/BUILD/lttng-modules-2.12.5/lttng-modules-2.12.5/probes/lttng-kprobes.o CC [M] /tmp/B.bNSdI9/BUILD/lttng-modules-2.12.5/lttng-modules-2.12.5/probes/lttng-kretprobes.o CC [M] /tmp/B.bNSdI9/BUILD/lttng-modules-2.12.5/lttng-modules-2.12.5/probes/lttng-uprobes.o CC [M] /tmp/B.bNSdI9/BUILD/lttng-modules-2.12.5/lttng-modules-2.12.5/lttng-statedump-impl.o LD [M] /tmp/B.bNSdI9/BUILD/lttng-modules-2.12.5/lttng-modules-2.12.5/lttng-statedump.o CC [M] /tmp/B.bNSdI9/BUILD/lttng-modules-2.12.5/lttng-modules-2.12.5/probes/lttng-probe-writeback.o In file included from /tmp/B.bNSdI9/BUILD/lttng-modules-2.12.5/lttng-modules-2.12.5/probes/lttng-probe-writeback.c:38: /tmp/B.bNSdI9/BUILD/lttng-modules-2.12.5/lttng-modules-2.12.5/probes/../instrumentation/events/lttng-module/writeback.h:83: warning: "show_inode_state" redefined 83 | #define show_inode_state(state) \ | In file included from /tmp/B.bNSdI9/BUILD/lttng-modules-2.12.5/lttng-modules-2.12.5/probes/lttng-probe-writeback.c:20: ./include/trace/events/writeback.h:12: note: this is the location of the previous definition 12 | #define show_inode_state(state) \ | CC [M] /tmp/B.bNSdI9/BUILD/lttng-modules-2.12.5/lttng-modules-2.12.5/probes/lttng-probe-ext4.o CC [M] /tmp/B.bNSdI9/BUILD/lttng-modules-2.12.5/lttng-modules-2.12.5/lttng-syscalls.o LD [M] /tmp/B.bNSdI9/BUILD/lttng-modules-2.12.5/lttng-modules-2.12.5/lttng-tracer.o make[1]: Entering directory '/usr/src/linux-4.19-4.19.189' Building modules, stage 2. make[1]: Leaving directory '/usr/src/linux-4.19-4.19.189' MODPOST 54 modules CC /tmp/B.bNSdI9/BUILD/lttng-modules-2.12.5/lttng-modules-2.12.5/lttng-ring-buffer-client-mmap-overwrite.mod.o CC /tmp/B.bNSdI9/BUILD/lttng-modules-2.12.5/lttng-modules-2.12.5/lttng-clock.mod.o CC /tmp/B.bNSdI9/BUILD/lttng-modules-2.12.5/lttng-modules-2.12.5/lttng-ring-buffer-client-discard.mod.o CC /tmp/B.bNSdI9/BUILD/lttng-modules-2.12.5/lttng-modules-2.12.5/lttng-ring-buffer-client-mmap-discard.mod.o CC /tmp/B.bNSdI9/BUILD/lttng-modules-2.12.5/lttng-modules-2.12.5/lttng-ring-buffer-metadata-client.mod.o CC /tmp/B.bNSdI9/BUILD/lttng-modules-2.12.5/lttng-modules-2.12.5/lttng-statedump.mod.o CC /tmp/B.bNSdI9/BUILD/lttng-modules-2.12.5/lttng-modules-2.12.5/lttng-ring-buffer-metadata-mmap-client.mod.o CC /tmp/B.bNSdI9/BUILD/lttng-modules-2.12.5/lttng-modules-2.12.5/lib/lttng-lib-ring-buffer.mod.o CC /tmp/B.bNSdI9/BUILD/lttng-modules-2.12.5/lttng-modules-2.12.5/lttng-ring-buffer-client-overwrite.mod.o CC /tmp/B.bNSdI9/BUILD/lttng-modules-2.12.5/lttng-modules-2.12.5/lttng-wrapper.mod.o CC /tmp/B.bNSdI9/BUILD/lttng-modules-2.12.5/lttng-modules-2.12.5/probes/lttng-kretprobes.mod.o CC /tmp/B.bNSdI9/BUILD/lttng-modules-2.12.5/lttng-modules-2.12.5/probes/lttng-kprobes.mod.o CC /tmp/B.bNSdI9/BUILD/lttng-modules-2.12.5/lttng-modules-2.12.5/probes/lttng-probe-9p.mod.o CC /tmp/B.bNSdI9/BUILD/lttng-modules-2.12.5/lttng-modules-2.12.5/probes/lttng-probe-asoc.mod.o CC /tmp/B.bNSdI9/BUILD/lttng-modules-2.12.5/lttng-modules-2.12.5/probes/lttng-probe-block.mod.o CC /tmp/B.bNSdI9/BUILD/lttng-modules-2.12.5/lttng-modules-2.12.5/lttng-tracer.mod.o CC /tmp/B.bNSdI9/BUILD/lttng-modules-2.12.5/lttng-modules-2.12.5/probes/lttng-probe-compaction.mod.o CC /tmp/B.bNSdI9/BUILD/lttng-modules-2.12.5/lttng-modules-2.12.5/probes/lttng-probe-btrfs.mod.o CC /tmp/B.bNSdI9/BUILD/lttng-modules-2.12.5/lttng-modules-2.12.5/probes/lttng-probe-i2c.mod.o CC /tmp/B.bNSdI9/BUILD/lttng-modules-2.12.5/lttng-modules-2.12.5/probes/lttng-probe-ext4.mod.o CC /tmp/B.bNSdI9/BUILD/lttng-modules-2.12.5/lttng-modules-2.12.5/probes/lttng-probe-gpio.mod.o CC /tmp/B.bNSdI9/BUILD/lttng-modules-2.12.5/lttng-modules-2.12.5/probes/lttng-probe-irq.mod.o CC /tmp/B.bNSdI9/BUILD/lttng-modules-2.12.5/lttng-modules-2.12.5/probes/lttng-probe-jbd2.mod.o CC /tmp/B.bNSdI9/BUILD/lttng-modules-2.12.5/lttng-modules-2.12.5/probes/lttng-probe-kmem.mod.o CC /tmp/B.bNSdI9/BUILD/lttng-modules-2.12.5/lttng-modules-2.12.5/probes/lttng-probe-kvm-x86-mmu.mod.o CC /tmp/B.bNSdI9/BUILD/lttng-modules-2.12.5/lttng-modules-2.12.5/probes/lttng-probe-kvm.mod.o CC /tmp/B.bNSdI9/BUILD/lttng-modules-2.12.5/lttng-modules-2.12.5/probes/lttng-probe-kvm-x86.mod.o CC /tmp/B.bNSdI9/BUILD/lttng-modules-2.12.5/lttng-modules-2.12.5/probes/lttng-probe-power.mod.o CC /tmp/B.bNSdI9/BUILD/lttng-modules-2.12.5/lttng-modules-2.12.5/probes/lttng-probe-napi.mod.o CC /tmp/B.bNSdI9/BUILD/lttng-modules-2.12.5/lttng-modules-2.12.5/probes/lttng-probe-printk.mod.o CC /tmp/B.bNSdI9/BUILD/lttng-modules-2.12.5/lttng-modules-2.12.5/probes/lttng-probe-module.mod.o CC /tmp/B.bNSdI9/BUILD/lttng-modules-2.12.5/lttng-modules-2.12.5/probes/lttng-probe-net.mod.o CC /tmp/B.bNSdI9/BUILD/lttng-modules-2.12.5/lttng-modules-2.12.5/probes/lttng-probe-random.mod.o CC /tmp/B.bNSdI9/BUILD/lttng-modules-2.12.5/lttng-modules-2.12.5/probes/lttng-probe-rcu.mod.o CC /tmp/B.bNSdI9/BUILD/lttng-modules-2.12.5/lttng-modules-2.12.5/probes/lttng-probe-regmap.mod.o CC /tmp/B.bNSdI9/BUILD/lttng-modules-2.12.5/lttng-modules-2.12.5/probes/lttng-probe-sched.mod.o CC /tmp/B.bNSdI9/BUILD/lttng-modules-2.12.5/lttng-modules-2.12.5/probes/lttng-probe-regulator.mod.o CC /tmp/B.bNSdI9/BUILD/lttng-modules-2.12.5/lttng-modules-2.12.5/probes/lttng-probe-signal.mod.o CC /tmp/B.bNSdI9/BUILD/lttng-modules-2.12.5/lttng-modules-2.12.5/probes/lttng-probe-scsi.mod.o CC /tmp/B.bNSdI9/BUILD/lttng-modules-2.12.5/lttng-modules-2.12.5/probes/lttng-probe-skb.mod.o CC /tmp/B.bNSdI9/BUILD/lttng-modules-2.12.5/lttng-modules-2.12.5/probes/lttng-probe-sock.mod.o CC /tmp/B.bNSdI9/BUILD/lttng-modules-2.12.5/lttng-modules-2.12.5/probes/lttng-probe-statedump.mod.o CC /tmp/B.bNSdI9/BUILD/lttng-modules-2.12.5/lttng-modules-2.12.5/probes/lttng-probe-timer.mod.o CC /tmp/B.bNSdI9/BUILD/lttng-modules-2.12.5/lttng-modules-2.12.5/probes/lttng-probe-sunrpc.mod.o CC /tmp/B.bNSdI9/BUILD/lttng-modules-2.12.5/lttng-modules-2.12.5/probes/lttng-probe-udp.mod.o CC /tmp/B.bNSdI9/BUILD/lttng-modules-2.12.5/lttng-modules-2.12.5/probes/lttng-probe-workqueue.mod.o LD [M] /tmp/B.bNSdI9/BUILD/lttng-modules-2.12.5/lttng-modules-2.12.5/lib/lttng-lib-ring-buffer.ko CC /tmp/B.bNSdI9/BUILD/lttng-modules-2.12.5/lttng-modules-2.12.5/probes/lttng-probe-v4l2.mod.o LD [M] /tmp/B.bNSdI9/BUILD/lttng-modules-2.12.5/lttng-modules-2.12.5/lttng-clock.ko CC /tmp/B.bNSdI9/BUILD/lttng-modules-2.12.5/lttng-modules-2.12.5/probes/lttng-probe-vmscan.mod.o CC /tmp/B.bNSdI9/BUILD/lttng-modules-2.12.5/lttng-modules-2.12.5/probes/lttng-probe-writeback.mod.o LD [M] /tmp/B.bNSdI9/BUILD/lttng-modules-2.12.5/lttng-modules-2.12.5/lttng-ring-buffer-client-discard.ko LD [M] /tmp/B.bNSdI9/BUILD/lttng-modules-2.12.5/lttng-modules-2.12.5/lttng-ring-buffer-client-mmap-overwrite.ko LD [M] /tmp/B.bNSdI9/BUILD/lttng-modules-2.12.5/lttng-modules-2.12.5/lttng-ring-buffer-client-mmap-discard.ko LD [M] /tmp/B.bNSdI9/BUILD/lttng-modules-2.12.5/lttng-modules-2.12.5/lttng-ring-buffer-client-overwrite.ko LD [M] /tmp/B.bNSdI9/BUILD/lttng-modules-2.12.5/lttng-modules-2.12.5/lttng-ring-buffer-metadata-client.ko LD [M] /tmp/B.bNSdI9/BUILD/lttng-modules-2.12.5/lttng-modules-2.12.5/lttng-ring-buffer-metadata-mmap-client.ko LD [M] /tmp/B.bNSdI9/BUILD/lttng-modules-2.12.5/lttng-modules-2.12.5/lttng-statedump.ko LD [M] /tmp/B.bNSdI9/BUILD/lttng-modules-2.12.5/lttng-modules-2.12.5/lttng-tracer.ko LD [M] /tmp/B.bNSdI9/BUILD/lttng-modules-2.12.5/lttng-modules-2.12.5/lttng-wrapper.ko LD [M] /tmp/B.bNSdI9/BUILD/lttng-modules-2.12.5/lttng-modules-2.12.5/probes/lttng-kprobes.ko LD [M] /tmp/B.bNSdI9/BUILD/lttng-modules-2.12.5/lttng-modules-2.12.5/probes/lttng-kretprobes.ko LD [M] /tmp/B.bNSdI9/BUILD/lttng-modules-2.12.5/lttng-modules-2.12.5/probes/lttng-probe-9p.ko LD [M] /tmp/B.bNSdI9/BUILD/lttng-modules-2.12.5/lttng-modules-2.12.5/probes/lttng-probe-asoc.ko LD [M] /tmp/B.bNSdI9/BUILD/lttng-modules-2.12.5/lttng-modules-2.12.5/probes/lttng-probe-block.ko LD [M] /tmp/B.bNSdI9/BUILD/lttng-modules-2.12.5/lttng-modules-2.12.5/probes/lttng-probe-btrfs.ko LD [M] /tmp/B.bNSdI9/BUILD/lttng-modules-2.12.5/lttng-modules-2.12.5/probes/lttng-probe-compaction.ko LD [M] /tmp/B.bNSdI9/BUILD/lttng-modules-2.12.5/lttng-modules-2.12.5/probes/lttng-probe-ext4.ko LD [M] /tmp/B.bNSdI9/BUILD/lttng-modules-2.12.5/lttng-modules-2.12.5/probes/lttng-probe-gpio.ko LD [M] /tmp/B.bNSdI9/BUILD/lttng-modules-2.12.5/lttng-modules-2.12.5/probes/lttng-probe-i2c.ko CC /tmp/B.bNSdI9/BUILD/lttng-modules-2.12.5/lttng-modules-2.12.5/probes/lttng-probe-x86-exceptions.mod.o LD [M] /tmp/B.bNSdI9/BUILD/lttng-modules-2.12.5/lttng-modules-2.12.5/probes/lttng-probe-irq.ko LD [M] /tmp/B.bNSdI9/BUILD/lttng-modules-2.12.5/lttng-modules-2.12.5/probes/lttng-probe-jbd2.ko LD [M] /tmp/B.bNSdI9/BUILD/lttng-modules-2.12.5/lttng-modules-2.12.5/probes/lttng-probe-kmem.ko LD [M] /tmp/B.bNSdI9/BUILD/lttng-modules-2.12.5/lttng-modules-2.12.5/probes/lttng-probe-kvm-x86-mmu.ko LD [M] /tmp/B.bNSdI9/BUILD/lttng-modules-2.12.5/lttng-modules-2.12.5/probes/lttng-probe-kvm-x86.ko LD [M] /tmp/B.bNSdI9/BUILD/lttng-modules-2.12.5/lttng-modules-2.12.5/probes/lttng-probe-kvm.ko LD [M] /tmp/B.bNSdI9/BUILD/lttng-modules-2.12.5/lttng-modules-2.12.5/probes/lttng-probe-module.ko LD [M] /tmp/B.bNSdI9/BUILD/lttng-modules-2.12.5/lttng-modules-2.12.5/probes/lttng-probe-napi.ko LD [M] /tmp/B.bNSdI9/BUILD/lttng-modules-2.12.5/lttng-modules-2.12.5/probes/lttng-probe-net.ko LD [M] /tmp/B.bNSdI9/BUILD/lttng-modules-2.12.5/lttng-modules-2.12.5/probes/lttng-probe-power.ko LD [M] /tmp/B.bNSdI9/BUILD/lttng-modules-2.12.5/lttng-modules-2.12.5/probes/lttng-probe-printk.ko LD [M] /tmp/B.bNSdI9/BUILD/lttng-modules-2.12.5/lttng-modules-2.12.5/probes/lttng-probe-random.ko LD [M] /tmp/B.bNSdI9/BUILD/lttng-modules-2.12.5/lttng-modules-2.12.5/probes/lttng-probe-rcu.ko LD [M] /tmp/B.bNSdI9/BUILD/lttng-modules-2.12.5/lttng-modules-2.12.5/probes/lttng-probe-regmap.ko LD [M] /tmp/B.bNSdI9/BUILD/lttng-modules-2.12.5/lttng-modules-2.12.5/probes/lttng-probe-regulator.ko LD [M] /tmp/B.bNSdI9/BUILD/lttng-modules-2.12.5/lttng-modules-2.12.5/probes/lttng-probe-sched.ko LD [M] /tmp/B.bNSdI9/BUILD/lttng-modules-2.12.5/lttng-modules-2.12.5/probes/lttng-probe-scsi.ko LD [M] /tmp/B.bNSdI9/BUILD/lttng-modules-2.12.5/lttng-modules-2.12.5/probes/lttng-probe-signal.ko LD [M] /tmp/B.bNSdI9/BUILD/lttng-modules-2.12.5/lttng-modules-2.12.5/probes/lttng-probe-skb.ko LD [M] /tmp/B.bNSdI9/BUILD/lttng-modules-2.12.5/lttng-modules-2.12.5/probes/lttng-probe-statedump.ko LD [M] /tmp/B.bNSdI9/BUILD/lttng-modules-2.12.5/lttng-modules-2.12.5/probes/lttng-probe-sunrpc.ko LD [M] /tmp/B.bNSdI9/BUILD/lttng-modules-2.12.5/lttng-modules-2.12.5/probes/lttng-probe-sock.ko LD [M] /tmp/B.bNSdI9/BUILD/lttng-modules-2.12.5/lttng-modules-2.12.5/probes/lttng-probe-timer.ko CC /tmp/B.bNSdI9/BUILD/lttng-modules-2.12.5/lttng-modules-2.12.5/probes/lttng-probe-x86-irq-vectors.mod.o LD [M] /tmp/B.bNSdI9/BUILD/lttng-modules-2.12.5/lttng-modules-2.12.5/probes/lttng-probe-v4l2.ko LD [M] /tmp/B.bNSdI9/BUILD/lttng-modules-2.12.5/lttng-modules-2.12.5/probes/lttng-probe-vmscan.ko LD [M] /tmp/B.bNSdI9/BUILD/lttng-modules-2.12.5/lttng-modules-2.12.5/probes/lttng-probe-udp.ko LD [M] /tmp/B.bNSdI9/BUILD/lttng-modules-2.12.5/lttng-modules-2.12.5/probes/lttng-probe-workqueue.ko LD [M] /tmp/B.bNSdI9/BUILD/lttng-modules-2.12.5/lttng-modules-2.12.5/probes/lttng-probe-writeback.ko LD [M] /tmp/B.bNSdI9/BUILD/lttng-modules-2.12.5/lttng-modules-2.12.5/probes/lttng-probe-x86-exceptions.ko LD [M] /tmp/B.bNSdI9/BUILD/lttng-modules-2.12.5/lttng-modules-2.12.5/probes/lttng-probe-x86-irq-vectors.ko CC /tmp/B.bNSdI9/BUILD/lttng-modules-2.12.5/lttng-modules-2.12.5/tests/lttng-clock-plugin-test.mod.o LD [M] /tmp/B.bNSdI9/BUILD/lttng-modules-2.12.5/lttng-modules-2.12.5/tests/lttng-clock-plugin-test.ko CC /tmp/B.bNSdI9/BUILD/lttng-modules-2.12.5/lttng-modules-2.12.5/probes/lttng-uprobes.mod.o LD [M] /tmp/B.bNSdI9/BUILD/lttng-modules-2.12.5/lttng-modules-2.12.5/probes/lttng-uprobes.ko CC /tmp/B.bNSdI9/BUILD/lttng-modules-2.12.5/lttng-modules-2.12.5/tests/lttng-test.mod.o LD [M] /tmp/B.bNSdI9/BUILD/lttng-modules-2.12.5/lttng-modules-2.12.5/tests/lttng-test.ko + pwd + p=/tmp/B.bNSdI9/BUILD/lttng-modules-2.12.5/lttng-modules-2.12.5 + /usr/bin/make -Otarget -j9 modules_install 'INSTALL_MOD_PATH=/tmp/B.bNSdI9/BUILD/lttng-modules-2.12.5/lttng-modules-2.12.5/../installed' 'INSTALL_MOD_DIR=kernel/lttng' 'KERNELDIR=/usr/src/linux-4.19' /usr/bin/make -C /usr/src/linux-4.19 M=/tmp/B.bNSdI9/BUILD/lttng-modules-2.12.5/lttng-modules-2.12.5 CONFIG_LTTNG=m CONFIG_LTTNG_CLOCK_PLUGIN_TEST=m modules_install INSTALL /tmp/B.bNSdI9/BUILD/lttng-modules-2.12.5/lttng-modules-2.12.5/lttng-ring-buffer-metadata-client.ko INSTALL /tmp/B.bNSdI9/BUILD/lttng-modules-2.12.5/lttng-modules-2.12.5/lttng-clock.ko INSTALL /tmp/B.bNSdI9/BUILD/lttng-modules-2.12.5/lttng-modules-2.12.5/lttng-ring-buffer-metadata-mmap-client.ko INSTALL /tmp/B.bNSdI9/BUILD/lttng-modules-2.12.5/lttng-modules-2.12.5/lttng-ring-buffer-client-discard.ko INSTALL /tmp/B.bNSdI9/BUILD/lttng-modules-2.12.5/lttng-modules-2.12.5/lttng-ring-buffer-client-mmap-overwrite.ko INSTALL /tmp/B.bNSdI9/BUILD/lttng-modules-2.12.5/lttng-modules-2.12.5/lttng-ring-buffer-client-overwrite.ko INSTALL /tmp/B.bNSdI9/BUILD/lttng-modules-2.12.5/lttng-modules-2.12.5/lttng-statedump.ko INSTALL /tmp/B.bNSdI9/BUILD/lttng-modules-2.12.5/lttng-modules-2.12.5/lttng-ring-buffer-client-mmap-discard.ko INSTALL /tmp/B.bNSdI9/BUILD/lttng-modules-2.12.5/lttng-modules-2.12.5/probes/lttng-kretprobes.ko INSTALL /tmp/B.bNSdI9/BUILD/lttng-modules-2.12.5/lttng-modules-2.12.5/lttng-wrapper.ko INSTALL /tmp/B.bNSdI9/BUILD/lttng-modules-2.12.5/lttng-modules-2.12.5/probes/lttng-kprobes.ko INSTALL /tmp/B.bNSdI9/BUILD/lttng-modules-2.12.5/lttng-modules-2.12.5/probes/lttng-probe-9p.ko INSTALL /tmp/B.bNSdI9/BUILD/lttng-modules-2.12.5/lttng-modules-2.12.5/probes/lttng-probe-compaction.ko INSTALL /tmp/B.bNSdI9/BUILD/lttng-modules-2.12.5/lttng-modules-2.12.5/probes/lttng-probe-gpio.ko INSTALL /tmp/B.bNSdI9/BUILD/lttng-modules-2.12.5/lttng-modules-2.12.5/probes/lttng-probe-asoc.ko INSTALL /tmp/B.bNSdI9/BUILD/lttng-modules-2.12.5/lttng-modules-2.12.5/probes/lttng-probe-i2c.ko INSTALL /tmp/B.bNSdI9/BUILD/lttng-modules-2.12.5/lttng-modules-2.12.5/probes/lttng-probe-block.ko INSTALL /tmp/B.bNSdI9/BUILD/lttng-modules-2.12.5/lttng-modules-2.12.5/probes/lttng-probe-jbd2.ko INSTALL /tmp/B.bNSdI9/BUILD/lttng-modules-2.12.5/lttng-modules-2.12.5/probes/lttng-probe-kmem.ko INSTALL /tmp/B.bNSdI9/BUILD/lttng-modules-2.12.5/lttng-modules-2.12.5/probes/lttng-probe-irq.ko INSTALL /tmp/B.bNSdI9/BUILD/lttng-modules-2.12.5/lttng-modules-2.12.5/lib/lttng-lib-ring-buffer.ko INSTALL /tmp/B.bNSdI9/BUILD/lttng-modules-2.12.5/lttng-modules-2.12.5/probes/lttng-probe-kvm-x86-mmu.ko INSTALL /tmp/B.bNSdI9/BUILD/lttng-modules-2.12.5/lttng-modules-2.12.5/probes/lttng-probe-napi.ko INSTALL /tmp/B.bNSdI9/BUILD/lttng-modules-2.12.5/lttng-modules-2.12.5/probes/lttng-probe-module.ko INSTALL /tmp/B.bNSdI9/BUILD/lttng-modules-2.12.5/lttng-modules-2.12.5/probes/lttng-probe-kvm.ko INSTALL /tmp/B.bNSdI9/BUILD/lttng-modules-2.12.5/lttng-modules-2.12.5/probes/lttng-probe-net.ko INSTALL /tmp/B.bNSdI9/BUILD/lttng-modules-2.12.5/lttng-modules-2.12.5/probes/lttng-probe-printk.ko INSTALL /tmp/B.bNSdI9/BUILD/lttng-modules-2.12.5/lttng-modules-2.12.5/probes/lttng-probe-power.ko INSTALL /tmp/B.bNSdI9/BUILD/lttng-modules-2.12.5/lttng-modules-2.12.5/probes/lttng-probe-btrfs.ko INSTALL /tmp/B.bNSdI9/BUILD/lttng-modules-2.12.5/lttng-modules-2.12.5/probes/lttng-probe-rcu.ko INSTALL /tmp/B.bNSdI9/BUILD/lttng-modules-2.12.5/lttng-modules-2.12.5/probes/lttng-probe-random.ko INSTALL /tmp/B.bNSdI9/BUILD/lttng-modules-2.12.5/lttng-modules-2.12.5/probes/lttng-probe-regulator.ko INSTALL /tmp/B.bNSdI9/BUILD/lttng-modules-2.12.5/lttng-modules-2.12.5/probes/lttng-probe-regmap.ko INSTALL /tmp/B.bNSdI9/BUILD/lttng-modules-2.12.5/lttng-modules-2.12.5/probes/lttng-probe-scsi.ko INSTALL /tmp/B.bNSdI9/BUILD/lttng-modules-2.12.5/lttng-modules-2.12.5/probes/lttng-probe-signal.ko INSTALL /tmp/B.bNSdI9/BUILD/lttng-modules-2.12.5/lttng-modules-2.12.5/probes/lttng-probe-kvm-x86.ko INSTALL /tmp/B.bNSdI9/BUILD/lttng-modules-2.12.5/lttng-modules-2.12.5/probes/lttng-probe-sock.ko INSTALL /tmp/B.bNSdI9/BUILD/lttng-modules-2.12.5/lttng-modules-2.12.5/probes/lttng-probe-skb.ko INSTALL /tmp/B.bNSdI9/BUILD/lttng-modules-2.12.5/lttng-modules-2.12.5/probes/lttng-probe-sched.ko INSTALL /tmp/B.bNSdI9/BUILD/lttng-modules-2.12.5/lttng-modules-2.12.5/probes/lttng-probe-sunrpc.ko INSTALL /tmp/B.bNSdI9/BUILD/lttng-modules-2.12.5/lttng-modules-2.12.5/probes/lttng-probe-v4l2.ko INSTALL /tmp/B.bNSdI9/BUILD/lttng-modules-2.12.5/lttng-modules-2.12.5/probes/lttng-probe-udp.ko INSTALL /tmp/B.bNSdI9/BUILD/lttng-modules-2.12.5/lttng-modules-2.12.5/probes/lttng-probe-timer.ko INSTALL /tmp/B.bNSdI9/BUILD/lttng-modules-2.12.5/lttng-modules-2.12.5/probes/lttng-probe-x86-exceptions.ko INSTALL /tmp/B.bNSdI9/BUILD/lttng-modules-2.12.5/lttng-modules-2.12.5/probes/lttng-probe-ext4.ko INSTALL /tmp/B.bNSdI9/BUILD/lttng-modules-2.12.5/lttng-modules-2.12.5/probes/lttng-probe-workqueue.ko INSTALL /tmp/B.bNSdI9/BUILD/lttng-modules-2.12.5/lttng-modules-2.12.5/probes/lttng-probe-vmscan.ko INSTALL /tmp/B.bNSdI9/BUILD/lttng-modules-2.12.5/lttng-modules-2.12.5/probes/lttng-probe-x86-irq-vectors.ko INSTALL /tmp/B.bNSdI9/BUILD/lttng-modules-2.12.5/lttng-modules-2.12.5/tests/lttng-clock-plugin-test.ko INSTALL /tmp/B.bNSdI9/BUILD/lttng-modules-2.12.5/lttng-modules-2.12.5/probes/lttng-uprobes.ko INSTALL /tmp/B.bNSdI9/BUILD/lttng-modules-2.12.5/lttng-modules-2.12.5/probes/lttng-probe-statedump.ko INSTALL /tmp/B.bNSdI9/BUILD/lttng-modules-2.12.5/lttng-modules-2.12.5/tests/lttng-test.ko INSTALL /tmp/B.bNSdI9/BUILD/lttng-modules-2.12.5/lttng-modules-2.12.5/probes/lttng-probe-writeback.ko INSTALL /tmp/B.bNSdI9/BUILD/lttng-modules-2.12.5/lttng-modules-2.12.5/lttng-tracer.ko make[1]: Entering directory '/usr/src/linux-4.19-4.19.189' DEPMOD 4.19.189-1 Warning: modules_install: missing 'System.map' file. Skipping depmod. make[1]: Leaving directory '/usr/src/linux-4.19-4.19.189' + /usr/bin/make -Otarget -j9 clean 'KERNELDIR=/usr/src/linux-4.14' /usr/bin/make -C /usr/src/linux-4.14 M=/tmp/B.bNSdI9/BUILD/lttng-modules-2.12.5/lttng-modules-2.12.5 clean make[1]: Entering directory '/usr/src/linux-4.14-4.14.232' CLEAN /tmp/B.bNSdI9/BUILD/lttng-modules-2.12.5/lttng-modules-2.12.5/.tmp_versions CLEAN /tmp/B.bNSdI9/BUILD/lttng-modules-2.12.5/lttng-modules-2.12.5/Module.symvers make[1]: Leaving directory '/usr/src/linux-4.14-4.14.232' + /usr/bin/make -Otarget -j9 'KERNELDIR=/usr/src/linux-4.14' /usr/bin/make -C /usr/src/linux-4.14 M=/tmp/B.bNSdI9/BUILD/lttng-modules-2.12.5/lttng-modules-2.12.5 CONFIG_LTTNG=m CONFIG_LTTNG_CLOCK_PLUGIN_TEST=m modules CC [M] /tmp/B.bNSdI9/BUILD/lttng-modules-2.12.5/lttng-modules-2.12.5/lttng-ring-buffer-metadata-mmap-client.o CC [M] /tmp/B.bNSdI9/BUILD/lttng-modules-2.12.5/lttng-modules-2.12.5/lttng-ring-buffer-metadata-client.o CC [M] /tmp/B.bNSdI9/BUILD/lttng-modules-2.12.5/lttng-modules-2.12.5/lttng-ring-buffer-client-discard.o CC [M] /tmp/B.bNSdI9/BUILD/lttng-modules-2.12.5/lttng-modules-2.12.5/lttng-string-utils.o CC [M] /tmp/B.bNSdI9/BUILD/lttng-modules-2.12.5/lttng-modules-2.12.5/lttng-ring-buffer-client-mmap-discard.o CC [M] /tmp/B.bNSdI9/BUILD/lttng-modules-2.12.5/lttng-modules-2.12.5/lttng-ring-buffer-client-overwrite.o CC [M] /tmp/B.bNSdI9/BUILD/lttng-modules-2.12.5/lttng-modules-2.12.5/lttng-clock.o CC [M] /tmp/B.bNSdI9/BUILD/lttng-modules-2.12.5/lttng-modules-2.12.5/lttng-ring-buffer-client-mmap-overwrite.o CC [M] /tmp/B.bNSdI9/BUILD/lttng-modules-2.12.5/lttng-modules-2.12.5/lttng-abi.o CC [M] /tmp/B.bNSdI9/BUILD/lttng-modules-2.12.5/lttng-modules-2.12.5/lttng-probes.o CC [M] /tmp/B.bNSdI9/BUILD/lttng-modules-2.12.5/lttng-modules-2.12.5/lttng-context.o CC [M] /tmp/B.bNSdI9/BUILD/lttng-modules-2.12.5/lttng-modules-2.12.5/lttng-context-procname.o CC [M] /tmp/B.bNSdI9/BUILD/lttng-modules-2.12.5/lttng-modules-2.12.5/lttng-context-pid.o CC [M] /tmp/B.bNSdI9/BUILD/lttng-modules-2.12.5/lttng-modules-2.12.5/lttng-events.o CC [M] /tmp/B.bNSdI9/BUILD/lttng-modules-2.12.5/lttng-modules-2.12.5/lttng-context-prio.o CC [M] /tmp/B.bNSdI9/BUILD/lttng-modules-2.12.5/lttng-modules-2.12.5/lttng-context-nice.o CC [M] /tmp/B.bNSdI9/BUILD/lttng-modules-2.12.5/lttng-modules-2.12.5/lttng-context-vpid.o CC [M] /tmp/B.bNSdI9/BUILD/lttng-modules-2.12.5/lttng-modules-2.12.5/lttng-context-tid.o CC [M] /tmp/B.bNSdI9/BUILD/lttng-modules-2.12.5/lttng-modules-2.12.5/lttng-context-vtid.o CC [M] /tmp/B.bNSdI9/BUILD/lttng-modules-2.12.5/lttng-modules-2.12.5/lttng-context-cpu-id.o CC [M] /tmp/B.bNSdI9/BUILD/lttng-modules-2.12.5/lttng-modules-2.12.5/lttng-context-ppid.o CC [M] /tmp/B.bNSdI9/BUILD/lttng-modules-2.12.5/lttng-modules-2.12.5/lttng-context-uid.o CC [M] /tmp/B.bNSdI9/BUILD/lttng-modules-2.12.5/lttng-modules-2.12.5/lttng-context-euid.o CC [M] /tmp/B.bNSdI9/BUILD/lttng-modules-2.12.5/lttng-modules-2.12.5/lttng-context-vppid.o CC [M] /tmp/B.bNSdI9/BUILD/lttng-modules-2.12.5/lttng-modules-2.12.5/lttng-context-gid.o CC [M] /tmp/B.bNSdI9/BUILD/lttng-modules-2.12.5/lttng-modules-2.12.5/lttng-context-suid.o CC [M] /tmp/B.bNSdI9/BUILD/lttng-modules-2.12.5/lttng-modules-2.12.5/lttng-context-egid.o CC [M] /tmp/B.bNSdI9/BUILD/lttng-modules-2.12.5/lttng-modules-2.12.5/lttng-context-sgid.o CC [M] /tmp/B.bNSdI9/BUILD/lttng-modules-2.12.5/lttng-modules-2.12.5/lttng-context-veuid.o CC [M] /tmp/B.bNSdI9/BUILD/lttng-modules-2.12.5/lttng-modules-2.12.5/lttng-context-vuid.o CC [M] /tmp/B.bNSdI9/BUILD/lttng-modules-2.12.5/lttng-modules-2.12.5/lttng-context-vsuid.o CC [M] /tmp/B.bNSdI9/BUILD/lttng-modules-2.12.5/lttng-modules-2.12.5/lttng-context-vgid.o CC [M] /tmp/B.bNSdI9/BUILD/lttng-modules-2.12.5/lttng-modules-2.12.5/lttng-context-vegid.o CC [M] /tmp/B.bNSdI9/BUILD/lttng-modules-2.12.5/lttng-modules-2.12.5/lttng-context-vsgid.o CC [M] /tmp/B.bNSdI9/BUILD/lttng-modules-2.12.5/lttng-modules-2.12.5/lttng-context-interruptible.o CC [M] /tmp/B.bNSdI9/BUILD/lttng-modules-2.12.5/lttng-modules-2.12.5/lttng-context-need-reschedule.o CC [M] /tmp/B.bNSdI9/BUILD/lttng-modules-2.12.5/lttng-modules-2.12.5/lttng-calibrate.o CC [M] /tmp/B.bNSdI9/BUILD/lttng-modules-2.12.5/lttng-modules-2.12.5/probes/lttng.o CC [M] /tmp/B.bNSdI9/BUILD/lttng-modules-2.12.5/lttng-modules-2.12.5/lttng-context-callstack.o CC [M] /tmp/B.bNSdI9/BUILD/lttng-modules-2.12.5/lttng-modules-2.12.5/lttng-context-hostname.o CC [M] /tmp/B.bNSdI9/BUILD/lttng-modules-2.12.5/lttng-modules-2.12.5/lttng-filter.o CC [M] /tmp/B.bNSdI9/BUILD/lttng-modules-2.12.5/lttng-modules-2.12.5/lttng-tracker-id.o CC [M] /tmp/B.bNSdI9/BUILD/lttng-modules-2.12.5/lttng-modules-2.12.5/probes/lttng-probe-user.o CC [M] /tmp/B.bNSdI9/BUILD/lttng-modules-2.12.5/lttng-modules-2.12.5/lttng-tp-mempool.o CC [M] /tmp/B.bNSdI9/BUILD/lttng-modules-2.12.5/lttng-modules-2.12.5/lttng-filter-specialize.o CC [M] /tmp/B.bNSdI9/BUILD/lttng-modules-2.12.5/lttng-modules-2.12.5/lttng-filter-validator.o CC [M] /tmp/B.bNSdI9/BUILD/lttng-modules-2.12.5/lttng-modules-2.12.5/lttng-filter-interpreter.o CC [M] /tmp/B.bNSdI9/BUILD/lttng-modules-2.12.5/lttng-modules-2.12.5/lttng-tracepoint.o CC [M] /tmp/B.bNSdI9/BUILD/lttng-modules-2.12.5/lttng-modules-2.12.5/lttng-context-perf-counters.o CC [M] /tmp/B.bNSdI9/BUILD/lttng-modules-2.12.5/lttng-modules-2.12.5/lttng-context-cgroup-ns.o CC [M] /tmp/B.bNSdI9/BUILD/lttng-modules-2.12.5/lttng-modules-2.12.5/lttng-context-mnt-ns.o CC [M] /tmp/B.bNSdI9/BUILD/lttng-modules-2.12.5/lttng-modules-2.12.5/wrapper/page_alloc.o CC [M] /tmp/B.bNSdI9/BUILD/lttng-modules-2.12.5/lttng-modules-2.12.5/lttng-context-ipc-ns.o CC [M] /tmp/B.bNSdI9/BUILD/lttng-modules-2.12.5/lttng-modules-2.12.5/lttng-context-pid-ns.o CC [M] /tmp/B.bNSdI9/BUILD/lttng-modules-2.12.5/lttng-modules-2.12.5/lttng-context-user-ns.o CC [M] /tmp/B.bNSdI9/BUILD/lttng-modules-2.12.5/lttng-modules-2.12.5/lttng-context-net-ns.o CC [M] /tmp/B.bNSdI9/BUILD/lttng-modules-2.12.5/lttng-modules-2.12.5/lttng-context-uts-ns.o CC [M] /tmp/B.bNSdI9/BUILD/lttng-modules-2.12.5/lttng-modules-2.12.5/wrapper/trace-clock.o CC [M] /tmp/B.bNSdI9/BUILD/lttng-modules-2.12.5/lttng-modules-2.12.5/wrapper/kallsyms.o CC [M] /tmp/B.bNSdI9/BUILD/lttng-modules-2.12.5/lttng-modules-2.12.5/wrapper/random.o CC [M] /tmp/B.bNSdI9/BUILD/lttng-modules-2.12.5/lttng-modules-2.12.5/wrapper/fdtable.o CC [M] /tmp/B.bNSdI9/BUILD/lttng-modules-2.12.5/lttng-modules-2.12.5/wrapper/irqdesc.o CC [M] /tmp/B.bNSdI9/BUILD/lttng-modules-2.12.5/lttng-modules-2.12.5/lttng-wrapper-impl.o CC [M] /tmp/B.bNSdI9/BUILD/lttng-modules-2.12.5/lttng-modules-2.12.5/tests/probes/lttng-test.o CC [M] /tmp/B.bNSdI9/BUILD/lttng-modules-2.12.5/lttng-modules-2.12.5/probes/lttng-probe-irq.o CC [M] /tmp/B.bNSdI9/BUILD/lttng-modules-2.12.5/lttng-modules-2.12.5/lib/ringbuffer/ring_buffer_iterator.o LD [M] /tmp/B.bNSdI9/BUILD/lttng-modules-2.12.5/lttng-modules-2.12.5/lttng-wrapper.o CC [M] /tmp/B.bNSdI9/BUILD/lttng-modules-2.12.5/lttng-modules-2.12.5/lib/ringbuffer/ring_buffer_backend.o CC [M] /tmp/B.bNSdI9/BUILD/lttng-modules-2.12.5/lttng-modules-2.12.5/lttng-statedump-impl.o CC [M] /tmp/B.bNSdI9/BUILD/lttng-modules-2.12.5/lttng-modules-2.12.5/lib/ringbuffer/ring_buffer_frontend.o LD [M] /tmp/B.bNSdI9/BUILD/lttng-modules-2.12.5/lttng-modules-2.12.5/lttng-statedump.o CC [M] /tmp/B.bNSdI9/BUILD/lttng-modules-2.12.5/lttng-modules-2.12.5/probes/lttng-probe-sched.o CC [M] /tmp/B.bNSdI9/BUILD/lttng-modules-2.12.5/lttng-modules-2.12.5/tests/clock-plugin/lttng-clock-plugin-test.o LD [M] /tmp/B.bNSdI9/BUILD/lttng-modules-2.12.5/lttng-modules-2.12.5/tests/lttng-clock-plugin-test.o LD [M] /tmp/B.bNSdI9/BUILD/lttng-modules-2.12.5/lttng-modules-2.12.5/tests/lttng-test.o CC [M] /tmp/B.bNSdI9/BUILD/lttng-modules-2.12.5/lttng-modules-2.12.5/probes/lttng-probe-timer.o CC [M] /tmp/B.bNSdI9/BUILD/lttng-modules-2.12.5/lttng-modules-2.12.5/probes/lttng-probe-module.o CC [M] /tmp/B.bNSdI9/BUILD/lttng-modules-2.12.5/lttng-modules-2.12.5/probes/lttng-probe-power.o CC [M] /tmp/B.bNSdI9/BUILD/lttng-modules-2.12.5/lttng-modules-2.12.5/probes/lttng-probe-9p.o CC [M] /tmp/B.bNSdI9/BUILD/lttng-modules-2.12.5/lttng-modules-2.12.5/probes/lttng-probe-kmem.o CC [M] /tmp/B.bNSdI9/BUILD/lttng-modules-2.12.5/lttng-modules-2.12.5/lib/ringbuffer/ring_buffer_vfs.o CC [M] /tmp/B.bNSdI9/BUILD/lttng-modules-2.12.5/lttng-modules-2.12.5/lib/ringbuffer/ring_buffer_splice.o CC [M] /tmp/B.bNSdI9/BUILD/lttng-modules-2.12.5/lttng-modules-2.12.5/lib/prio_heap/lttng_prio_heap.o CC [M] /tmp/B.bNSdI9/BUILD/lttng-modules-2.12.5/lttng-modules-2.12.5/probes/lttng-probe-i2c.o CC [M] /tmp/B.bNSdI9/BUILD/lttng-modules-2.12.5/lttng-modules-2.12.5/probes/lttng-probe-x86-irq-vectors.o CC [M] /tmp/B.bNSdI9/BUILD/lttng-modules-2.12.5/lttng-modules-2.12.5/lib/../wrapper/splice.o CC [M] /tmp/B.bNSdI9/BUILD/lttng-modules-2.12.5/lttng-modules-2.12.5/lib/ringbuffer/ring_buffer_mmap.o LD [M] /tmp/B.bNSdI9/BUILD/lttng-modules-2.12.5/lttng-modules-2.12.5/lib/lttng-lib-ring-buffer.o CC [M] /tmp/B.bNSdI9/BUILD/lttng-modules-2.12.5/lttng-modules-2.12.5/probes/lttng-probe-statedump.o CC [M] /tmp/B.bNSdI9/BUILD/lttng-modules-2.12.5/lttng-modules-2.12.5/probes/lttng-probe-x86-exceptions.o CC [M] /tmp/B.bNSdI9/BUILD/lttng-modules-2.12.5/lttng-modules-2.12.5/probes/lttng-probe-kvm.o CC [M] /tmp/B.bNSdI9/BUILD/lttng-modules-2.12.5/lttng-modules-2.12.5/probes/lttng-probe-kvm-x86-mmu.o CC [M] /tmp/B.bNSdI9/BUILD/lttng-modules-2.12.5/lttng-modules-2.12.5/probes/lttng-probe-signal.o CC [M] /tmp/B.bNSdI9/BUILD/lttng-modules-2.12.5/lttng-modules-2.12.5/probes/lttng-probe-napi.o CC [M] /tmp/B.bNSdI9/BUILD/lttng-modules-2.12.5/lttng-modules-2.12.5/probes/lttng-probe-udp.o CC [M] /tmp/B.bNSdI9/BUILD/lttng-modules-2.12.5/lttng-modules-2.12.5/probes/lttng-probe-skb.o CC [M] /tmp/B.bNSdI9/BUILD/lttng-modules-2.12.5/lttng-modules-2.12.5/probes/lttng-probe-net.o CC [M] /tmp/B.bNSdI9/BUILD/lttng-modules-2.12.5/lttng-modules-2.12.5/probes/lttng-probe-sock.o CC [M] /tmp/B.bNSdI9/BUILD/lttng-modules-2.12.5/lttng-modules-2.12.5/probes/lttng-probe-kvm-x86.o CC [M] /tmp/B.bNSdI9/BUILD/lttng-modules-2.12.5/lttng-modules-2.12.5/probes/lttng-probe-gpio.o CC [M] /tmp/B.bNSdI9/BUILD/lttng-modules-2.12.5/lttng-modules-2.12.5/probes/lttng-probe-block.o CC [M] /tmp/B.bNSdI9/BUILD/lttng-modules-2.12.5/lttng-modules-2.12.5/probes/lttng-probe-regulator.o CC [M] /tmp/B.bNSdI9/BUILD/lttng-modules-2.12.5/lttng-modules-2.12.5/probes/lttng-probe-asoc.o CC [M] /tmp/B.bNSdI9/BUILD/lttng-modules-2.12.5/lttng-modules-2.12.5/probes/lttng-probe-scsi.o CC [M] /tmp/B.bNSdI9/BUILD/lttng-modules-2.12.5/lttng-modules-2.12.5/probes/lttng-probe-jbd2.o CC [M] /tmp/B.bNSdI9/BUILD/lttng-modules-2.12.5/lttng-modules-2.12.5/probes/lttng-probe-printk.o CC [M] /tmp/B.bNSdI9/BUILD/lttng-modules-2.12.5/lttng-modules-2.12.5/probes/lttng-probe-compaction.o CC [M] /tmp/B.bNSdI9/BUILD/lttng-modules-2.12.5/lttng-modules-2.12.5/probes/lttng-probe-vmscan.o CC [M] /tmp/B.bNSdI9/BUILD/lttng-modules-2.12.5/lttng-modules-2.12.5/probes/lttng-probe-rcu.o CC [M] /tmp/B.bNSdI9/BUILD/lttng-modules-2.12.5/lttng-modules-2.12.5/probes/lttng-probe-random.o CC [M] /tmp/B.bNSdI9/BUILD/lttng-modules-2.12.5/lttng-modules-2.12.5/probes/lttng-probe-v4l2.o CC [M] /tmp/B.bNSdI9/BUILD/lttng-modules-2.12.5/lttng-modules-2.12.5/probes/lttng-probe-regmap.o CC [M] /tmp/B.bNSdI9/BUILD/lttng-modules-2.12.5/lttng-modules-2.12.5/probes/lttng-probe-workqueue.o CC [M] /tmp/B.bNSdI9/BUILD/lttng-modules-2.12.5/lttng-modules-2.12.5/probes/lttng-probe-sunrpc.o CC [M] /tmp/B.bNSdI9/BUILD/lttng-modules-2.12.5/lttng-modules-2.12.5/probes/lttng-kprobes.o CC [M] /tmp/B.bNSdI9/BUILD/lttng-modules-2.12.5/lttng-modules-2.12.5/probes/lttng-probe-btrfs.o CC [M] /tmp/B.bNSdI9/BUILD/lttng-modules-2.12.5/lttng-modules-2.12.5/probes/lttng-uprobes.o CC [M] /tmp/B.bNSdI9/BUILD/lttng-modules-2.12.5/lttng-modules-2.12.5/probes/lttng-kretprobes.o CC [M] /tmp/B.bNSdI9/BUILD/lttng-modules-2.12.5/lttng-modules-2.12.5/probes/lttng-probe-writeback.o In file included from /tmp/B.bNSdI9/BUILD/lttng-modules-2.12.5/lttng-modules-2.12.5/probes/lttng-probe-writeback.c:38: /tmp/B.bNSdI9/BUILD/lttng-modules-2.12.5/lttng-modules-2.12.5/probes/../instrumentation/events/lttng-module/writeback.h:83: warning: "show_inode_state" redefined 83 | #define show_inode_state(state) \ | In file included from /tmp/B.bNSdI9/BUILD/lttng-modules-2.12.5/lttng-modules-2.12.5/probes/lttng-probe-writeback.c:20: ./include/trace/events/writeback.h:12: note: this is the location of the previous definition 12 | #define show_inode_state(state) \ | CC [M] /tmp/B.bNSdI9/BUILD/lttng-modules-2.12.5/lttng-modules-2.12.5/probes/lttng-probe-ext4.o CC [M] /tmp/B.bNSdI9/BUILD/lttng-modules-2.12.5/lttng-modules-2.12.5/lttng-syscalls.o LD [M] /tmp/B.bNSdI9/BUILD/lttng-modules-2.12.5/lttng-modules-2.12.5/lttng-tracer.o make[1]: Entering directory '/usr/src/linux-4.14-4.14.232' Building modules, stage 2. make[1]: Leaving directory '/usr/src/linux-4.14-4.14.232' MODPOST 54 modules CC /tmp/B.bNSdI9/BUILD/lttng-modules-2.12.5/lttng-modules-2.12.5/lttng-ring-buffer-metadata-mmap-client.mod.o CC /tmp/B.bNSdI9/BUILD/lttng-modules-2.12.5/lttng-modules-2.12.5/lttng-clock.mod.o CC /tmp/B.bNSdI9/BUILD/lttng-modules-2.12.5/lttng-modules-2.12.5/lttng-ring-buffer-client-discard.mod.o CC /tmp/B.bNSdI9/BUILD/lttng-modules-2.12.5/lttng-modules-2.12.5/lttng-ring-buffer-client-mmap-discard.mod.o CC /tmp/B.bNSdI9/BUILD/lttng-modules-2.12.5/lttng-modules-2.12.5/lttng-ring-buffer-metadata-client.mod.o CC /tmp/B.bNSdI9/BUILD/lttng-modules-2.12.5/lttng-modules-2.12.5/lttng-statedump.mod.o CC /tmp/B.bNSdI9/BUILD/lttng-modules-2.12.5/lttng-modules-2.12.5/lttng-ring-buffer-client-mmap-overwrite.mod.o CC /tmp/B.bNSdI9/BUILD/lttng-modules-2.12.5/lttng-modules-2.12.5/lib/lttng-lib-ring-buffer.mod.o CC /tmp/B.bNSdI9/BUILD/lttng-modules-2.12.5/lttng-modules-2.12.5/lttng-ring-buffer-client-overwrite.mod.o CC /tmp/B.bNSdI9/BUILD/lttng-modules-2.12.5/lttng-modules-2.12.5/probes/lttng-kprobes.mod.o CC /tmp/B.bNSdI9/BUILD/lttng-modules-2.12.5/lttng-modules-2.12.5/lttng-tracer.mod.o CC /tmp/B.bNSdI9/BUILD/lttng-modules-2.12.5/lttng-modules-2.12.5/probes/lttng-kretprobes.mod.o CC /tmp/B.bNSdI9/BUILD/lttng-modules-2.12.5/lttng-modules-2.12.5/lttng-wrapper.mod.o CC /tmp/B.bNSdI9/BUILD/lttng-modules-2.12.5/lttng-modules-2.12.5/probes/lttng-probe-9p.mod.o CC /tmp/B.bNSdI9/BUILD/lttng-modules-2.12.5/lttng-modules-2.12.5/probes/lttng-probe-btrfs.mod.o CC /tmp/B.bNSdI9/BUILD/lttng-modules-2.12.5/lttng-modules-2.12.5/probes/lttng-probe-asoc.mod.o CC /tmp/B.bNSdI9/BUILD/lttng-modules-2.12.5/lttng-modules-2.12.5/probes/lttng-probe-block.mod.o CC /tmp/B.bNSdI9/BUILD/lttng-modules-2.12.5/lttng-modules-2.12.5/probes/lttng-probe-ext4.mod.o CC /tmp/B.bNSdI9/BUILD/lttng-modules-2.12.5/lttng-modules-2.12.5/probes/lttng-probe-irq.mod.o CC /tmp/B.bNSdI9/BUILD/lttng-modules-2.12.5/lttng-modules-2.12.5/probes/lttng-probe-kmem.mod.o CC /tmp/B.bNSdI9/BUILD/lttng-modules-2.12.5/lttng-modules-2.12.5/probes/lttng-probe-gpio.mod.o CC /tmp/B.bNSdI9/BUILD/lttng-modules-2.12.5/lttng-modules-2.12.5/probes/lttng-probe-kvm-x86-mmu.mod.o CC /tmp/B.bNSdI9/BUILD/lttng-modules-2.12.5/lttng-modules-2.12.5/probes/lttng-probe-i2c.mod.o CC /tmp/B.bNSdI9/BUILD/lttng-modules-2.12.5/lttng-modules-2.12.5/probes/lttng-probe-compaction.mod.o CC /tmp/B.bNSdI9/BUILD/lttng-modules-2.12.5/lttng-modules-2.12.5/probes/lttng-probe-jbd2.mod.o CC /tmp/B.bNSdI9/BUILD/lttng-modules-2.12.5/lttng-modules-2.12.5/probes/lttng-probe-kvm-x86.mod.o CC /tmp/B.bNSdI9/BUILD/lttng-modules-2.12.5/lttng-modules-2.12.5/probes/lttng-probe-kvm.mod.o CC /tmp/B.bNSdI9/BUILD/lttng-modules-2.12.5/lttng-modules-2.12.5/probes/lttng-probe-module.mod.o CC /tmp/B.bNSdI9/BUILD/lttng-modules-2.12.5/lttng-modules-2.12.5/probes/lttng-probe-napi.mod.o CC /tmp/B.bNSdI9/BUILD/lttng-modules-2.12.5/lttng-modules-2.12.5/probes/lttng-probe-net.mod.o CC /tmp/B.bNSdI9/BUILD/lttng-modules-2.12.5/lttng-modules-2.12.5/probes/lttng-probe-printk.mod.o CC /tmp/B.bNSdI9/BUILD/lttng-modules-2.12.5/lttng-modules-2.12.5/probes/lttng-probe-power.mod.o CC /tmp/B.bNSdI9/BUILD/lttng-modules-2.12.5/lttng-modules-2.12.5/probes/lttng-probe-random.mod.o CC /tmp/B.bNSdI9/BUILD/lttng-modules-2.12.5/lttng-modules-2.12.5/probes/lttng-probe-rcu.mod.o CC /tmp/B.bNSdI9/BUILD/lttng-modules-2.12.5/lttng-modules-2.12.5/probes/lttng-probe-regmap.mod.o CC /tmp/B.bNSdI9/BUILD/lttng-modules-2.12.5/lttng-modules-2.12.5/probes/lttng-probe-scsi.mod.o CC /tmp/B.bNSdI9/BUILD/lttng-modules-2.12.5/lttng-modules-2.12.5/probes/lttng-probe-signal.mod.o CC /tmp/B.bNSdI9/BUILD/lttng-modules-2.12.5/lttng-modules-2.12.5/probes/lttng-probe-sched.mod.o CC /tmp/B.bNSdI9/BUILD/lttng-modules-2.12.5/lttng-modules-2.12.5/probes/lttng-probe-regulator.mod.o CC /tmp/B.bNSdI9/BUILD/lttng-modules-2.12.5/lttng-modules-2.12.5/probes/lttng-probe-statedump.mod.o CC /tmp/B.bNSdI9/BUILD/lttng-modules-2.12.5/lttng-modules-2.12.5/probes/lttng-probe-skb.mod.o CC /tmp/B.bNSdI9/BUILD/lttng-modules-2.12.5/lttng-modules-2.12.5/probes/lttng-probe-sock.mod.o CC /tmp/B.bNSdI9/BUILD/lttng-modules-2.12.5/lttng-modules-2.12.5/probes/lttng-probe-sunrpc.mod.o CC /tmp/B.bNSdI9/BUILD/lttng-modules-2.12.5/lttng-modules-2.12.5/probes/lttng-probe-timer.mod.o CC /tmp/B.bNSdI9/BUILD/lttng-modules-2.12.5/lttng-modules-2.12.5/probes/lttng-probe-udp.mod.o CC /tmp/B.bNSdI9/BUILD/lttng-modules-2.12.5/lttng-modules-2.12.5/probes/lttng-probe-v4l2.mod.o CC /tmp/B.bNSdI9/BUILD/lttng-modules-2.12.5/lttng-modules-2.12.5/probes/lttng-probe-vmscan.mod.o CC /tmp/B.bNSdI9/BUILD/lttng-modules-2.12.5/lttng-modules-2.12.5/probes/lttng-probe-workqueue.mod.o CC /tmp/B.bNSdI9/BUILD/lttng-modules-2.12.5/lttng-modules-2.12.5/probes/lttng-probe-writeback.mod.o LD [M] /tmp/B.bNSdI9/BUILD/lttng-modules-2.12.5/lttng-modules-2.12.5/lib/lttng-lib-ring-buffer.ko LD [M] /tmp/B.bNSdI9/BUILD/lttng-modules-2.12.5/lttng-modules-2.12.5/lttng-clock.ko LD [M] /tmp/B.bNSdI9/BUILD/lttng-modules-2.12.5/lttng-modules-2.12.5/lttng-ring-buffer-client-discard.ko LD [M] /tmp/B.bNSdI9/BUILD/lttng-modules-2.12.5/lttng-modules-2.12.5/lttng-ring-buffer-client-mmap-discard.ko LD [M] /tmp/B.bNSdI9/BUILD/lttng-modules-2.12.5/lttng-modules-2.12.5/lttng-ring-buffer-client-mmap-overwrite.ko LD [M] /tmp/B.bNSdI9/BUILD/lttng-modules-2.12.5/lttng-modules-2.12.5/lttng-ring-buffer-metadata-client.ko LD [M] /tmp/B.bNSdI9/BUILD/lttng-modules-2.12.5/lttng-modules-2.12.5/lttng-ring-buffer-client-overwrite.ko LD [M] /tmp/B.bNSdI9/BUILD/lttng-modules-2.12.5/lttng-modules-2.12.5/lttng-ring-buffer-metadata-mmap-client.ko LD [M] /tmp/B.bNSdI9/BUILD/lttng-modules-2.12.5/lttng-modules-2.12.5/lttng-statedump.ko LD [M] /tmp/B.bNSdI9/BUILD/lttng-modules-2.12.5/lttng-modules-2.12.5/lttng-tracer.ko CC /tmp/B.bNSdI9/BUILD/lttng-modules-2.12.5/lttng-modules-2.12.5/probes/lttng-probe-x86-exceptions.mod.o LD [M] /tmp/B.bNSdI9/BUILD/lttng-modules-2.12.5/lttng-modules-2.12.5/lttng-wrapper.ko LD [M] /tmp/B.bNSdI9/BUILD/lttng-modules-2.12.5/lttng-modules-2.12.5/probes/lttng-kprobes.ko LD [M] /tmp/B.bNSdI9/BUILD/lttng-modules-2.12.5/lttng-modules-2.12.5/probes/lttng-kretprobes.ko LD [M] /tmp/B.bNSdI9/BUILD/lttng-modules-2.12.5/lttng-modules-2.12.5/probes/lttng-probe-9p.ko LD [M] /tmp/B.bNSdI9/BUILD/lttng-modules-2.12.5/lttng-modules-2.12.5/probes/lttng-probe-asoc.ko LD [M] /tmp/B.bNSdI9/BUILD/lttng-modules-2.12.5/lttng-modules-2.12.5/probes/lttng-probe-block.ko LD [M] /tmp/B.bNSdI9/BUILD/lttng-modules-2.12.5/lttng-modules-2.12.5/probes/lttng-probe-btrfs.ko LD [M] /tmp/B.bNSdI9/BUILD/lttng-modules-2.12.5/lttng-modules-2.12.5/probes/lttng-probe-compaction.ko LD [M] /tmp/B.bNSdI9/BUILD/lttng-modules-2.12.5/lttng-modules-2.12.5/probes/lttng-probe-ext4.ko LD [M] /tmp/B.bNSdI9/BUILD/lttng-modules-2.12.5/lttng-modules-2.12.5/probes/lttng-probe-gpio.ko LD [M] /tmp/B.bNSdI9/BUILD/lttng-modules-2.12.5/lttng-modules-2.12.5/probes/lttng-probe-i2c.ko LD [M] /tmp/B.bNSdI9/BUILD/lttng-modules-2.12.5/lttng-modules-2.12.5/probes/lttng-probe-irq.ko LD [M] /tmp/B.bNSdI9/BUILD/lttng-modules-2.12.5/lttng-modules-2.12.5/probes/lttng-probe-jbd2.ko LD [M] /tmp/B.bNSdI9/BUILD/lttng-modules-2.12.5/lttng-modules-2.12.5/probes/lttng-probe-kmem.ko LD [M] /tmp/B.bNSdI9/BUILD/lttng-modules-2.12.5/lttng-modules-2.12.5/probes/lttng-probe-kvm-x86.ko LD [M] /tmp/B.bNSdI9/BUILD/lttng-modules-2.12.5/lttng-modules-2.12.5/probes/lttng-probe-kvm-x86-mmu.ko LD [M] /tmp/B.bNSdI9/BUILD/lttng-modules-2.12.5/lttng-modules-2.12.5/probes/lttng-probe-kvm.ko LD [M] /tmp/B.bNSdI9/BUILD/lttng-modules-2.12.5/lttng-modules-2.12.5/probes/lttng-probe-module.ko LD [M] /tmp/B.bNSdI9/BUILD/lttng-modules-2.12.5/lttng-modules-2.12.5/probes/lttng-probe-napi.ko LD [M] /tmp/B.bNSdI9/BUILD/lttng-modules-2.12.5/lttng-modules-2.12.5/probes/lttng-probe-net.ko LD [M] /tmp/B.bNSdI9/BUILD/lttng-modules-2.12.5/lttng-modules-2.12.5/probes/lttng-probe-power.ko LD [M] /tmp/B.bNSdI9/BUILD/lttng-modules-2.12.5/lttng-modules-2.12.5/probes/lttng-probe-printk.ko LD [M] /tmp/B.bNSdI9/BUILD/lttng-modules-2.12.5/lttng-modules-2.12.5/probes/lttng-probe-random.ko LD [M] /tmp/B.bNSdI9/BUILD/lttng-modules-2.12.5/lttng-modules-2.12.5/probes/lttng-probe-rcu.ko LD [M] /tmp/B.bNSdI9/BUILD/lttng-modules-2.12.5/lttng-modules-2.12.5/probes/lttng-probe-regmap.ko LD [M] /tmp/B.bNSdI9/BUILD/lttng-modules-2.12.5/lttng-modules-2.12.5/probes/lttng-probe-regulator.ko LD [M] /tmp/B.bNSdI9/BUILD/lttng-modules-2.12.5/lttng-modules-2.12.5/probes/lttng-probe-sched.ko LD [M] /tmp/B.bNSdI9/BUILD/lttng-modules-2.12.5/lttng-modules-2.12.5/probes/lttng-probe-scsi.ko LD [M] /tmp/B.bNSdI9/BUILD/lttng-modules-2.12.5/lttng-modules-2.12.5/probes/lttng-probe-signal.ko LD [M] /tmp/B.bNSdI9/BUILD/lttng-modules-2.12.5/lttng-modules-2.12.5/probes/lttng-probe-skb.ko CC /tmp/B.bNSdI9/BUILD/lttng-modules-2.12.5/lttng-modules-2.12.5/probes/lttng-probe-x86-irq-vectors.mod.o LD [M] /tmp/B.bNSdI9/BUILD/lttng-modules-2.12.5/lttng-modules-2.12.5/probes/lttng-probe-statedump.ko LD [M] /tmp/B.bNSdI9/BUILD/lttng-modules-2.12.5/lttng-modules-2.12.5/probes/lttng-probe-sock.ko LD [M] /tmp/B.bNSdI9/BUILD/lttng-modules-2.12.5/lttng-modules-2.12.5/probes/lttng-probe-sunrpc.ko LD [M] /tmp/B.bNSdI9/BUILD/lttng-modules-2.12.5/lttng-modules-2.12.5/probes/lttng-probe-timer.ko LD [M] /tmp/B.bNSdI9/BUILD/lttng-modules-2.12.5/lttng-modules-2.12.5/probes/lttng-probe-udp.ko LD [M] /tmp/B.bNSdI9/BUILD/lttng-modules-2.12.5/lttng-modules-2.12.5/probes/lttng-probe-v4l2.ko LD [M] /tmp/B.bNSdI9/BUILD/lttng-modules-2.12.5/lttng-modules-2.12.5/probes/lttng-probe-vmscan.ko LD [M] /tmp/B.bNSdI9/BUILD/lttng-modules-2.12.5/lttng-modules-2.12.5/probes/lttng-probe-workqueue.ko LD [M] /tmp/B.bNSdI9/BUILD/lttng-modules-2.12.5/lttng-modules-2.12.5/probes/lttng-probe-writeback.ko LD [M] /tmp/B.bNSdI9/BUILD/lttng-modules-2.12.5/lttng-modules-2.12.5/probes/lttng-probe-x86-irq-vectors.ko LD [M] /tmp/B.bNSdI9/BUILD/lttng-modules-2.12.5/lttng-modules-2.12.5/probes/lttng-probe-x86-exceptions.ko CC /tmp/B.bNSdI9/BUILD/lttng-modules-2.12.5/lttng-modules-2.12.5/probes/lttng-uprobes.mod.o LD [M] /tmp/B.bNSdI9/BUILD/lttng-modules-2.12.5/lttng-modules-2.12.5/probes/lttng-uprobes.ko CC /tmp/B.bNSdI9/BUILD/lttng-modules-2.12.5/lttng-modules-2.12.5/tests/lttng-clock-plugin-test.mod.o LD [M] /tmp/B.bNSdI9/BUILD/lttng-modules-2.12.5/lttng-modules-2.12.5/tests/lttng-clock-plugin-test.ko CC /tmp/B.bNSdI9/BUILD/lttng-modules-2.12.5/lttng-modules-2.12.5/tests/lttng-test.mod.o LD [M] /tmp/B.bNSdI9/BUILD/lttng-modules-2.12.5/lttng-modules-2.12.5/tests/lttng-test.ko + pwd + p=/tmp/B.bNSdI9/BUILD/lttng-modules-2.12.5/lttng-modules-2.12.5 + /usr/bin/make -Otarget -j9 modules_install 'INSTALL_MOD_PATH=/tmp/B.bNSdI9/BUILD/lttng-modules-2.12.5/lttng-modules-2.12.5/../installed' 'INSTALL_MOD_DIR=kernel/lttng' 'KERNELDIR=/usr/src/linux-4.14' /usr/bin/make -C /usr/src/linux-4.14 M=/tmp/B.bNSdI9/BUILD/lttng-modules-2.12.5/lttng-modules-2.12.5 CONFIG_LTTNG=m CONFIG_LTTNG_CLOCK_PLUGIN_TEST=m modules_install INSTALL /tmp/B.bNSdI9/BUILD/lttng-modules-2.12.5/lttng-modules-2.12.5/lttng-clock.ko INSTALL /tmp/B.bNSdI9/BUILD/lttng-modules-2.12.5/lttng-modules-2.12.5/lttng-ring-buffer-metadata-client.ko INSTALL /tmp/B.bNSdI9/BUILD/lttng-modules-2.12.5/lttng-modules-2.12.5/lttng-ring-buffer-metadata-mmap-client.ko INSTALL /tmp/B.bNSdI9/BUILD/lttng-modules-2.12.5/lttng-modules-2.12.5/lttng-ring-buffer-client-discard.ko INSTALL /tmp/B.bNSdI9/BUILD/lttng-modules-2.12.5/lttng-modules-2.12.5/lttng-ring-buffer-client-mmap-overwrite.ko INSTALL /tmp/B.bNSdI9/BUILD/lttng-modules-2.12.5/lttng-modules-2.12.5/lttng-ring-buffer-client-mmap-discard.ko INSTALL /tmp/B.bNSdI9/BUILD/lttng-modules-2.12.5/lttng-modules-2.12.5/lttng-ring-buffer-client-overwrite.ko INSTALL /tmp/B.bNSdI9/BUILD/lttng-modules-2.12.5/lttng-modules-2.12.5/lttng-wrapper.ko INSTALL /tmp/B.bNSdI9/BUILD/lttng-modules-2.12.5/lttng-modules-2.12.5/lttng-statedump.ko INSTALL /tmp/B.bNSdI9/BUILD/lttng-modules-2.12.5/lttng-modules-2.12.5/probes/lttng-kretprobes.ko INSTALL /tmp/B.bNSdI9/BUILD/lttng-modules-2.12.5/lttng-modules-2.12.5/probes/lttng-probe-9p.ko INSTALL /tmp/B.bNSdI9/BUILD/lttng-modules-2.12.5/lttng-modules-2.12.5/probes/lttng-kprobes.ko INSTALL /tmp/B.bNSdI9/BUILD/lttng-modules-2.12.5/lttng-modules-2.12.5/probes/lttng-probe-asoc.ko INSTALL /tmp/B.bNSdI9/BUILD/lttng-modules-2.12.5/lttng-modules-2.12.5/probes/lttng-probe-gpio.ko INSTALL /tmp/B.bNSdI9/BUILD/lttng-modules-2.12.5/lttng-modules-2.12.5/probes/lttng-probe-compaction.ko INSTALL /tmp/B.bNSdI9/BUILD/lttng-modules-2.12.5/lttng-modules-2.12.5/probes/lttng-probe-block.ko INSTALL /tmp/B.bNSdI9/BUILD/lttng-modules-2.12.5/lttng-modules-2.12.5/probes/lttng-probe-i2c.ko INSTALL /tmp/B.bNSdI9/BUILD/lttng-modules-2.12.5/lttng-modules-2.12.5/lib/lttng-lib-ring-buffer.ko INSTALL /tmp/B.bNSdI9/BUILD/lttng-modules-2.12.5/lttng-modules-2.12.5/probes/lttng-probe-irq.ko INSTALL /tmp/B.bNSdI9/BUILD/lttng-modules-2.12.5/lttng-modules-2.12.5/probes/lttng-probe-kmem.ko INSTALL /tmp/B.bNSdI9/BUILD/lttng-modules-2.12.5/lttng-modules-2.12.5/probes/lttng-probe-btrfs.ko INSTALL /tmp/B.bNSdI9/BUILD/lttng-modules-2.12.5/lttng-modules-2.12.5/probes/lttng-probe-jbd2.ko INSTALL /tmp/B.bNSdI9/BUILD/lttng-modules-2.12.5/lttng-modules-2.12.5/probes/lttng-probe-module.ko INSTALL /tmp/B.bNSdI9/BUILD/lttng-modules-2.12.5/lttng-modules-2.12.5/probes/lttng-probe-kvm-x86-mmu.ko INSTALL /tmp/B.bNSdI9/BUILD/lttng-modules-2.12.5/lttng-modules-2.12.5/probes/lttng-probe-kvm.ko INSTALL /tmp/B.bNSdI9/BUILD/lttng-modules-2.12.5/lttng-modules-2.12.5/probes/lttng-probe-napi.ko INSTALL /tmp/B.bNSdI9/BUILD/lttng-modules-2.12.5/lttng-modules-2.12.5/probes/lttng-probe-printk.ko INSTALL /tmp/B.bNSdI9/BUILD/lttng-modules-2.12.5/lttng-modules-2.12.5/probes/lttng-probe-net.ko INSTALL /tmp/B.bNSdI9/BUILD/lttng-modules-2.12.5/lttng-modules-2.12.5/probes/lttng-probe-power.ko INSTALL /tmp/B.bNSdI9/BUILD/lttng-modules-2.12.5/lttng-modules-2.12.5/probes/lttng-probe-rcu.ko INSTALL /tmp/B.bNSdI9/BUILD/lttng-modules-2.12.5/lttng-modules-2.12.5/probes/lttng-probe-regmap.ko INSTALL /tmp/B.bNSdI9/BUILD/lttng-modules-2.12.5/lttng-modules-2.12.5/probes/lttng-probe-signal.ko INSTALL /tmp/B.bNSdI9/BUILD/lttng-modules-2.12.5/lttng-modules-2.12.5/probes/lttng-probe-random.ko INSTALL /tmp/B.bNSdI9/BUILD/lttng-modules-2.12.5/lttng-modules-2.12.5/probes/lttng-probe-scsi.ko INSTALL /tmp/B.bNSdI9/BUILD/lttng-modules-2.12.5/lttng-modules-2.12.5/probes/lttng-probe-regulator.ko INSTALL /tmp/B.bNSdI9/BUILD/lttng-modules-2.12.5/lttng-modules-2.12.5/probes/lttng-probe-skb.ko INSTALL /tmp/B.bNSdI9/BUILD/lttng-modules-2.12.5/lttng-modules-2.12.5/probes/lttng-probe-sched.ko INSTALL /tmp/B.bNSdI9/BUILD/lttng-modules-2.12.5/lttng-modules-2.12.5/probes/lttng-probe-kvm-x86.ko INSTALL /tmp/B.bNSdI9/BUILD/lttng-modules-2.12.5/lttng-modules-2.12.5/probes/lttng-probe-sock.ko INSTALL /tmp/B.bNSdI9/BUILD/lttng-modules-2.12.5/lttng-modules-2.12.5/probes/lttng-probe-timer.ko INSTALL /tmp/B.bNSdI9/BUILD/lttng-modules-2.12.5/lttng-modules-2.12.5/probes/lttng-probe-v4l2.ko INSTALL /tmp/B.bNSdI9/BUILD/lttng-modules-2.12.5/lttng-modules-2.12.5/probes/lttng-probe-udp.ko INSTALL /tmp/B.bNSdI9/BUILD/lttng-modules-2.12.5/lttng-modules-2.12.5/probes/lttng-probe-sunrpc.ko INSTALL /tmp/B.bNSdI9/BUILD/lttng-modules-2.12.5/lttng-modules-2.12.5/probes/lttng-probe-workqueue.ko INSTALL /tmp/B.bNSdI9/BUILD/lttng-modules-2.12.5/lttng-modules-2.12.5/probes/lttng-probe-x86-irq-vectors.ko INSTALL /tmp/B.bNSdI9/BUILD/lttng-modules-2.12.5/lttng-modules-2.12.5/probes/lttng-uprobes.ko INSTALL /tmp/B.bNSdI9/BUILD/lttng-modules-2.12.5/lttng-modules-2.12.5/probes/lttng-probe-vmscan.ko INSTALL /tmp/B.bNSdI9/BUILD/lttng-modules-2.12.5/lttng-modules-2.12.5/probes/lttng-probe-statedump.ko INSTALL /tmp/B.bNSdI9/BUILD/lttng-modules-2.12.5/lttng-modules-2.12.5/probes/lttng-probe-x86-exceptions.ko INSTALL /tmp/B.bNSdI9/BUILD/lttng-modules-2.12.5/lttng-modules-2.12.5/tests/lttng-clock-plugin-test.ko INSTALL /tmp/B.bNSdI9/BUILD/lttng-modules-2.12.5/lttng-modules-2.12.5/probes/lttng-probe-ext4.ko INSTALL /tmp/B.bNSdI9/BUILD/lttng-modules-2.12.5/lttng-modules-2.12.5/tests/lttng-test.ko INSTALL /tmp/B.bNSdI9/BUILD/lttng-modules-2.12.5/lttng-modules-2.12.5/probes/lttng-probe-writeback.ko INSTALL /tmp/B.bNSdI9/BUILD/lttng-modules-2.12.5/lttng-modules-2.12.5/lttng-tracer.ko make[1]: Entering directory '/usr/src/linux-4.14-4.14.232' DEPMOD 4.14.232-1 make[1]: Leaving directory '/usr/src/linux-4.14-4.14.232' + /usr/bin/make -Otarget -j9 clean 'KERNELDIR=/usr/src/linux-5.10' /usr/bin/make -C /usr/src/linux-5.10 M=/tmp/B.bNSdI9/BUILD/lttng-modules-2.12.5/lttng-modules-2.12.5 clean make[1]: Entering directory '/usr/src/linux-5.10-5.10.34' CLEAN /tmp/B.bNSdI9/BUILD/lttng-modules-2.12.5/lttng-modules-2.12.5/Module.symvers make[1]: Leaving directory '/usr/src/linux-5.10-5.10.34' + /usr/bin/make -Otarget -j9 'KERNELDIR=/usr/src/linux-5.10' /usr/bin/make -C /usr/src/linux-5.10 M=/tmp/B.bNSdI9/BUILD/lttng-modules-2.12.5/lttng-modules-2.12.5 CONFIG_LTTNG=m CONFIG_LTTNG_CLOCK_PLUGIN_TEST=m modules CC [M] /tmp/B.bNSdI9/BUILD/lttng-modules-2.12.5/lttng-modules-2.12.5/lttng-ring-buffer-metadata-client.o CC [M] /tmp/B.bNSdI9/BUILD/lttng-modules-2.12.5/lttng-modules-2.12.5/lttng-ring-buffer-metadata-mmap-client.o CC [M] /tmp/B.bNSdI9/BUILD/lttng-modules-2.12.5/lttng-modules-2.12.5/tests/probes/lttng-test.o CC [M] /tmp/B.bNSdI9/BUILD/lttng-modules-2.12.5/lttng-modules-2.12.5/lttng-ring-buffer-client-mmap-overwrite.o LD [M] /tmp/B.bNSdI9/BUILD/lttng-modules-2.12.5/lttng-modules-2.12.5/tests/lttng-test.o CC [M] /tmp/B.bNSdI9/BUILD/lttng-modules-2.12.5/lttng-modules-2.12.5/lttng-ring-buffer-client-discard.o CC [M] /tmp/B.bNSdI9/BUILD/lttng-modules-2.12.5/lttng-modules-2.12.5/lttng-ring-buffer-client-mmap-discard.o CC [M] /tmp/B.bNSdI9/BUILD/lttng-modules-2.12.5/lttng-modules-2.12.5/lttng-ring-buffer-client-overwrite.o CC [M] /tmp/B.bNSdI9/BUILD/lttng-modules-2.12.5/lttng-modules-2.12.5/tests/clock-plugin/lttng-clock-plugin-test.o LD [M] /tmp/B.bNSdI9/BUILD/lttng-modules-2.12.5/lttng-modules-2.12.5/tests/lttng-clock-plugin-test.o CC [M] /tmp/B.bNSdI9/BUILD/lttng-modules-2.12.5/lttng-modules-2.12.5/probes/lttng-probe-irq.o CC [M] /tmp/B.bNSdI9/BUILD/lttng-modules-2.12.5/lttng-modules-2.12.5/lib/ringbuffer/ring_buffer_backend.o CC [M] /tmp/B.bNSdI9/BUILD/lttng-modules-2.12.5/lttng-modules-2.12.5/lttng-clock.o CC [M] /tmp/B.bNSdI9/BUILD/lttng-modules-2.12.5/lttng-modules-2.12.5/probes/lttng-probe-sched.o CC [M] /tmp/B.bNSdI9/BUILD/lttng-modules-2.12.5/lttng-modules-2.12.5/lib/ringbuffer/ring_buffer_iterator.o CC [M] /tmp/B.bNSdI9/BUILD/lttng-modules-2.12.5/lttng-modules-2.12.5/probes/lttng-probe-timer.o CC [M] /tmp/B.bNSdI9/BUILD/lttng-modules-2.12.5/lttng-modules-2.12.5/lib/ringbuffer/ring_buffer_frontend.o CC [M] /tmp/B.bNSdI9/BUILD/lttng-modules-2.12.5/lttng-modules-2.12.5/probes/lttng-probe-module.o CC [M] /tmp/B.bNSdI9/BUILD/lttng-modules-2.12.5/lttng-modules-2.12.5/probes/lttng-probe-kmem.o CC [M] /tmp/B.bNSdI9/BUILD/lttng-modules-2.12.5/lttng-modules-2.12.5/lttng-string-utils.o CC [M] /tmp/B.bNSdI9/BUILD/lttng-modules-2.12.5/lttng-modules-2.12.5/lttng-abi.o CC [M] /tmp/B.bNSdI9/BUILD/lttng-modules-2.12.5/lttng-modules-2.12.5/lib/ringbuffer/ring_buffer_splice.o CC [M] /tmp/B.bNSdI9/BUILD/lttng-modules-2.12.5/lttng-modules-2.12.5/lib/ringbuffer/ring_buffer_vfs.o CC [M] /tmp/B.bNSdI9/BUILD/lttng-modules-2.12.5/lttng-modules-2.12.5/lttng-events.o CC [M] /tmp/B.bNSdI9/BUILD/lttng-modules-2.12.5/lttng-modules-2.12.5/probes/lttng-probe-9p.o CC [M] /tmp/B.bNSdI9/BUILD/lttng-modules-2.12.5/lttng-modules-2.12.5/probes/lttng-probe-power.o CC [M] /tmp/B.bNSdI9/BUILD/lttng-modules-2.12.5/lttng-modules-2.12.5/lib/ringbuffer/ring_buffer_mmap.o CC [M] /tmp/B.bNSdI9/BUILD/lttng-modules-2.12.5/lttng-modules-2.12.5/lttng-probes.o CC [M] /tmp/B.bNSdI9/BUILD/lttng-modules-2.12.5/lttng-modules-2.12.5/probes/lttng-probe-i2c.o CC [M] /tmp/B.bNSdI9/BUILD/lttng-modules-2.12.5/lttng-modules-2.12.5/probes/lttng-probe-x86-irq-vectors.o CC [M] /tmp/B.bNSdI9/BUILD/lttng-modules-2.12.5/lttng-modules-2.12.5/lib/../wrapper/splice.o CC [M] /tmp/B.bNSdI9/BUILD/lttng-modules-2.12.5/lttng-modules-2.12.5/lib/prio_heap/lttng_prio_heap.o LD [M] /tmp/B.bNSdI9/BUILD/lttng-modules-2.12.5/lttng-modules-2.12.5/lib/lttng-lib-ring-buffer.o CC [M] /tmp/B.bNSdI9/BUILD/lttng-modules-2.12.5/lttng-modules-2.12.5/probes/lttng-probe-kvm.o CC [M] /tmp/B.bNSdI9/BUILD/lttng-modules-2.12.5/lttng-modules-2.12.5/probes/lttng-probe-x86-exceptions.o CC [M] /tmp/B.bNSdI9/BUILD/lttng-modules-2.12.5/lttng-modules-2.12.5/probes/lttng-probe-statedump.o CC [M] /tmp/B.bNSdI9/BUILD/lttng-modules-2.12.5/lttng-modules-2.12.5/probes/lttng-probe-signal.o CC [M] /tmp/B.bNSdI9/BUILD/lttng-modules-2.12.5/lttng-modules-2.12.5/probes/lttng-probe-kvm-x86-mmu.o CC [M] /tmp/B.bNSdI9/BUILD/lttng-modules-2.12.5/lttng-modules-2.12.5/probes/lttng-probe-napi.o CC [M] /tmp/B.bNSdI9/BUILD/lttng-modules-2.12.5/lttng-modules-2.12.5/lttng-context.o CC [M] /tmp/B.bNSdI9/BUILD/lttng-modules-2.12.5/lttng-modules-2.12.5/probes/lttng-probe-skb.o CC [M] /tmp/B.bNSdI9/BUILD/lttng-modules-2.12.5/lttng-modules-2.12.5/lttng-context-pid.o CC [M] /tmp/B.bNSdI9/BUILD/lttng-modules-2.12.5/lttng-modules-2.12.5/probes/lttng-probe-udp.o CC [M] /tmp/B.bNSdI9/BUILD/lttng-modules-2.12.5/lttng-modules-2.12.5/probes/lttng-probe-sock.o CC [M] /tmp/B.bNSdI9/BUILD/lttng-modules-2.12.5/lttng-modules-2.12.5/probes/lttng-probe-net.o CC [M] /tmp/B.bNSdI9/BUILD/lttng-modules-2.12.5/lttng-modules-2.12.5/probes/lttng-probe-kvm-x86.o CC [M] /tmp/B.bNSdI9/BUILD/lttng-modules-2.12.5/lttng-modules-2.12.5/lttng-context-procname.o CC [M] /tmp/B.bNSdI9/BUILD/lttng-modules-2.12.5/lttng-modules-2.12.5/probes/lttng-probe-block.o CC [M] /tmp/B.bNSdI9/BUILD/lttng-modules-2.12.5/lttng-modules-2.12.5/probes/lttng-probe-gpio.o CC [M] /tmp/B.bNSdI9/BUILD/lttng-modules-2.12.5/lttng-modules-2.12.5/probes/lttng-probe-asoc.o CC [M] /tmp/B.bNSdI9/BUILD/lttng-modules-2.12.5/lttng-modules-2.12.5/lttng-context-prio.o CC [M] /tmp/B.bNSdI9/BUILD/lttng-modules-2.12.5/lttng-modules-2.12.5/lttng-context-nice.o CC [M] /tmp/B.bNSdI9/BUILD/lttng-modules-2.12.5/lttng-modules-2.12.5/lttng-context-tid.o CC [M] /tmp/B.bNSdI9/BUILD/lttng-modules-2.12.5/lttng-modules-2.12.5/lttng-context-vpid.o CC [M] /tmp/B.bNSdI9/BUILD/lttng-modules-2.12.5/lttng-modules-2.12.5/probes/lttng-probe-regulator.o CC [M] /tmp/B.bNSdI9/BUILD/lttng-modules-2.12.5/lttng-modules-2.12.5/probes/lttng-probe-jbd2.o CC [M] /tmp/B.bNSdI9/BUILD/lttng-modules-2.12.5/lttng-modules-2.12.5/lttng-context-vtid.o CC [M] /tmp/B.bNSdI9/BUILD/lttng-modules-2.12.5/lttng-modules-2.12.5/probes/lttng-probe-scsi.o CC [M] /tmp/B.bNSdI9/BUILD/lttng-modules-2.12.5/lttng-modules-2.12.5/lttng-context-ppid.o CC [M] /tmp/B.bNSdI9/BUILD/lttng-modules-2.12.5/lttng-modules-2.12.5/lttng-context-cpu-id.o CC [M] /tmp/B.bNSdI9/BUILD/lttng-modules-2.12.5/lttng-modules-2.12.5/lttng-context-vppid.o CC [M] /tmp/B.bNSdI9/BUILD/lttng-modules-2.12.5/lttng-modules-2.12.5/lttng-context-euid.o CC [M] /tmp/B.bNSdI9/BUILD/lttng-modules-2.12.5/lttng-modules-2.12.5/lttng-context-uid.o CC [M] /tmp/B.bNSdI9/BUILD/lttng-modules-2.12.5/lttng-modules-2.12.5/probes/lttng-probe-compaction.o CC [M] /tmp/B.bNSdI9/BUILD/lttng-modules-2.12.5/lttng-modules-2.12.5/lttng-context-suid.o CC [M] /tmp/B.bNSdI9/BUILD/lttng-modules-2.12.5/lttng-modules-2.12.5/lttng-context-gid.o CC [M] /tmp/B.bNSdI9/BUILD/lttng-modules-2.12.5/lttng-modules-2.12.5/lttng-context-egid.o CC [M] /tmp/B.bNSdI9/BUILD/lttng-modules-2.12.5/lttng-modules-2.12.5/lttng-context-sgid.o CC [M] /tmp/B.bNSdI9/BUILD/lttng-modules-2.12.5/lttng-modules-2.12.5/lttng-context-vuid.o CC [M] /tmp/B.bNSdI9/BUILD/lttng-modules-2.12.5/lttng-modules-2.12.5/probes/lttng-probe-vmscan.o CC [M] /tmp/B.bNSdI9/BUILD/lttng-modules-2.12.5/lttng-modules-2.12.5/probes/lttng-probe-printk.o CC [M] /tmp/B.bNSdI9/BUILD/lttng-modules-2.12.5/lttng-modules-2.12.5/lttng-context-veuid.o CC [M] /tmp/B.bNSdI9/BUILD/lttng-modules-2.12.5/lttng-modules-2.12.5/lttng-context-vsuid.o CC [M] /tmp/B.bNSdI9/BUILD/lttng-modules-2.12.5/lttng-modules-2.12.5/lttng-context-vgid.o CC [M] /tmp/B.bNSdI9/BUILD/lttng-modules-2.12.5/lttng-modules-2.12.5/lttng-context-vegid.o CC [M] /tmp/B.bNSdI9/BUILD/lttng-modules-2.12.5/lttng-modules-2.12.5/lttng-context-vsgid.o CC [M] /tmp/B.bNSdI9/BUILD/lttng-modules-2.12.5/lttng-modules-2.12.5/lttng-context-interruptible.o CC [M] /tmp/B.bNSdI9/BUILD/lttng-modules-2.12.5/lttng-modules-2.12.5/probes/lttng-probe-random.o CC [M] /tmp/B.bNSdI9/BUILD/lttng-modules-2.12.5/lttng-modules-2.12.5/probes/lttng-probe-btrfs.o CC [M] /tmp/B.bNSdI9/BUILD/lttng-modules-2.12.5/lttng-modules-2.12.5/probes/lttng-probe-rcu.o CC [M] /tmp/B.bNSdI9/BUILD/lttng-modules-2.12.5/lttng-modules-2.12.5/lttng-context-need-reschedule.o CC [M] /tmp/B.bNSdI9/BUILD/lttng-modules-2.12.5/lttng-modules-2.12.5/lttng-calibrate.o CC [M] /tmp/B.bNSdI9/BUILD/lttng-modules-2.12.5/lttng-modules-2.12.5/lttng-context-callstack.o CC [M] /tmp/B.bNSdI9/BUILD/lttng-modules-2.12.5/lttng-modules-2.12.5/probes/lttng-probe-v4l2.o CC [M] /tmp/B.bNSdI9/BUILD/lttng-modules-2.12.5/lttng-modules-2.12.5/probes/lttng-probe-regmap.o CC [M] /tmp/B.bNSdI9/BUILD/lttng-modules-2.12.5/lttng-modules-2.12.5/probes/lttng-probe-workqueue.o CC [M] /tmp/B.bNSdI9/BUILD/lttng-modules-2.12.5/lttng-modules-2.12.5/probes/lttng.o CC [M] /tmp/B.bNSdI9/BUILD/lttng-modules-2.12.5/lttng-modules-2.12.5/probes/lttng-probe-sunrpc.o CC [M] /tmp/B.bNSdI9/BUILD/lttng-modules-2.12.5/lttng-modules-2.12.5/lttng-filter.o CC [M] /tmp/B.bNSdI9/BUILD/lttng-modules-2.12.5/lttng-modules-2.12.5/lttng-context-hostname.o CC [M] /tmp/B.bNSdI9/BUILD/lttng-modules-2.12.5/lttng-modules-2.12.5/lttng-tracker-id.o CC [M] /tmp/B.bNSdI9/BUILD/lttng-modules-2.12.5/lttng-modules-2.12.5/probes/lttng-kprobes.o CC [M] /tmp/B.bNSdI9/BUILD/lttng-modules-2.12.5/lttng-modules-2.12.5/probes/lttng-probe-user.o CC [M] /tmp/B.bNSdI9/BUILD/lttng-modules-2.12.5/lttng-modules-2.12.5/probes/lttng-uprobes.o CC [M] /tmp/B.bNSdI9/BUILD/lttng-modules-2.12.5/lttng-modules-2.12.5/lttng-tp-mempool.o CC [M] /tmp/B.bNSdI9/BUILD/lttng-modules-2.12.5/lttng-modules-2.12.5/lttng-filter-specialize.o CC [M] /tmp/B.bNSdI9/BUILD/lttng-modules-2.12.5/lttng-modules-2.12.5/probes/lttng-kretprobes.o CC [M] /tmp/B.bNSdI9/BUILD/lttng-modules-2.12.5/lttng-modules-2.12.5/lttng-filter-validator.o CC [M] /tmp/B.bNSdI9/BUILD/lttng-modules-2.12.5/lttng-modules-2.12.5/lttng-filter-interpreter.o CC [M] /tmp/B.bNSdI9/BUILD/lttng-modules-2.12.5/lttng-modules-2.12.5/probes/lttng-probe-writeback.o CC [M] /tmp/B.bNSdI9/BUILD/lttng-modules-2.12.5/lttng-modules-2.12.5/lttng-tracepoint.o CC [M] /tmp/B.bNSdI9/BUILD/lttng-modules-2.12.5/lttng-modules-2.12.5/lttng-context-perf-counters.o CC [M] /tmp/B.bNSdI9/BUILD/lttng-modules-2.12.5/lttng-modules-2.12.5/lttng-context-ipc-ns.o CC [M] /tmp/B.bNSdI9/BUILD/lttng-modules-2.12.5/lttng-modules-2.12.5/lttng-context-cgroup-ns.o CC [M] /tmp/B.bNSdI9/BUILD/lttng-modules-2.12.5/lttng-modules-2.12.5/lttng-context-mnt-ns.o CC [M] /tmp/B.bNSdI9/BUILD/lttng-modules-2.12.5/lttng-modules-2.12.5/lttng-context-net-ns.o CC [M] /tmp/B.bNSdI9/BUILD/lttng-modules-2.12.5/lttng-modules-2.12.5/lttng-context-pid-ns.o CC [M] /tmp/B.bNSdI9/BUILD/lttng-modules-2.12.5/lttng-modules-2.12.5/wrapper/trace-clock.o CC [M] /tmp/B.bNSdI9/BUILD/lttng-modules-2.12.5/lttng-modules-2.12.5/lttng-context-user-ns.o CC [M] /tmp/B.bNSdI9/BUILD/lttng-modules-2.12.5/lttng-modules-2.12.5/wrapper/random.o CC [M] /tmp/B.bNSdI9/BUILD/lttng-modules-2.12.5/lttng-modules-2.12.5/wrapper/page_alloc.o CC [M] /tmp/B.bNSdI9/BUILD/lttng-modules-2.12.5/lttng-modules-2.12.5/wrapper/irqdesc.o CC [M] /tmp/B.bNSdI9/BUILD/lttng-modules-2.12.5/lttng-modules-2.12.5/lttng-context-uts-ns.o CC [M] /tmp/B.bNSdI9/BUILD/lttng-modules-2.12.5/lttng-modules-2.12.5/wrapper/fdtable.o CC [M] /tmp/B.bNSdI9/BUILD/lttng-modules-2.12.5/lttng-modules-2.12.5/wrapper/kallsyms.o CC [M] /tmp/B.bNSdI9/BUILD/lttng-modules-2.12.5/lttng-modules-2.12.5/probes/lttng-probe-ext4.o CC [M] /tmp/B.bNSdI9/BUILD/lttng-modules-2.12.5/lttng-modules-2.12.5/lttng-wrapper-impl.o LD [M] /tmp/B.bNSdI9/BUILD/lttng-modules-2.12.5/lttng-modules-2.12.5/lttng-wrapper.o CC [M] /tmp/B.bNSdI9/BUILD/lttng-modules-2.12.5/lttng-modules-2.12.5/lttng-statedump-impl.o LD [M] /tmp/B.bNSdI9/BUILD/lttng-modules-2.12.5/lttng-modules-2.12.5/lttng-statedump.o CC [M] /tmp/B.bNSdI9/BUILD/lttng-modules-2.12.5/lttng-modules-2.12.5/lttng-syscalls.o LD [M] /tmp/B.bNSdI9/BUILD/lttng-modules-2.12.5/lttng-modules-2.12.5/lttng-tracer.o MODPOST /tmp/B.bNSdI9/BUILD/lttng-modules-2.12.5/lttng-modules-2.12.5/Module.symvers CC [M] /tmp/B.bNSdI9/BUILD/lttng-modules-2.12.5/lttng-modules-2.12.5/lttng-clock.mod.o CC [M] /tmp/B.bNSdI9/BUILD/lttng-modules-2.12.5/lttng-modules-2.12.5/lttng-ring-buffer-client-discard.mod.o CC [M] /tmp/B.bNSdI9/BUILD/lttng-modules-2.12.5/lttng-modules-2.12.5/lttng-ring-buffer-client-overwrite.mod.o CC [M] /tmp/B.bNSdI9/BUILD/lttng-modules-2.12.5/lttng-modules-2.12.5/lttng-ring-buffer-metadata-client.mod.o CC [M] /tmp/B.bNSdI9/BUILD/lttng-modules-2.12.5/lttng-modules-2.12.5/lttng-ring-buffer-client-mmap-discard.mod.o CC [M] /tmp/B.bNSdI9/BUILD/lttng-modules-2.12.5/lttng-modules-2.12.5/lttng-statedump.mod.o CC [M] /tmp/B.bNSdI9/BUILD/lttng-modules-2.12.5/lttng-modules-2.12.5/lttng-ring-buffer-client-mmap-overwrite.mod.o CC [M] /tmp/B.bNSdI9/BUILD/lttng-modules-2.12.5/lttng-modules-2.12.5/lib/lttng-lib-ring-buffer.mod.o CC [M] /tmp/B.bNSdI9/BUILD/lttng-modules-2.12.5/lttng-modules-2.12.5/lttng-ring-buffer-metadata-mmap-client.mod.o CC [M] /tmp/B.bNSdI9/BUILD/lttng-modules-2.12.5/lttng-modules-2.12.5/probes/lttng-kprobes.mod.o CC [M] /tmp/B.bNSdI9/BUILD/lttng-modules-2.12.5/lttng-modules-2.12.5/probes/lttng-probe-9p.mod.o CC [M] /tmp/B.bNSdI9/BUILD/lttng-modules-2.12.5/lttng-modules-2.12.5/lttng-tracer.mod.o CC [M] /tmp/B.bNSdI9/BUILD/lttng-modules-2.12.5/lttng-modules-2.12.5/probes/lttng-probe-asoc.mod.o CC [M] /tmp/B.bNSdI9/BUILD/lttng-modules-2.12.5/lttng-modules-2.12.5/probes/lttng-kretprobes.mod.o CC [M] /tmp/B.bNSdI9/BUILD/lttng-modules-2.12.5/lttng-modules-2.12.5/lttng-wrapper.mod.o CC [M] /tmp/B.bNSdI9/BUILD/lttng-modules-2.12.5/lttng-modules-2.12.5/probes/lttng-probe-block.mod.o CC [M] /tmp/B.bNSdI9/BUILD/lttng-modules-2.12.5/lttng-modules-2.12.5/probes/lttng-probe-compaction.mod.o CC [M] /tmp/B.bNSdI9/BUILD/lttng-modules-2.12.5/lttng-modules-2.12.5/probes/lttng-probe-btrfs.mod.o CC [M] /tmp/B.bNSdI9/BUILD/lttng-modules-2.12.5/lttng-modules-2.12.5/probes/lttng-probe-gpio.mod.o CC [M] /tmp/B.bNSdI9/BUILD/lttng-modules-2.12.5/lttng-modules-2.12.5/probes/lttng-probe-ext4.mod.o CC [M] /tmp/B.bNSdI9/BUILD/lttng-modules-2.12.5/lttng-modules-2.12.5/probes/lttng-probe-i2c.mod.o CC [M] /tmp/B.bNSdI9/BUILD/lttng-modules-2.12.5/lttng-modules-2.12.5/probes/lttng-probe-irq.mod.o CC [M] /tmp/B.bNSdI9/BUILD/lttng-modules-2.12.5/lttng-modules-2.12.5/probes/lttng-probe-kmem.mod.o CC [M] /tmp/B.bNSdI9/BUILD/lttng-modules-2.12.5/lttng-modules-2.12.5/probes/lttng-probe-jbd2.mod.o CC [M] /tmp/B.bNSdI9/BUILD/lttng-modules-2.12.5/lttng-modules-2.12.5/probes/lttng-probe-kvm-x86-mmu.mod.o CC [M] /tmp/B.bNSdI9/BUILD/lttng-modules-2.12.5/lttng-modules-2.12.5/probes/lttng-probe-kvm-x86.mod.o CC [M] /tmp/B.bNSdI9/BUILD/lttng-modules-2.12.5/lttng-modules-2.12.5/probes/lttng-probe-kvm.mod.o CC [M] /tmp/B.bNSdI9/BUILD/lttng-modules-2.12.5/lttng-modules-2.12.5/probes/lttng-probe-napi.mod.o CC [M] /tmp/B.bNSdI9/BUILD/lttng-modules-2.12.5/lttng-modules-2.12.5/probes/lttng-probe-net.mod.o CC [M] /tmp/B.bNSdI9/BUILD/lttng-modules-2.12.5/lttng-modules-2.12.5/probes/lttng-probe-power.mod.o CC [M] /tmp/B.bNSdI9/BUILD/lttng-modules-2.12.5/lttng-modules-2.12.5/probes/lttng-probe-random.mod.o CC [M] /tmp/B.bNSdI9/BUILD/lttng-modules-2.12.5/lttng-modules-2.12.5/probes/lttng-probe-printk.mod.o CC [M] /tmp/B.bNSdI9/BUILD/lttng-modules-2.12.5/lttng-modules-2.12.5/probes/lttng-probe-module.mod.o CC [M] /tmp/B.bNSdI9/BUILD/lttng-modules-2.12.5/lttng-modules-2.12.5/probes/lttng-probe-rcu.mod.o CC [M] /tmp/B.bNSdI9/BUILD/lttng-modules-2.12.5/lttng-modules-2.12.5/probes/lttng-probe-regulator.mod.o CC [M] /tmp/B.bNSdI9/BUILD/lttng-modules-2.12.5/lttng-modules-2.12.5/probes/lttng-probe-regmap.mod.o CC [M] /tmp/B.bNSdI9/BUILD/lttng-modules-2.12.5/lttng-modules-2.12.5/probes/lttng-probe-sched.mod.o CC [M] /tmp/B.bNSdI9/BUILD/lttng-modules-2.12.5/lttng-modules-2.12.5/probes/lttng-probe-scsi.mod.o CC [M] /tmp/B.bNSdI9/BUILD/lttng-modules-2.12.5/lttng-modules-2.12.5/probes/lttng-probe-signal.mod.o CC [M] /tmp/B.bNSdI9/BUILD/lttng-modules-2.12.5/lttng-modules-2.12.5/probes/lttng-probe-skb.mod.o CC [M] /tmp/B.bNSdI9/BUILD/lttng-modules-2.12.5/lttng-modules-2.12.5/probes/lttng-probe-sock.mod.o CC [M] /tmp/B.bNSdI9/BUILD/lttng-modules-2.12.5/lttng-modules-2.12.5/probes/lttng-probe-statedump.mod.o CC [M] /tmp/B.bNSdI9/BUILD/lttng-modules-2.12.5/lttng-modules-2.12.5/probes/lttng-probe-sunrpc.mod.o CC [M] /tmp/B.bNSdI9/BUILD/lttng-modules-2.12.5/lttng-modules-2.12.5/probes/lttng-probe-timer.mod.o CC [M] /tmp/B.bNSdI9/BUILD/lttng-modules-2.12.5/lttng-modules-2.12.5/probes/lttng-probe-udp.mod.o CC [M] /tmp/B.bNSdI9/BUILD/lttng-modules-2.12.5/lttng-modules-2.12.5/probes/lttng-probe-v4l2.mod.o CC [M] /tmp/B.bNSdI9/BUILD/lttng-modules-2.12.5/lttng-modules-2.12.5/probes/lttng-probe-vmscan.mod.o LD [M] /tmp/B.bNSdI9/BUILD/lttng-modules-2.12.5/lttng-modules-2.12.5/lib/lttng-lib-ring-buffer.ko LD [M] /tmp/B.bNSdI9/BUILD/lttng-modules-2.12.5/lttng-modules-2.12.5/lttng-clock.ko CC [M] /tmp/B.bNSdI9/BUILD/lttng-modules-2.12.5/lttng-modules-2.12.5/probes/lttng-probe-workqueue.mod.o LD [M] /tmp/B.bNSdI9/BUILD/lttng-modules-2.12.5/lttng-modules-2.12.5/lttng-ring-buffer-client-discard.ko LD [M] /tmp/B.bNSdI9/BUILD/lttng-modules-2.12.5/lttng-modules-2.12.5/lttng-ring-buffer-client-mmap-discard.ko LD [M] /tmp/B.bNSdI9/BUILD/lttng-modules-2.12.5/lttng-modules-2.12.5/lttng-ring-buffer-client-mmap-overwrite.ko LD [M] /tmp/B.bNSdI9/BUILD/lttng-modules-2.12.5/lttng-modules-2.12.5/lttng-ring-buffer-client-overwrite.ko LD [M] /tmp/B.bNSdI9/BUILD/lttng-modules-2.12.5/lttng-modules-2.12.5/lttng-ring-buffer-metadata-client.ko LD [M] /tmp/B.bNSdI9/BUILD/lttng-modules-2.12.5/lttng-modules-2.12.5/lttng-ring-buffer-metadata-mmap-client.ko LD [M] /tmp/B.bNSdI9/BUILD/lttng-modules-2.12.5/lttng-modules-2.12.5/lttng-statedump.ko CC [M] /tmp/B.bNSdI9/BUILD/lttng-modules-2.12.5/lttng-modules-2.12.5/probes/lttng-probe-x86-exceptions.mod.o LD [M] /tmp/B.bNSdI9/BUILD/lttng-modules-2.12.5/lttng-modules-2.12.5/lttng-tracer.ko LD [M] /tmp/B.bNSdI9/BUILD/lttng-modules-2.12.5/lttng-modules-2.12.5/lttng-wrapper.ko LD [M] /tmp/B.bNSdI9/BUILD/lttng-modules-2.12.5/lttng-modules-2.12.5/probes/lttng-kprobes.ko CC [M] /tmp/B.bNSdI9/BUILD/lttng-modules-2.12.5/lttng-modules-2.12.5/probes/lttng-probe-writeback.mod.o LD [M] /tmp/B.bNSdI9/BUILD/lttng-modules-2.12.5/lttng-modules-2.12.5/probes/lttng-kretprobes.ko LD [M] /tmp/B.bNSdI9/BUILD/lttng-modules-2.12.5/lttng-modules-2.12.5/probes/lttng-probe-9p.ko LD [M] /tmp/B.bNSdI9/BUILD/lttng-modules-2.12.5/lttng-modules-2.12.5/probes/lttng-probe-asoc.ko LD [M] /tmp/B.bNSdI9/BUILD/lttng-modules-2.12.5/lttng-modules-2.12.5/probes/lttng-probe-block.ko LD [M] /tmp/B.bNSdI9/BUILD/lttng-modules-2.12.5/lttng-modules-2.12.5/probes/lttng-probe-btrfs.ko LD [M] /tmp/B.bNSdI9/BUILD/lttng-modules-2.12.5/lttng-modules-2.12.5/probes/lttng-probe-compaction.ko LD [M] /tmp/B.bNSdI9/BUILD/lttng-modules-2.12.5/lttng-modules-2.12.5/probes/lttng-probe-ext4.ko LD [M] /tmp/B.bNSdI9/BUILD/lttng-modules-2.12.5/lttng-modules-2.12.5/probes/lttng-probe-gpio.ko LD [M] /tmp/B.bNSdI9/BUILD/lttng-modules-2.12.5/lttng-modules-2.12.5/probes/lttng-probe-i2c.ko LD [M] /tmp/B.bNSdI9/BUILD/lttng-modules-2.12.5/lttng-modules-2.12.5/probes/lttng-probe-irq.ko LD [M] /tmp/B.bNSdI9/BUILD/lttng-modules-2.12.5/lttng-modules-2.12.5/probes/lttng-probe-jbd2.ko LD [M] /tmp/B.bNSdI9/BUILD/lttng-modules-2.12.5/lttng-modules-2.12.5/probes/lttng-probe-kmem.ko LD [M] /tmp/B.bNSdI9/BUILD/lttng-modules-2.12.5/lttng-modules-2.12.5/probes/lttng-probe-kvm-x86-mmu.ko LD [M] /tmp/B.bNSdI9/BUILD/lttng-modules-2.12.5/lttng-modules-2.12.5/probes/lttng-probe-kvm-x86.ko LD [M] /tmp/B.bNSdI9/BUILD/lttng-modules-2.12.5/lttng-modules-2.12.5/probes/lttng-probe-kvm.ko LD [M] /tmp/B.bNSdI9/BUILD/lttng-modules-2.12.5/lttng-modules-2.12.5/probes/lttng-probe-module.ko LD [M] /tmp/B.bNSdI9/BUILD/lttng-modules-2.12.5/lttng-modules-2.12.5/probes/lttng-probe-napi.ko LD [M] /tmp/B.bNSdI9/BUILD/lttng-modules-2.12.5/lttng-modules-2.12.5/probes/lttng-probe-net.ko LD [M] /tmp/B.bNSdI9/BUILD/lttng-modules-2.12.5/lttng-modules-2.12.5/probes/lttng-probe-power.ko LD [M] /tmp/B.bNSdI9/BUILD/lttng-modules-2.12.5/lttng-modules-2.12.5/probes/lttng-probe-printk.ko LD [M] /tmp/B.bNSdI9/BUILD/lttng-modules-2.12.5/lttng-modules-2.12.5/probes/lttng-probe-random.ko LD [M] /tmp/B.bNSdI9/BUILD/lttng-modules-2.12.5/lttng-modules-2.12.5/probes/lttng-probe-rcu.ko LD [M] /tmp/B.bNSdI9/BUILD/lttng-modules-2.12.5/lttng-modules-2.12.5/probes/lttng-probe-regmap.ko LD [M] /tmp/B.bNSdI9/BUILD/lttng-modules-2.12.5/lttng-modules-2.12.5/probes/lttng-probe-regulator.ko LD [M] /tmp/B.bNSdI9/BUILD/lttng-modules-2.12.5/lttng-modules-2.12.5/probes/lttng-probe-sched.ko CC [M] /tmp/B.bNSdI9/BUILD/lttng-modules-2.12.5/lttng-modules-2.12.5/probes/lttng-probe-x86-irq-vectors.mod.o LD [M] /tmp/B.bNSdI9/BUILD/lttng-modules-2.12.5/lttng-modules-2.12.5/probes/lttng-probe-scsi.ko LD [M] /tmp/B.bNSdI9/BUILD/lttng-modules-2.12.5/lttng-modules-2.12.5/probes/lttng-probe-signal.ko LD [M] /tmp/B.bNSdI9/BUILD/lttng-modules-2.12.5/lttng-modules-2.12.5/probes/lttng-probe-skb.ko LD [M] /tmp/B.bNSdI9/BUILD/lttng-modules-2.12.5/lttng-modules-2.12.5/probes/lttng-probe-sock.ko LD [M] /tmp/B.bNSdI9/BUILD/lttng-modules-2.12.5/lttng-modules-2.12.5/probes/lttng-probe-statedump.ko LD [M] /tmp/B.bNSdI9/BUILD/lttng-modules-2.12.5/lttng-modules-2.12.5/probes/lttng-probe-sunrpc.ko LD [M] /tmp/B.bNSdI9/BUILD/lttng-modules-2.12.5/lttng-modules-2.12.5/probes/lttng-probe-timer.ko LD [M] /tmp/B.bNSdI9/BUILD/lttng-modules-2.12.5/lttng-modules-2.12.5/probes/lttng-probe-v4l2.ko LD [M] /tmp/B.bNSdI9/BUILD/lttng-modules-2.12.5/lttng-modules-2.12.5/probes/lttng-probe-udp.ko LD [M] /tmp/B.bNSdI9/BUILD/lttng-modules-2.12.5/lttng-modules-2.12.5/probes/lttng-probe-vmscan.ko LD [M] /tmp/B.bNSdI9/BUILD/lttng-modules-2.12.5/lttng-modules-2.12.5/probes/lttng-probe-workqueue.ko CC [M] /tmp/B.bNSdI9/BUILD/lttng-modules-2.12.5/lttng-modules-2.12.5/probes/lttng-uprobes.mod.o LD [M] /tmp/B.bNSdI9/BUILD/lttng-modules-2.12.5/lttng-modules-2.12.5/probes/lttng-probe-writeback.ko LD [M] /tmp/B.bNSdI9/BUILD/lttng-modules-2.12.5/lttng-modules-2.12.5/probes/lttng-probe-x86-exceptions.ko LD [M] /tmp/B.bNSdI9/BUILD/lttng-modules-2.12.5/lttng-modules-2.12.5/probes/lttng-probe-x86-irq-vectors.ko LD [M] /tmp/B.bNSdI9/BUILD/lttng-modules-2.12.5/lttng-modules-2.12.5/probes/lttng-uprobes.ko CC [M] /tmp/B.bNSdI9/BUILD/lttng-modules-2.12.5/lttng-modules-2.12.5/tests/lttng-clock-plugin-test.mod.o LD [M] /tmp/B.bNSdI9/BUILD/lttng-modules-2.12.5/lttng-modules-2.12.5/tests/lttng-clock-plugin-test.ko CC [M] /tmp/B.bNSdI9/BUILD/lttng-modules-2.12.5/lttng-modules-2.12.5/tests/lttng-test.mod.o LD [M] /tmp/B.bNSdI9/BUILD/lttng-modules-2.12.5/lttng-modules-2.12.5/tests/lttng-test.ko + pwd + p=/tmp/B.bNSdI9/BUILD/lttng-modules-2.12.5/lttng-modules-2.12.5 + /usr/bin/make -Otarget -j9 modules_install 'INSTALL_MOD_PATH=/tmp/B.bNSdI9/BUILD/lttng-modules-2.12.5/lttng-modules-2.12.5/../installed' 'INSTALL_MOD_DIR=kernel/lttng' 'KERNELDIR=/usr/src/linux-5.10' /usr/bin/make -C /usr/src/linux-5.10 M=/tmp/B.bNSdI9/BUILD/lttng-modules-2.12.5/lttng-modules-2.12.5 CONFIG_LTTNG=m CONFIG_LTTNG_CLOCK_PLUGIN_TEST=m modules_install INSTALL /tmp/B.bNSdI9/BUILD/lttng-modules-2.12.5/lttng-modules-2.12.5/lttng-clock.ko At main.c:160: - SSL error:02001002:system library:fopen:No such file or directory: crypto/bio/bss_file.c:69 - SSL error:2006D080:BIO routines:BIO_new_file:no such file: crypto/bio/bss_file.c:76 sign-file: certs/signing_key.pem: No such file or directory INSTALL /tmp/B.bNSdI9/BUILD/lttng-modules-2.12.5/lttng-modules-2.12.5/lttng-ring-buffer-metadata-mmap-client.ko At main.c:160: - SSL error:02001002:system library:fopen:No such file or directory: crypto/bio/bss_file.c:69 - SSL error:2006D080:BIO routines:BIO_new_file:no such file: crypto/bio/bss_file.c:76 sign-file: certs/signing_key.pem: No such file or directory INSTALL /tmp/B.bNSdI9/BUILD/lttng-modules-2.12.5/lttng-modules-2.12.5/lttng-ring-buffer-client-discard.ko At main.c:160: - SSL error:02001002:system library:fopen:No such file or directory: crypto/bio/bss_file.c:69 - SSL error:2006D080:BIO routines:BIO_new_file:no such file: crypto/bio/bss_file.c:76 sign-file: certs/signing_key.pem: No such file or directory INSTALL /tmp/B.bNSdI9/BUILD/lttng-modules-2.12.5/lttng-modules-2.12.5/lttng-ring-buffer-client-mmap-discard.ko At main.c:160: - SSL error:02001002:system library:fopen:No such file or directory: crypto/bio/bss_file.c:69 - SSL error:2006D080:BIO routines:BIO_new_file:no such file: crypto/bio/bss_file.c:76 sign-file: certs/signing_key.pem: No such file or directory INSTALL /tmp/B.bNSdI9/BUILD/lttng-modules-2.12.5/lttng-modules-2.12.5/lttng-ring-buffer-client-mmap-overwrite.ko At main.c:160: - SSL error:02001002:system library:fopen:No such file or directory: crypto/bio/bss_file.c:69 - SSL error:2006D080:BIO routines:BIO_new_file:no such file: crypto/bio/bss_file.c:76 sign-file: certs/signing_key.pem: No such file or directory INSTALL /tmp/B.bNSdI9/BUILD/lttng-modules-2.12.5/lttng-modules-2.12.5/lttng-ring-buffer-metadata-client.ko At main.c:160: - SSL error:02001002:system library:fopen:No such file or directory: crypto/bio/bss_file.c:69 - SSL error:2006D080:BIO routines:BIO_new_file:no such file: crypto/bio/bss_file.c:76 sign-file: certs/signing_key.pem: No such file or directory INSTALL /tmp/B.bNSdI9/BUILD/lttng-modules-2.12.5/lttng-modules-2.12.5/lttng-ring-buffer-client-overwrite.ko At main.c:160: - SSL error:02001002:system library:fopen:No such file or directory: crypto/bio/bss_file.c:69 - SSL error:2006D080:BIO routines:BIO_new_file:no such file: crypto/bio/bss_file.c:76 sign-file: certs/signing_key.pem: No such file or directory INSTALL /tmp/B.bNSdI9/BUILD/lttng-modules-2.12.5/lttng-modules-2.12.5/lttng-statedump.ko At main.c:160: - SSL error:02001002:system library:fopen:No such file or directory: crypto/bio/bss_file.c:69 - SSL error:2006D080:BIO routines:BIO_new_file:no such file: crypto/bio/bss_file.c:76 sign-file: certs/signing_key.pem: No such file or directory INSTALL /tmp/B.bNSdI9/BUILD/lttng-modules-2.12.5/lttng-modules-2.12.5/lttng-wrapper.ko At main.c:160: - SSL error:02001002:system library:fopen:No such file or directory: crypto/bio/bss_file.c:69 - SSL error:2006D080:BIO routines:BIO_new_file:no such file: crypto/bio/bss_file.c:76 sign-file: certs/signing_key.pem: No such file or directory INSTALL /tmp/B.bNSdI9/BUILD/lttng-modules-2.12.5/lttng-modules-2.12.5/probes/lttng-kprobes.ko At main.c:160: - SSL error:02001002:system library:fopen:No such file or directory: crypto/bio/bss_file.c:69 - SSL error:2006D080:BIO routines:BIO_new_file:no such file: crypto/bio/bss_file.c:76 sign-file: certs/signing_key.pem: No such file or directory INSTALL /tmp/B.bNSdI9/BUILD/lttng-modules-2.12.5/lttng-modules-2.12.5/probes/lttng-kretprobes.ko At main.c:160: - SSL error:02001002:system library:fopen:No such file or directory: crypto/bio/bss_file.c:69 - SSL error:2006D080:BIO routines:BIO_new_file:no such file: crypto/bio/bss_file.c:76 sign-file: certs/signing_key.pem: No such file or directory INSTALL /tmp/B.bNSdI9/BUILD/lttng-modules-2.12.5/lttng-modules-2.12.5/probes/lttng-probe-9p.ko At main.c:160: - SSL error:02001002:system library:fopen:No such file or directory: crypto/bio/bss_file.c:69 - SSL error:2006D080:BIO routines:BIO_new_file:no such file: crypto/bio/bss_file.c:76 sign-file: certs/signing_key.pem: No such file or directory INSTALL /tmp/B.bNSdI9/BUILD/lttng-modules-2.12.5/lttng-modules-2.12.5/probes/lttng-probe-compaction.ko At main.c:160: - SSL error:02001002:system library:fopen:No such file or directory: crypto/bio/bss_file.c:69 - SSL error:2006D080:BIO routines:BIO_new_file:no such file: crypto/bio/bss_file.c:76 sign-file: certs/signing_key.pem: No such file or directory INSTALL /tmp/B.bNSdI9/BUILD/lttng-modules-2.12.5/lttng-modules-2.12.5/probes/lttng-probe-asoc.ko At main.c:160: - SSL error:02001002:system library:fopen:No such file or directory: crypto/bio/bss_file.c:69 - SSL error:2006D080:BIO routines:BIO_new_file:no such file: crypto/bio/bss_file.c:76 sign-file: certs/signing_key.pem: No such file or directory INSTALL /tmp/B.bNSdI9/BUILD/lttng-modules-2.12.5/lttng-modules-2.12.5/probes/lttng-probe-gpio.ko At main.c:160: - SSL error:02001002:system library:fopen:No such file or directory: crypto/bio/bss_file.c:69 - SSL error:2006D080:BIO routines:BIO_new_file:no such file: crypto/bio/bss_file.c:76 sign-file: certs/signing_key.pem: No such file or directory INSTALL /tmp/B.bNSdI9/BUILD/lttng-modules-2.12.5/lttng-modules-2.12.5/probes/lttng-probe-i2c.ko At main.c:160: - SSL error:02001002:system library:fopen:No such file or directory: crypto/bio/bss_file.c:69 - SSL error:2006D080:BIO routines:BIO_new_file:no such file: crypto/bio/bss_file.c:76 sign-file: certs/signing_key.pem: No such file or directory INSTALL /tmp/B.bNSdI9/BUILD/lttng-modules-2.12.5/lttng-modules-2.12.5/probes/lttng-probe-irq.ko At main.c:160: - SSL error:02001002:system library:fopen:No such file or directory: crypto/bio/bss_file.c:69 - SSL error:2006D080:BIO routines:BIO_new_file:no such file: crypto/bio/bss_file.c:76 sign-file: certs/signing_key.pem: No such file or directory INSTALL /tmp/B.bNSdI9/BUILD/lttng-modules-2.12.5/lttng-modules-2.12.5/lib/lttng-lib-ring-buffer.ko At main.c:160: - SSL error:02001002:system library:fopen:No such file or directory: crypto/bio/bss_file.c:69 - SSL error:2006D080:BIO routines:BIO_new_file:no such file: crypto/bio/bss_file.c:76 sign-file: certs/signing_key.pem: No such file or directory INSTALL /tmp/B.bNSdI9/BUILD/lttng-modules-2.12.5/lttng-modules-2.12.5/probes/lttng-probe-block.ko At main.c:160: - SSL error:02001002:system library:fopen:No such file or directory: crypto/bio/bss_file.c:69 - SSL error:2006D080:BIO routines:BIO_new_file:no such file: crypto/bio/bss_file.c:76 sign-file: certs/signing_key.pem: No such file or directory INSTALL /tmp/B.bNSdI9/BUILD/lttng-modules-2.12.5/lttng-modules-2.12.5/probes/lttng-probe-btrfs.ko At main.c:160: - SSL error:02001002:system library:fopen:No such file or directory: crypto/bio/bss_file.c:69 - SSL error:2006D080:BIO routines:BIO_new_file:no such file: crypto/bio/bss_file.c:76 sign-file: certs/signing_key.pem: No such file or directory INSTALL /tmp/B.bNSdI9/BUILD/lttng-modules-2.12.5/lttng-modules-2.12.5/probes/lttng-probe-jbd2.ko At main.c:160: - SSL error:02001002:system library:fopen:No such file or directory: crypto/bio/bss_file.c:69 - SSL error:2006D080:BIO routines:BIO_new_file:no such file: crypto/bio/bss_file.c:76 sign-file: certs/signing_key.pem: No such file or directory INSTALL /tmp/B.bNSdI9/BUILD/lttng-modules-2.12.5/lttng-modules-2.12.5/probes/lttng-probe-kvm-x86-mmu.ko At main.c:160: - SSL error:02001002:system library:fopen:No such file or directory: crypto/bio/bss_file.c:69 - SSL error:2006D080:BIO routines:BIO_new_file:no such file: crypto/bio/bss_file.c:76 sign-file: certs/signing_key.pem: No such file or directory INSTALL /tmp/B.bNSdI9/BUILD/lttng-modules-2.12.5/lttng-modules-2.12.5/probes/lttng-probe-napi.ko At main.c:160: - SSL error:02001002:system library:fopen:No such file or directory: crypto/bio/bss_file.c:69 - SSL error:2006D080:BIO routines:BIO_new_file:no such file: crypto/bio/bss_file.c:76 sign-file: certs/signing_key.pem: No such file or directory INSTALL /tmp/B.bNSdI9/BUILD/lttng-modules-2.12.5/lttng-modules-2.12.5/probes/lttng-probe-kmem.ko At main.c:160: - SSL error:02001002:system library:fopen:No such file or directory: crypto/bio/bss_file.c:69 - SSL error:2006D080:BIO routines:BIO_new_file:no such file: crypto/bio/bss_file.c:76 sign-file: certs/signing_key.pem: No such file or directory INSTALL /tmp/B.bNSdI9/BUILD/lttng-modules-2.12.5/lttng-modules-2.12.5/probes/lttng-probe-kvm.ko At main.c:160: - SSL error:02001002:system library:fopen:No such file or directory: crypto/bio/bss_file.c:69 - SSL error:2006D080:BIO routines:BIO_new_file:no such file: crypto/bio/bss_file.c:76 sign-file: certs/signing_key.pem: No such file or directory INSTALL /tmp/B.bNSdI9/BUILD/lttng-modules-2.12.5/lttng-modules-2.12.5/probes/lttng-probe-net.ko At main.c:160: - SSL error:02001002:system library:fopen:No such file or directory: crypto/bio/bss_file.c:69 - SSL error:2006D080:BIO routines:BIO_new_file:no such file: crypto/bio/bss_file.c:76 sign-file: certs/signing_key.pem: No such file or directory INSTALL /tmp/B.bNSdI9/BUILD/lttng-modules-2.12.5/lttng-modules-2.12.5/probes/lttng-probe-module.ko At main.c:160: - SSL error:02001002:system library:fopen:No such file or directory: crypto/bio/bss_file.c:69 - SSL error:2006D080:BIO routines:BIO_new_file:no such file: crypto/bio/bss_file.c:76 sign-file: certs/signing_key.pem: No such file or directory INSTALL /tmp/B.bNSdI9/BUILD/lttng-modules-2.12.5/lttng-modules-2.12.5/probes/lttng-probe-printk.ko At main.c:160: - SSL error:02001002:system library:fopen:No such file or directory: crypto/bio/bss_file.c:69 - SSL error:2006D080:BIO routines:BIO_new_file:no such file: crypto/bio/bss_file.c:76 sign-file: certs/signing_key.pem: No such file or directory INSTALL /tmp/B.bNSdI9/BUILD/lttng-modules-2.12.5/lttng-modules-2.12.5/probes/lttng-probe-power.ko At main.c:160: - SSL error:02001002:system library:fopen:No such file or directory: crypto/bio/bss_file.c:69 - SSL error:2006D080:BIO routines:BIO_new_file:no such file: crypto/bio/bss_file.c:76 sign-file: certs/signing_key.pem: No such file or directory INSTALL /tmp/B.bNSdI9/BUILD/lttng-modules-2.12.5/lttng-modules-2.12.5/probes/lttng-probe-kvm-x86.ko At main.c:160: - SSL error:02001002:system library:fopen:No such file or directory: crypto/bio/bss_file.c:69 - SSL error:2006D080:BIO routines:BIO_new_file:no such file: crypto/bio/bss_file.c:76 sign-file: certs/signing_key.pem: No such file or directory INSTALL /tmp/B.bNSdI9/BUILD/lttng-modules-2.12.5/lttng-modules-2.12.5/probes/lttng-probe-rcu.ko At main.c:160: - SSL error:02001002:system library:fopen:No such file or directory: crypto/bio/bss_file.c:69 - SSL error:2006D080:BIO routines:BIO_new_file:no such file: crypto/bio/bss_file.c:76 sign-file: certs/signing_key.pem: No such file or directory INSTALL /tmp/B.bNSdI9/BUILD/lttng-modules-2.12.5/lttng-modules-2.12.5/probes/lttng-probe-random.ko At main.c:160: - SSL error:02001002:system library:fopen:No such file or directory: crypto/bio/bss_file.c:69 - SSL error:2006D080:BIO routines:BIO_new_file:no such file: crypto/bio/bss_file.c:76 sign-file: certs/signing_key.pem: No such file or directory INSTALL /tmp/B.bNSdI9/BUILD/lttng-modules-2.12.5/lttng-modules-2.12.5/probes/lttng-probe-regmap.ko At main.c:160: - SSL error:02001002:system library:fopen:No such file or directory: crypto/bio/bss_file.c:69 - SSL error:2006D080:BIO routines:BIO_new_file:no such file: crypto/bio/bss_file.c:76 sign-file: certs/signing_key.pem: No such file or directory INSTALL /tmp/B.bNSdI9/BUILD/lttng-modules-2.12.5/lttng-modules-2.12.5/probes/lttng-probe-regulator.ko At main.c:160: - SSL error:02001002:system library:fopen:No such file or directory: crypto/bio/bss_file.c:69 - SSL error:2006D080:BIO routines:BIO_new_file:no such file: crypto/bio/bss_file.c:76 sign-file: certs/signing_key.pem: No such file or directory INSTALL /tmp/B.bNSdI9/BUILD/lttng-modules-2.12.5/lttng-modules-2.12.5/probes/lttng-probe-skb.ko At main.c:160: - SSL error:02001002:system library:fopen:No such file or directory: crypto/bio/bss_file.c:69 - SSL error:2006D080:BIO routines:BIO_new_file:no such file: crypto/bio/bss_file.c:76 sign-file: certs/signing_key.pem: No such file or directory INSTALL /tmp/B.bNSdI9/BUILD/lttng-modules-2.12.5/lttng-modules-2.12.5/probes/lttng-probe-scsi.ko At main.c:160: - SSL error:02001002:system library:fopen:No such file or directory: crypto/bio/bss_file.c:69 - SSL error:2006D080:BIO routines:BIO_new_file:no such file: crypto/bio/bss_file.c:76 sign-file: certs/signing_key.pem: No such file or directory INSTALL /tmp/B.bNSdI9/BUILD/lttng-modules-2.12.5/lttng-modules-2.12.5/probes/lttng-probe-signal.ko At main.c:160: - SSL error:02001002:system library:fopen:No such file or directory: crypto/bio/bss_file.c:69 - SSL error:2006D080:BIO routines:BIO_new_file:no such file: crypto/bio/bss_file.c:76 sign-file: certs/signing_key.pem: No such file or directory INSTALL /tmp/B.bNSdI9/BUILD/lttng-modules-2.12.5/lttng-modules-2.12.5/probes/lttng-probe-sched.ko At main.c:160: - SSL error:02001002:system library:fopen:No such file or directory: crypto/bio/bss_file.c:69 - SSL error:2006D080:BIO routines:BIO_new_file:no such file: crypto/bio/bss_file.c:76 sign-file: certs/signing_key.pem: No such file or directory INSTALL /tmp/B.bNSdI9/BUILD/lttng-modules-2.12.5/lttng-modules-2.12.5/probes/lttng-probe-sock.ko At main.c:160: - SSL error:02001002:system library:fopen:No such file or directory: crypto/bio/bss_file.c:69 - SSL error:2006D080:BIO routines:BIO_new_file:no such file: crypto/bio/bss_file.c:76 sign-file: certs/signing_key.pem: No such file or directory INSTALL /tmp/B.bNSdI9/BUILD/lttng-modules-2.12.5/lttng-modules-2.12.5/probes/lttng-probe-sunrpc.ko At main.c:160: - SSL error:02001002:system library:fopen:No such file or directory: crypto/bio/bss_file.c:69 - SSL error:2006D080:BIO routines:BIO_new_file:no such file: crypto/bio/bss_file.c:76 sign-file: certs/signing_key.pem: No such file or directory INSTALL /tmp/B.bNSdI9/BUILD/lttng-modules-2.12.5/lttng-modules-2.12.5/probes/lttng-probe-ext4.ko At main.c:160: - SSL error:02001002:system library:fopen:No such file or directory: crypto/bio/bss_file.c:69 - SSL error:2006D080:BIO routines:BIO_new_file:no such file: crypto/bio/bss_file.c:76 sign-file: certs/signing_key.pem: No such file or directory INSTALL /tmp/B.bNSdI9/BUILD/lttng-modules-2.12.5/lttng-modules-2.12.5/probes/lttng-probe-udp.ko At main.c:160: - SSL error:02001002:system library:fopen:No such file or directory: crypto/bio/bss_file.c:69 - SSL error:2006D080:BIO routines:BIO_new_file:no such file: crypto/bio/bss_file.c:76 sign-file: certs/signing_key.pem: No such file or directory INSTALL /tmp/B.bNSdI9/BUILD/lttng-modules-2.12.5/lttng-modules-2.12.5/probes/lttng-probe-workqueue.ko At main.c:160: - SSL error:02001002:system library:fopen:No such file or directory: crypto/bio/bss_file.c:69 - SSL error:2006D080:BIO routines:BIO_new_file:no such file: crypto/bio/bss_file.c:76 sign-file: certs/signing_key.pem: No such file or directory INSTALL /tmp/B.bNSdI9/BUILD/lttng-modules-2.12.5/lttng-modules-2.12.5/probes/lttng-probe-v4l2.ko At main.c:160: - SSL error:02001002:system library:fopen:No such file or directory: crypto/bio/bss_file.c:69 - SSL error:2006D080:BIO routines:BIO_new_file:no such file: crypto/bio/bss_file.c:76 sign-file: certs/signing_key.pem: No such file or directory INSTALL /tmp/B.bNSdI9/BUILD/lttng-modules-2.12.5/lttng-modules-2.12.5/probes/lttng-probe-timer.ko At main.c:160: - SSL error:02001002:system library:fopen:No such file or directory: crypto/bio/bss_file.c:69 - SSL error:2006D080:BIO routines:BIO_new_file:no such file: crypto/bio/bss_file.c:76 sign-file: certs/signing_key.pem: No such file or directory INSTALL /tmp/B.bNSdI9/BUILD/lttng-modules-2.12.5/lttng-modules-2.12.5/probes/lttng-probe-x86-exceptions.ko At main.c:160: - SSL error:02001002:system library:fopen:No such file or directory: crypto/bio/bss_file.c:69 - SSL error:2006D080:BIO routines:BIO_new_file:no such file: crypto/bio/bss_file.c:76 sign-file: certs/signing_key.pem: No such file or directory INSTALL /tmp/B.bNSdI9/BUILD/lttng-modules-2.12.5/lttng-modules-2.12.5/probes/lttng-probe-vmscan.ko At main.c:160: - SSL error:02001002:system library:fopen:No such file or directory: crypto/bio/bss_file.c:69 - SSL error:2006D080:BIO routines:BIO_new_file:no such file: crypto/bio/bss_file.c:76 sign-file: certs/signing_key.pem: No such file or directory INSTALL /tmp/B.bNSdI9/BUILD/lttng-modules-2.12.5/lttng-modules-2.12.5/probes/lttng-probe-statedump.ko At main.c:160: - SSL error:02001002:system library:fopen:No such file or directory: crypto/bio/bss_file.c:69 - SSL error:2006D080:BIO routines:BIO_new_file:no such file: crypto/bio/bss_file.c:76 sign-file: certs/signing_key.pem: No such file or directory INSTALL /tmp/B.bNSdI9/BUILD/lttng-modules-2.12.5/lttng-modules-2.12.5/probes/lttng-probe-x86-irq-vectors.ko At main.c:160: - SSL error:02001002:system library:fopen:No such file or directory: crypto/bio/bss_file.c:69 - SSL error:2006D080:BIO routines:BIO_new_file:no such file: crypto/bio/bss_file.c:76 sign-file: certs/signing_key.pem: No such file or directory INSTALL /tmp/B.bNSdI9/BUILD/lttng-modules-2.12.5/lttng-modules-2.12.5/tests/lttng-clock-plugin-test.ko At main.c:160: - SSL error:02001002:system library:fopen:No such file or directory: crypto/bio/bss_file.c:69 - SSL error:2006D080:BIO routines:BIO_new_file:no such file: crypto/bio/bss_file.c:76 sign-file: certs/signing_key.pem: No such file or directory INSTALL /tmp/B.bNSdI9/BUILD/lttng-modules-2.12.5/lttng-modules-2.12.5/probes/lttng-uprobes.ko At main.c:160: - SSL error:02001002:system library:fopen:No such file or directory: crypto/bio/bss_file.c:69 - SSL error:2006D080:BIO routines:BIO_new_file:no such file: crypto/bio/bss_file.c:76 sign-file: certs/signing_key.pem: No such file or directory INSTALL /tmp/B.bNSdI9/BUILD/lttng-modules-2.12.5/lttng-modules-2.12.5/tests/lttng-test.ko At main.c:160: - SSL error:02001002:system library:fopen:No such file or directory: crypto/bio/bss_file.c:69 - SSL error:2006D080:BIO routines:BIO_new_file:no such file: crypto/bio/bss_file.c:76 sign-file: certs/signing_key.pem: No such file or directory INSTALL /tmp/B.bNSdI9/BUILD/lttng-modules-2.12.5/lttng-modules-2.12.5/probes/lttng-probe-writeback.ko At main.c:160: - SSL error:02001002:system library:fopen:No such file or directory: crypto/bio/bss_file.c:69 - SSL error:2006D080:BIO routines:BIO_new_file:no such file: crypto/bio/bss_file.c:76 sign-file: certs/signing_key.pem: No such file or directory INSTALL /tmp/B.bNSdI9/BUILD/lttng-modules-2.12.5/lttng-modules-2.12.5/lttng-tracer.ko At main.c:160: - SSL error:02001002:system library:fopen:No such file or directory: crypto/bio/bss_file.c:69 - SSL error:2006D080:BIO routines:BIO_new_file:no such file: crypto/bio/bss_file.c:76 sign-file: certs/signing_key.pem: No such file or directory make[1]: Entering directory '/usr/src/linux-5.10-5.10.34' DEPMOD 5.10.34-1 Warning: modules_install: missing 'System.map' file. Skipping depmod. make[1]: Leaving directory '/usr/src/linux-5.10-5.10.34' + /usr/bin/make -Otarget -j9 clean 'KERNELDIR=/usr/src/linux' /usr/bin/make -C /usr/src/linux M=/tmp/B.bNSdI9/BUILD/lttng-modules-2.12.5/lttng-modules-2.12.5 clean make[1]: Entering directory '/usr/src/linux-5.12.1' CLEAN /tmp/B.bNSdI9/BUILD/lttng-modules-2.12.5/lttng-modules-2.12.5/Module.symvers make[1]: Leaving directory '/usr/src/linux-5.12.1' + /usr/bin/make -Otarget -j9 'KERNELDIR=/usr/src/linux' /usr/bin/make -C /usr/src/linux M=/tmp/B.bNSdI9/BUILD/lttng-modules-2.12.5/lttng-modules-2.12.5 CONFIG_LTTNG=m CONFIG_LTTNG_CLOCK_PLUGIN_TEST=m modules CC [M] /tmp/B.bNSdI9/BUILD/lttng-modules-2.12.5/lttng-modules-2.12.5/lttng-ring-buffer-metadata-client.o CC [M] /tmp/B.bNSdI9/BUILD/lttng-modules-2.12.5/lttng-modules-2.12.5/lttng-ring-buffer-metadata-mmap-client.o CC [M] /tmp/B.bNSdI9/BUILD/lttng-modules-2.12.5/lttng-modules-2.12.5/lttng-ring-buffer-client-mmap-discard.o CC [M] /tmp/B.bNSdI9/BUILD/lttng-modules-2.12.5/lttng-modules-2.12.5/lttng-ring-buffer-client-overwrite.o CC [M] /tmp/B.bNSdI9/BUILD/lttng-modules-2.12.5/lttng-modules-2.12.5/tests/probes/lttng-test.o CC [M] /tmp/B.bNSdI9/BUILD/lttng-modules-2.12.5/lttng-modules-2.12.5/lttng-ring-buffer-client-discard.o CC [M] /tmp/B.bNSdI9/BUILD/lttng-modules-2.12.5/lttng-modules-2.12.5/lttng-ring-buffer-client-mmap-overwrite.o CC [M] /tmp/B.bNSdI9/BUILD/lttng-modules-2.12.5/lttng-modules-2.12.5/lib/ringbuffer/ring_buffer_backend.o CC [M] /tmp/B.bNSdI9/BUILD/lttng-modules-2.12.5/lttng-modules-2.12.5/tests/clock-plugin/lttng-clock-plugin-test.o CC [M] /tmp/B.bNSdI9/BUILD/lttng-modules-2.12.5/lttng-modules-2.12.5/probes/lttng-probe-kmem.o In file included from /tmp/B.bNSdI9/BUILD/lttng-modules-2.12.5/lttng-modules-2.12.5/probes/../probes/define_trace.h:87, from /tmp/B.bNSdI9/BUILD/lttng-modules-2.12.5/lttng-modules-2.12.5/probes/../instrumentation/events/lttng-module/kmem.h:338, from /tmp/B.bNSdI9/BUILD/lttng-modules-2.12.5/lttng-modules-2.12.5/probes/lttng-probe-kmem.c:35: /tmp/B.bNSdI9/BUILD/lttng-modules-2.12.5/lttng-modules-2.12.5/probes/../probes/lttng-tracepoint-event-impl.h:131:6: error: conflicting types for 'trace_kmem_cache_free' 131 | void trace_##_name(_proto); | ^~~~~~ /tmp/B.bNSdI9/BUILD/lttng-modules-2.12.5/lttng-modules-2.12.5/probes/../probes/lttng-tracepoint-event-impl.h:96:2: note: in expansion of macro 'LTTNG_TRACEPOINT_EVENT_INSTANCE_MAP' 96 | LTTNG_TRACEPOINT_EVENT_INSTANCE_MAP(template, name, name, PARAMS(proto), PARAMS(args)) | ^~~~~~~~~~~~~~~~~~~~~~~~~~~~~~~~~~~ /tmp/B.bNSdI9/BUILD/lttng-modules-2.12.5/lttng-modules-2.12.5/probes/../instrumentation/events/lttng-module/kmem.h:111:1: note: in expansion of macro 'LTTNG_TRACEPOINT_EVENT_INSTANCE' 111 | LTTNG_TRACEPOINT_EVENT_INSTANCE(kmem_free, kmem_cache_free, | ^~~~~~~~~~~~~~~~~~~~~~~~~~~~~~~ In file included from ./include/trace/events/kmem.h:9, from /tmp/B.bNSdI9/BUILD/lttng-modules-2.12.5/lttng-modules-2.12.5/probes/lttng-probe-kmem.c:24: ./include/linux/tracepoint.h:235:21: note: previous definition of 'trace_kmem_cache_free' was here 235 | static inline void trace_##name(proto) \ | ^~~~~~ ./include/linux/tracepoint.h:409:2: note: in expansion of macro '__DECLARE_TRACE' 409 | __DECLARE_TRACE(name, PARAMS(proto), PARAMS(args), \ | ^~~~~~~~~~~~~~~ ./include/linux/tracepoint.h:543:2: note: in expansion of macro 'DECLARE_TRACE' 543 | DECLARE_TRACE(name, PARAMS(proto), PARAMS(args)) | ^~~~~~~~~~~~~ ./include/trace/events/kmem.h:138:1: note: in expansion of macro 'TRACE_EVENT' 138 | TRACE_EVENT(kmem_cache_free, | ^~~~~~~~~~~ make[3]: *** [scripts/Makefile.build:271: /tmp/B.bNSdI9/BUILD/lttng-modules-2.12.5/lttng-modules-2.12.5/probes/lttng-probe-kmem.o] Error 1 make[3]: *** Waiting for unfinished jobs.... LD [M] /tmp/B.bNSdI9/BUILD/lttng-modules-2.12.5/lttng-modules-2.12.5/tests/lttng-test.o LD [M] /tmp/B.bNSdI9/BUILD/lttng-modules-2.12.5/lttng-modules-2.12.5/tests/lttng-clock-plugin-test.o CC [M] /tmp/B.bNSdI9/BUILD/lttng-modules-2.12.5/lttng-modules-2.12.5/probes/lttng-probe-irq.o CC [M] /tmp/B.bNSdI9/BUILD/lttng-modules-2.12.5/lttng-modules-2.12.5/probes/lttng-probe-sched.o CC [M] /tmp/B.bNSdI9/BUILD/lttng-modules-2.12.5/lttng-modules-2.12.5/lttng-string-utils.o CC [M] /tmp/B.bNSdI9/BUILD/lttng-modules-2.12.5/lttng-modules-2.12.5/lib/ringbuffer/ring_buffer_vfs.o CC [M] /tmp/B.bNSdI9/BUILD/lttng-modules-2.12.5/lttng-modules-2.12.5/probes/lttng-probe-timer.o make[2]: *** [scripts/Makefile.build:514: /tmp/B.bNSdI9/BUILD/lttng-modules-2.12.5/lttng-modules-2.12.5/probes] Error 2 make[2]: *** Waiting for unfinished jobs.... CC [M] /tmp/B.bNSdI9/BUILD/lttng-modules-2.12.5/lttng-modules-2.12.5/lib/ringbuffer/ring_buffer_iterator.o CC [M] /tmp/B.bNSdI9/BUILD/lttng-modules-2.12.5/lttng-modules-2.12.5/lttng-clock.o CC [M] /tmp/B.bNSdI9/BUILD/lttng-modules-2.12.5/lttng-modules-2.12.5/lib/ringbuffer/ring_buffer_splice.o CC [M] /tmp/B.bNSdI9/BUILD/lttng-modules-2.12.5/lttng-modules-2.12.5/lib/prio_heap/lttng_prio_heap.o CC [M] /tmp/B.bNSdI9/BUILD/lttng-modules-2.12.5/lttng-modules-2.12.5/lib/ringbuffer/ring_buffer_frontend.o CC [M] /tmp/B.bNSdI9/BUILD/lttng-modules-2.12.5/lttng-modules-2.12.5/lib/../wrapper/splice.o CC [M] /tmp/B.bNSdI9/BUILD/lttng-modules-2.12.5/lttng-modules-2.12.5/lttng-abi.o CC [M] /tmp/B.bNSdI9/BUILD/lttng-modules-2.12.5/lttng-modules-2.12.5/lttng-probes.o CC [M] /tmp/B.bNSdI9/BUILD/lttng-modules-2.12.5/lttng-modules-2.12.5/lib/ringbuffer/ring_buffer_mmap.o LD [M] /tmp/B.bNSdI9/BUILD/lttng-modules-2.12.5/lttng-modules-2.12.5/lib/lttng-lib-ring-buffer.o CC [M] /tmp/B.bNSdI9/BUILD/lttng-modules-2.12.5/lttng-modules-2.12.5/lttng-events.o make[1]: *** [Makefile:1851: /tmp/B.bNSdI9/BUILD/lttng-modules-2.12.5/lttng-modules-2.12.5] Error 2 make: *** [Makefile:153: modules] Error 2 error: Bad exit status from /tmp/B.bNSdI9/BUILD/tmp/rpm-tmp.NNypre (%build) RPM build errors: Could not canonicalize hostname: naiad Bad exit status from /tmp/B.bNSdI9/BUILD/tmp/rpm-tmp.NNypre (%build) ended at: Mon May 3 04:14:29 2021, done in 0:08:11.556035 error: No files produced. + chmod -R u+rwX /tmp/B.bNSdI9/BUILD + rm -rf /tmp/B.bNSdI9/tmp /tmp/B.bNSdI9/BUILD + rm -rf /tmp/B.bNSdI9 Begin-PLD-Builder-Info Build-Time: user:1071.41s sys:116.59s real:513.72s (faults io:101 non-io:21150570) End-PLD-Builder-Info
[Back to list of logs] [View rpm -qa of builder]