FailedOk

th/SRPMS[OK]
th/x32[OK]
th/i686[OK]
th/x86_64[OK]

ac/SRPMS[OK]
ac/i386[OK]
ac/i586[OK]
ac/i686[OK]
ac/alpha[OK]
ac/amd64[OK]
ac/athlon[OK]
ac/ppc[OK]
ac/sparc[OK]
ac/sparc64[OK]

Advanced Search
main()
Powered by PLD Linux
(c) 2002-2021 PLD Team
$Revision: 1.37 $
Powered by Star Treck.
Your IP: 18.204.2.146

nagios-plugin-check_rbl 493907ef-af18-48ce-b883-9b60902916ed

Status:Failed
Source URL:https://buildlogs.pld-linux.org/pld/th/x32/FAIL/nagios-plugin-check_rbl,493907ef-af18-48ce-b883-9b60902916ed.bz2
text/plain URL:View!
full text:View!
rpm -qa of builder:View!
Date:2021/05/29 23:33:59
Runtime:0:00:01.414871

Toc:

  • error 1
  • rpm: error: Failed build dependencies:
  • error 2
  • rpm: error: Failed build dependencies:
  • prep
  • Executing(%prep): /bin/sh -e /tmp/B.uxutKF/BUILD/tmp/rpm-tmp.PeRyJI
  • build
  • Executing(%build): /bin/sh -e /tmp/B.uxutKF/BUILD/tmp/rpm-tmp.faNMNV
  • error 3
  • # Error: Can't locate Monitoring/Plugin.pm in @INC (you may need to install the Monitoring::Plugin module) (@INC contains: /tmp/B.uxutKF/BUILD/check_rbl-1.6.1/inc /tmp/B.uxutKF/BUILD/check_rbl-1.6.1/blib/lib /tmp/B.uxutKF/BUILD/check_rbl-1.6.1/blib/arch /usr/local/lib/perl5/5.32.0/x86_64-pld-linux-gnux32-thread-multi /usr/local/share/perl5 /usr/libx32/perl5/vendor_perl/5.32.0/x86_64-pld-linux-gnux32-thread-multi /usr/share/perl5/vendor_perl /usr/libx32/perl5/5.32.1/x86_64-pld-linux-gnux32-thread-multi /usr/share/perl5/5.32.1 .) at t/00_modules.t line 12.
  • error 4
  • # Error: Can't locate Monitoring/Plugin/Getopt.pm in @INC (you may need to install the Monitoring::Plugin::Getopt module) (@INC contains: /tmp/B.uxutKF/BUILD/check_rbl-1.6.1/inc /tmp/B.uxutKF/BUILD/check_rbl-1.6.1/blib/lib /tmp/B.uxutKF/BUILD/check_rbl-1.6.1/blib/arch /usr/local/lib/perl5/5.32.0/x86_64-pld-linux-gnux32-thread-multi /usr/local/share/perl5 /usr/libx32/perl5/vendor_perl/5.32.0/x86_64-pld-linux-gnux32-thread-multi /usr/share/perl5/vendor_perl /usr/libx32/perl5/5.32.1/x86_64-pld-linux-gnux32-thread-multi /usr/share/perl5/5.32.1 .) at t/00_modules.t line 18.
  • error 5
  • # Error: Can't locate Monitoring/Plugin/Threshold.pm in @INC (you may need to install the Monitoring::Plugin::Threshold module) (@INC contains: /tmp/B.uxutKF/BUILD/check_rbl-1.6.1/inc /tmp/B.uxutKF/BUILD/check_rbl-1.6.1/blib/lib /tmp/B.uxutKF/BUILD/check_rbl-1.6.1/blib/arch /usr/local/lib/perl5/5.32.0/x86_64-pld-linux-gnux32-thread-multi /usr/local/share/perl5 /usr/libx32/perl5/vendor_perl/5.32.0/x86_64-pld-linux-gnux32-thread-multi /usr/share/perl5/vendor_perl /usr/libx32/perl5/5.32.1/x86_64-pld-linux-gnux32-thread-multi /usr/share/perl5/5.32.1 .) at t/00_modules.t line 24.
  • error 6
  • # Error: Can't locate Net/IP.pm in @INC (you may need to install the Net::IP module) (@INC contains: /tmp/B.uxutKF/BUILD/check_rbl-1.6.1/inc /tmp/B.uxutKF/BUILD/check_rbl-1.6.1/blib/lib /tmp/B.uxutKF/BUILD/check_rbl-1.6.1/blib/arch /usr/local/lib/perl5/5.32.0/x86_64-pld-linux-gnux32-thread-multi /usr/local/share/perl5 /usr/libx32/perl5/vendor_perl/5.32.0/x86_64-pld-linux-gnux32-thread-multi /usr/share/perl5/vendor_perl /usr/libx32/perl5/5.32.1/x86_64-pld-linux-gnux32-thread-multi /usr/share/perl5/5.32.1 .) at t/00_modules.t line 44.
  • error 7
  • # Error: Can't locate Net/IP.pm in @INC (you may need to install the Net::IP module) (@INC contains: /tmp/B.uxutKF/BUILD/check_rbl-1.6.1/inc /tmp/B.uxutKF/BUILD/check_rbl-1.6.1/blib/lib /tmp/B.uxutKF/BUILD/check_rbl-1.6.1/blib/arch /usr/local/lib/perl5/5.32.0/x86_64-pld-linux-gnux32-thread-multi /usr/local/share/perl5 /usr/libx32/perl5/vendor_perl/5.32.0/x86_64-pld-linux-gnux32-thread-multi /usr/share/perl5/vendor_perl /usr/libx32/perl5/5.32.1/x86_64-pld-linux-gnux32-thread-multi /usr/share/perl5/5.32.1 .) at blib/script/check_rbl line 29.
  • error 8
  • error: Bad exit status from /tmp/B.uxutKF/BUILD/tmp/rpm-tmp.faNMNV (%build)
  • error 9
  • RPM build errors:
  • error 10
  • error: No files produced.

Content:

checking if we should skip the build
started at: Sat May 29 23:33:44 2021
killing old processes on a builder
sending signal 9 to pid -1
cleaning up /tmp
fetching https://srcbuilder.pld-linux.org/th//srpms/493907ef-af18-48ce-b883-9b60902916ed/nagios-plugin-check_rbl-1.6.1-1.src.rpm
fetched 61898 bytes, 190.4 K/s
installing srpm: nagios-plugin-check_rbl-1.6.1-1.src.rpm
+ install -d /tmp/B.uxutKF/BUILD /tmp/B.uxutKF/RPMS
+ LC_ALL=en_US.UTF-8
+ rpm -qp --changelog nagios-plugin-check_rbl-1.6.1-1.src.rpm
* Sat May 29 2021 PLD Linux Team <feedback@pld-linux.org>
- For complete changelog see: http://git.pld-linux.org/?p=packages/nagios-plugin-check_rbl.git;a=log;h=master
* Thu May 27 2021 Arkadiusz Miśkiewicz <arekm@maven.pl> fc06898
- up to 1.6.1 * Thu May 27 2021 Arkadiusz Miśkiewicz <arekm@maven.pl> 5c964f5
- up to 1.6.0 * Thu May 27 2021 Arkadiusz Miśkiewicz <arekm@maven.pl> 2dcc104
- rel 2; use ini from package (which is better maintained than our own list) * Thu May 27 2021 Arkadiusz Miśkiewicz <arekm@maven.pl> 6804bfc
- up to 1.5.7 * Sat Jan 25 2020 Jan Rękorajski <baggins@pld-linux.org> bfabe27
- drop obsolete and outdated manual inclusion of rpm macros * Wed Jan 25 2017 Arkadiusz Miśkiewicz <arekm@maven.pl> 23f0451
- up to 1.3.8; works now (previous version had broken resolving and reported incorrectly that everything is ok) * Sun Dec 07 2014 Elan Ruusamäe <glen@delfi.ee> b481f33
- up to 1.3.6 * Thu Dec 04 2014 Elan Ruusamäe <glen@delfi.ee> ec95435
- up to 1.3.5 * Thu Dec 04 2014 Elan Ruusamäe <glen@delfi.ee> 8c30dbe
- up to 1.3.4 * Thu Dec 04 2014 Elan Ruusamäe <glen@delfi.ee> e426833
- 1.3.3, parameter validation * Thu Dec 04 2014 Elan Ruusamäe <glen@delfi.ee> 1fb33db
- up to 1.3.1, disable embedded Perl * Thu Dec 04 2014 Elan Ruusamäe <glen@delfi.ee> 2c82628
- up to 1.3.0, adds whitelisting support * Sun Apr 03 2011 Elan Ruusamäe <glen@pld-linux.org> afac954
- cleanups * Sun Apr 03 2011 Elan Ruusamäe <glen@pld-linux.org> 1953d4f
- GPL version * Sun Apr 03 2011 Adam Gołębiowski <adamg@pld-linux.org> eddba0c
- updated to 1.2.2 * Thu Apr 15 2010 Elan Ruusamäe <glen@pld-linux.org> 4012ac6
- fix killing of $VERSION; rel 2 * Fri Apr 09 2010 Elan Ruusamäe <glen@pld-linux.org> b9cbc94
- up to 1.2.0 * Fri Apr 09 2010 Elan Ruusamäe <glen@pld-linux.org> a78df07
- mdns submitted too * Tue Apr 06 2010 Elan Ruusamäe <glen@pld-linux.org> b62c0cc
- perlcritic taught me not to get fooled by lexical scope in foreach (page 108 of PBP) * Tue Apr 06 2010 Elan Ruusamäe <glen@pld-linux.org> 53949b5
- release 5 + rpm -Uhv --nodeps --define '_topdir /tmp/B.uxutKF' --define '_specdir %{_topdir}' --define '_sourcedir %{_specdir}' --define '_rpmdir %{_topdir}/RPMS' --define '_builddir %{_topdir}/BUILD' nagios-plugin-check_rbl-1.6.1-1.src.rpm Updating / installing... nagios-plugin-check_rbl-1.6.1-1 ######################################## + rm -f nagios-plugin-check_rbl-1.6.1-1.src.rpm + install -m 700 -d /tmp/B.uxutKF/BUILD/tmp + TMPDIR=/tmp/B.uxutKF/BUILD/tmp + exec nice -n 0 rpmbuild -bp --short-circuit --nodeps --define '_topdir /tmp/B.uxutKF' --define '_specdir %{_topdir}' --define '_sourcedir %{_specdir}' --define '_rpmdir %{_topdir}/RPMS' --define '_builddir %{_topdir}/BUILD' --target x32-pld-linux --define 'prep exit 0' /tmp/B.uxutKF/nagios-plugin-check_rbl.spec warning: Could not canonicalize hostname: naiad Building target platforms: x32-pld-linux Building for target x32-pld-linux checking BuildConflict-ing packages no BuildConflicts found checking BR rpm: warning: Could not canonicalize hostname: naiad rpm: error: Failed build dependencies: rpm: perl-Data-Validate-Domain is needed by nagios-plugin-check_rbl-1.6.1-1.noarch rpm: perl-Data-Validate-IP is needed by nagios-plugin-check_rbl-1.6.1-1.noarch rpm: perl-Nagios-Plugin >= 0.31 is needed by nagios-plugin-check_rbl-1.6.1-1.noarch rpm: Building target platforms: x32-pld-linux rpm: Building for target x32-pld-linux updating poldek cache... ready is up to date th is up to date th is up to date th-ready is up to date th-ready is up to date th-test is up to date th-test is up to date checking conflicting packages in BRed packages poldek: Loading [pndir]ready... poldek: Loading [pndir]th-test... poldek: Loading [pndir]th-test... poldek: Loading [pndir]th-ready... poldek: Loading [pndir]th-ready... poldek: Loading [pndir]th... poldek: Loading [pndir]th... poldek: 31073 packages read poldek: Removed 4255 duplicate packages from available set poldek: Processing dependencies... poldek: perl-Nagios-Plugin-0.36-1.noarch marks perl-Math-Calc-Units-1.07-1.noarch (cap perl(Math::Calc::Units)) poldek: perl-Data-Validate-Domain-0.10-1.noarch marks perl-Net-Domain-TLD-1.70-2.noarch (cap perl(Net::Domain::TLD)) poldek: There are 5 packages to install (2 marked by dependencies): poldek: A perl-Data-Validate-Domain-0.10-1.noarch poldek: A perl-Data-Validate-IP-0.24-1.noarch perl-Math-Calc-Units-1.07-1.noarch poldek: A perl-Nagios-Plugin-0.36-1.noarch perl-Net-Domain-TLD-1.70-2.noarch poldek: This operation will use 242.7KB of disk space. poldek: Need to get 139.5KB of archives (139.5KB to download). poldek: poldek: Retrieving [1/5] th::perl-Net-Domain-TLD-1.70-2.noarch.rpm.................................done poldek: Retrieving [2/5] th::perl-Data-Validate-Domain-0.10-1.noarch.rpm..............................done poldek: Retrieving [3/5] th::perl-Data-Validate-IP-0.24-1.noarch.rpm...............................done poldek: Retrieving [4/5] th::perl-Math-Calc-Units-1.07-1.noarch.rpm................................done poldek: Retrieving [5/5] th::perl-Nagios-Plugin-0.36-1.noarch.rpm..................................done poldek: perl-Net-Domain-TLD-1.70-2.noarch.rpm: digests OK poldek: perl-Data-Validate-Domain-0.10-1.noarch.rpm: digests OK poldek: perl-Data-Validate-IP-0.24-1.noarch.rpm: digests OK poldek: perl-Math-Calc-Units-1.07-1.noarch.rpm: digests OK poldek: perl-Nagios-Plugin-0.36-1.noarch.rpm: digests OK poldek: Executing pm-command.sh --upgrade -vh --test --root / --define _check_dirname_deps 0... poldek: warning: /root/.cache/poldek/ftp_ftp1.pld-linux.org.dists.th.PLD.noarch.RPMS/perl-Net-Domain-TLD-1.70-2.noarch.rpm: Header V4 DSA/SHA1 Signature, key ID e4f1bc2d: NOKEY poldek: Verifying... ######################################## poldek: Preparing... ######################################## no conflicts found checking BR rpm: warning: Could not canonicalize hostname: naiad rpm: error: Failed build dependencies: rpm: perl-Data-Validate-Domain is needed by nagios-plugin-check_rbl-1.6.1-1.noarch rpm: perl-Data-Validate-IP is needed by nagios-plugin-check_rbl-1.6.1-1.noarch rpm: perl-Nagios-Plugin >= 0.31 is needed by nagios-plugin-check_rbl-1.6.1-1.noarch rpm: Building target platforms: x32-pld-linux rpm: Building for target x32-pld-linux installing BR: perl\-Nagios\-Plugin perl\-Data\-Validate\-Domain perl\-Data\-Validate\-IP + poldek --noask --caplookup -Q -v '--ignore=hhvm-*' '--ignore=php4-*' '--ignore=php52-*' '--ignore=php54-*' '--ignore=php55-*' '--ignore=php56-*' '--ignore=php70-*' '--ignore=php71-*' '--ignore=php72-*' '--ignore=php73-*' '--ignore=php74-*' '--ignore=php80-*' --upgrade perl-Nagios-Plugin perl-Data-Validate-Domain perl-Data-Validate-IP Loading [pndir]ready... Loading [pndir]th-test... Loading [pndir]th-test... Loading [pndir]th-ready... Loading [pndir]th-ready... Loading [pndir]th... Loading [pndir]th... 31073 packages read Removed 4255 duplicate packages from available set Processing dependencies... perl-Data-Validate-Domain-0.10-1.noarch marks perl-Net-Domain-TLD-1.70-2.noarch (cap perl(Net::Domain::TLD)) perl-Nagios-Plugin-0.36-1.noarch marks perl-Math-Calc-Units-1.07-1.noarch (cap perl(Math::Calc::Units)) There are 5 packages to install (2 marked by dependencies): A perl-Data-Validate-Domain-0.10-1.noarch A perl-Data-Validate-IP-0.24-1.noarch perl-Math-Calc-Units-1.07-1.noarch A perl-Nagios-Plugin-0.36-1.noarch perl-Net-Domain-TLD-1.70-2.noarch This operation will use 242.7KB of disk space. perl-Data-Validate-IP-0.24-1.noarch.rpm: digests OK perl-Data-Validate-Domain-0.10-1.noarch.rpm: digests OK perl-Nagios-Plugin-0.36-1.noarch.rpm: digests OK perl-Net-Domain-TLD-1.70-2.noarch.rpm: digests OK perl-Math-Calc-Units-1.07-1.noarch.rpm: digests OK Need to get 139.5KB of archives. perl-Net-Domain-TLD-1.70-2.noarch.rpm: digests OK perl-Data-Validate-Domain-0.10-1.noarch.rpm: digests OK perl-Data-Validate-IP-0.24-1.noarch.rpm: digests OK perl-Math-Calc-Units-1.07-1.noarch.rpm: digests OK perl-Nagios-Plugin-0.36-1.noarch.rpm: digests OK Executing pm-command.sh --upgrade -vh --root / --define _check_dirname_deps 0... warning: /root/.cache/poldek/ftp_ftp1.pld-linux.org.dists.th.PLD.noarch.RPMS/perl-Net-Domain-TLD-1.70-2.noarch.rpm: Header V4 DSA/SHA1 Signature, key ID e4f1bc2d: NOKEY Verifying... ######################################## Preparing... ######################################## Updating / installing... perl-Math-Calc-Units-0:1.07-1 ######################################## perl-Net-Domain-TLD-1.70-2 ######################################## perl-Data-Validate-Domain-0.10-1 ######################################## perl-Nagios-Plugin-0:0.36-1 ######################################## perl-Data-Validate-IP-0.24-1 ######################################## building RPM using: set -ex; : build-id: 493907ef-af18-48ce-b883-9b60902916ed; TMPDIR=/tmp/B.uxutKF/BUILD/tmp exec nice -n 0 rpmbuild -bb --define '_smp_mflags -j9' --define '_make_opts -Otarget' --define '_pld_builder 1' --define '_topdir /tmp/B.uxutKF' --define '_specdir %{_topdir}' --define '_sourcedir %{_specdir}' --define '_rpmdir %{_topdir}/RPMS' --define '_builddir %{_topdir}/BUILD' --target x32-pld-linux /tmp/B.uxutKF/nagios-plugin-check_rbl.spec + : build-id: 493907ef-af18-48ce-b883-9b60902916ed + TMPDIR=/tmp/B.uxutKF/BUILD/tmp + exec nice -n 0 rpmbuild -bb --define '_smp_mflags -j9' --define '_make_opts -Otarget' --define '_pld_builder 1' --define '_topdir /tmp/B.uxutKF' --define '_specdir %{_topdir}' --define '_sourcedir %{_specdir}' --define '_rpmdir %{_topdir}/RPMS' --define '_builddir %{_topdir}/BUILD' --target x32-pld-linux /tmp/B.uxutKF/nagios-plugin-check_rbl.spec warning: Could not canonicalize hostname: naiad Building target platforms: x32-pld-linux Building for target x32-pld-linux Executing(%prep): /bin/sh -e /tmp/B.uxutKF/BUILD/tmp/rpm-tmp.PeRyJI + umask 022 + cd /tmp/B.uxutKF/BUILD + cd /tmp/B.uxutKF/BUILD + rm -rf check_rbl-1.6.1 + /bin/gzip -dc /tmp/B.uxutKF/check_rbl-1.6.1.tar.gz + /bin/tar -xof - + STATUS=0 + '[' 0 -ne 0 ']' + cd check_rbl-1.6.1 + /bin/chmod -Rf a+rX,u+w,g-w,o-w . + RPM_EC=0 + jobs -p + exit 0 Executing(%build): /bin/sh -e /tmp/B.uxutKF/BUILD/tmp/rpm-tmp.faNMNV HOME=/home/users/builder PATH=/home/users/builder/GNUstep/Tools:/bin:/usr/bin:/usr/local/bin TMPDIR=/tmp/B.uxutKF/BUILD/tmp + umask 022 + cd /tmp/B.uxutKF/BUILD + cd check_rbl-1.6.1 + /usr/bin/perl Makefile.PL 'INSTALLVENDORSCRIPT=/usr/lib/nagios/plugins' 'INSTALLDIRS=vendor' Warning: prerequisite Data::Validate::Domain 0.12 not found. We have 0.10. Warning: prerequisite Monitoring::Plugin 0 not found. Warning: prerequisite Monitoring::Plugin::Getopt 0 not found. Warning: prerequisite Monitoring::Plugin::Threshold 0 not found. Warning: prerequisite Net::IP 0 not found. Checking if your kit is complete... Warning: the following files are missing in your kit: .travis.yml Please inform the author. Generating a Unix-style Makefile Writing Makefile for check_rbl Writing MYMETA.yml and MYMETA.json + /usr/bin/make -Otarget -j9 cp check_rbl.pod blib/lib/check_rbl.pod cp check_rbl blib/script/check_rbl "/usr/bin/perl5.32.1" "-Iinc" -MExtUtils::MY -e 'MY->fixin(shift)' -- blib/script/check_rbl Manifying 1 pod document + /usr/bin/make -Otarget -j9 test PERL_DL_NONLAZY=1 "/usr/bin/perl5.32.1" "-MExtUtils::Command::MM" "-MTest::Harness" "-e" "undef *Test::Harness::Switches; test_harness(0, 'inc', 'blib/lib', 'blib/arch')" t/*.t # Failed test 'use Monitoring::Plugin;' # at t/00_modules.t line 12. # Tried to use 'Monitoring::Plugin'. # Error: Can't locate Monitoring/Plugin.pm in @INC (you may need to install the Monitoring::Plugin module) (@INC contains: /tmp/B.uxutKF/BUILD/check_rbl-1.6.1/inc /tmp/B.uxutKF/BUILD/check_rbl-1.6.1/blib/lib /tmp/B.uxutKF/BUILD/check_rbl-1.6.1/blib/arch /usr/local/lib/perl5/5.32.0/x86_64-pld-linux-gnux32-thread-multi /usr/local/share/perl5 /usr/libx32/perl5/vendor_perl/5.32.0/x86_64-pld-linux-gnux32-thread-multi /usr/share/perl5/vendor_perl /usr/libx32/perl5/5.32.1/x86_64-pld-linux-gnux32-thread-multi /usr/share/perl5/5.32.1 .) at t/00_modules.t line 12. # BEGIN failed--compilation aborted at t/00_modules.t line 12. # Failed test 'Monitoring::Plugin->can('new')' # at t/00_modules.t line 13. # Monitoring::Plugin->can('new') failed # Failed test 'Monitoring::Plugin->can('nagios_exit')' # at t/00_modules.t line 14. # Monitoring::Plugin->can('nagios_exit') failed # Failed test 'Monitoring::Plugin->can('add_perfdata')' # at t/00_modules.t line 15. # Monitoring::Plugin->can('add_perfdata') failed # Failed test 'Monitoring::Plugin->can('perfdata')' # at t/00_modules.t line 16. # Monitoring::Plugin->can('perfdata') failed # Failed test 'use Monitoring::Plugin::Getopt;' # at t/00_modules.t line 18. # Tried to use 'Monitoring::Plugin::Getopt'. # Error: Can't locate Monitoring/Plugin/Getopt.pm in @INC (you may need to install the Monitoring::Plugin::Getopt module) (@INC contains: /tmp/B.uxutKF/BUILD/check_rbl-1.6.1/inc /tmp/B.uxutKF/BUILD/check_rbl-1.6.1/blib/lib /tmp/B.uxutKF/BUILD/check_rbl-1.6.1/blib/arch /usr/local/lib/perl5/5.32.0/x86_64-pld-linux-gnux32-thread-multi /usr/local/share/perl5 /usr/libx32/perl5/vendor_perl/5.32.0/x86_64-pld-linux-gnux32-thread-multi /usr/share/perl5/vendor_perl /usr/libx32/perl5/5.32.1/x86_64-pld-linux-gnux32-thread-multi /usr/share/perl5/5.32.1 .) at t/00_modules.t line 18. # BEGIN failed--compilation aborted at t/00_modules.t line 18. # Failed test 'Monitoring::Plugin::Getopt->can('new')' # at t/00_modules.t line 19. # Monitoring::Plugin::Getopt->can('new') failed # Failed test 'Monitoring::Plugin::Getopt->can('arg')' # at t/00_modules.t line 20. # Monitoring::Plugin::Getopt->can('arg') failed # Failed test 'Monitoring::Plugin::Getopt->can('getopts')' # at t/00_modules.t line 21. # Monitoring::Plugin::Getopt->can('getopts') failed # Failed test 'Monitoring::Plugin::Getopt->can('get')' # at t/00_modules.t line 22. # Monitoring::Plugin::Getopt->can('get') failed # Failed test 'use Monitoring::Plugin::Threshold;' # at t/00_modules.t line 24. # Tried to use 'Monitoring::Plugin::Threshold'. # Error: Can't locate Monitoring/Plugin/Threshold.pm in @INC (you may need to install the Monitoring::Plugin::Threshold module) (@INC contains: /tmp/B.uxutKF/BUILD/check_rbl-1.6.1/inc /tmp/B.uxutKF/BUILD/check_rbl-1.6.1/blib/lib /tmp/B.uxutKF/BUILD/check_rbl-1.6.1/blib/arch /usr/local/lib/perl5/5.32.0/x86_64-pld-linux-gnux32-thread-multi /usr/local/share/perl5 /usr/libx32/perl5/vendor_perl/5.32.0/x86_64-pld-linux-gnux32-thread-multi /usr/share/perl5/vendor_perl /usr/libx32/perl5/5.32.1/x86_64-pld-linux-gnux32-thread-multi /usr/share/perl5/5.32.1 .) at t/00_modules.t line 24. # BEGIN failed--compilation aborted at t/00_modules.t line 24. # Failed test 'Monitoring::Plugin::Threshold->can('new')' # at t/00_modules.t line 25. # Monitoring::Plugin::Threshold->can('new') failed # Failed test 'Monitoring::Plugin::Threshold->can('set_thresholds')' # at t/00_modules.t line 26. # Monitoring::Plugin::Threshold->can('set_thresholds') failed # Failed test 'use Net::IP;' # at t/00_modules.t line 44. # Tried to use 'Net::IP'. # Error: Can't locate Net/IP.pm in @INC (you may need to install the Net::IP module) (@INC contains: /tmp/B.uxutKF/BUILD/check_rbl-1.6.1/inc /tmp/B.uxutKF/BUILD/check_rbl-1.6.1/blib/lib /tmp/B.uxutKF/BUILD/check_rbl-1.6.1/blib/arch /usr/local/lib/perl5/5.32.0/x86_64-pld-linux-gnux32-thread-multi /usr/local/share/perl5 /usr/libx32/perl5/vendor_perl/5.32.0/x86_64-pld-linux-gnux32-thread-multi /usr/share/perl5/vendor_perl /usr/libx32/perl5/5.32.1/x86_64-pld-linux-gnux32-thread-multi /usr/share/perl5/5.32.1 .) at t/00_modules.t line 44. # BEGIN failed--compilation aborted at t/00_modules.t line 44. # Failed test 'Net::IP->can('ip_expand_address')' # at t/00_modules.t line 45. # Net::IP->can('ip_expand_address') failed # Looks like you failed 15 tests of 33. t/00_modules.t ..... Dubious, test returned 15 (wstat 3840, 0xf00) Failed 15/33 subtests # Failed test 'require 'blib/script/check_rbl';' # at t/01_validation.t line 15. # Tried to require ''blib/script/check_rbl''. # Error: Can't locate Net/IP.pm in @INC (you may need to install the Net::IP module) (@INC contains: /tmp/B.uxutKF/BUILD/check_rbl-1.6.1/inc /tmp/B.uxutKF/BUILD/check_rbl-1.6.1/blib/lib /tmp/B.uxutKF/BUILD/check_rbl-1.6.1/blib/arch /usr/local/lib/perl5/5.32.0/x86_64-pld-linux-gnux32-thread-multi /usr/local/share/perl5 /usr/libx32/perl5/vendor_perl/5.32.0/x86_64-pld-linux-gnux32-thread-multi /usr/share/perl5/vendor_perl /usr/libx32/perl5/5.32.1/x86_64-pld-linux-gnux32-thread-multi /usr/share/perl5/5.32.1 .) at blib/script/check_rbl line 29. # BEGIN failed--compilation aborted at blib/script/check_rbl line 29. # Compilation failed in require at (eval 8) line 2. # Looks like you failed 1 test of 1. t/01_validation.t .. Dubious, test returned 1 (wstat 256, 0x100) Failed 1/1 subtests Test Summary Report ------------------- t/00_modules.t (Wstat: 3840 Tests: 33 Failed: 15) Failed tests: 1-13, 27-28 Non-zero exit status: 15 t/01_validation.t (Wstat: 256 Tests: 1 Failed: 1) Failed test: 1 Non-zero exit status: 1 Files=2, Tests=34, 1 wallclock secs ( 0.03 usr 0.01 sys + 0.35 cusr 0.05 csys = 0.44 CPU) Result: FAIL Failed 2/2 test programs. 16/34 subtests failed. make: *** [Makefile:801: test_dynamic] Error 1 error: Bad exit status from /tmp/B.uxutKF/BUILD/tmp/rpm-tmp.faNMNV (%build) RPM build errors: Could not canonicalize hostname: naiad Bad exit status from /tmp/B.uxutKF/BUILD/tmp/rpm-tmp.faNMNV (%build) ended at: Sat May 29 23:33:59 2021, done in 0:00:01.414871 error: No files produced. + chmod -R u+rwX /tmp/B.uxutKF/BUILD + rm -rf /tmp/B.uxutKF/tmp /tmp/B.uxutKF/BUILD + rm -rf /tmp/B.uxutKF Begin-PLD-Builder-Info Build-Time: user:8.42s sys:1.63s real:15.27s (faults io:31 non-io:402563) End-PLD-Builder-Info
[Back to list of logs] [View rpm -qa of builder]