FailedOk

th/SRPMS[OK]
th/x32[OK]
th/i686[OK]
th/x86_64[OK]

ac/SRPMS[OK]
ac/i386[OK]
ac/i586[OK]
ac/i686[OK]
ac/alpha[OK]
ac/amd64[OK]
ac/athlon[OK]
ac/ppc[OK]
ac/sparc[OK]
ac/sparc64[OK]

Advanced Search
main()
Powered by PLD Linux
(c) 2002-2021 PLD Team
$Revision: 1.37 $
Powered by Unix conspiracy.
Your IP: 54.234.191.202

ocaml-curl 0d4ce52c-17ea-4274-8331-a8997f7aee0b

Status:Failed
Source URL:https://buildlogs.pld-linux.org/pld/th/x32/FAIL/ocaml-curl,0d4ce52c-17ea-4274-8331-a8997f7aee0b.bz2
text/plain URL:View!
rpm -qa of builder:View!
Date:2021/11/22 08:56:31
Runtime:0:00:22.918871

Toc:

  • prep
  • Executing(%prep): /bin/sh -e /tmp/B.rk321j82/BUILD/tmp/rpm-tmp.f1KwbV
  • build
  • Executing(%build): /bin/sh -e /tmp/B.rk321j82/BUILD/tmp/rpm-tmp.eNCYgN
  • install
  • Executing(%install): /bin/sh -e /tmp/B.rk321j82/BUILD/tmp/rpm-tmp.iHIXPy
  • error 1
  • error: Bad exit status from /tmp/B.rk321j82/BUILD/tmp/rpm-tmp.iHIXPy (%install)
  • error 2
  • RPM build errors:
  • error 3
  • error: No files produced.

Content:

request from: baggins
checking if we should skip the build
started at: Mon Nov 22 08:56:07 2021
killing old processes on a builder
sending signal 9 to pid -1
cleaning up /tmp
fetching https://srcbuilder.pld-linux.org/th//srpms/0d4ce52c-17ea-4274-8331-a8997f7aee0b/ocaml-curl-0.9.1-3.src.rpm
fetched 122558 bytes, 471.9 K/s
installing srpm: ocaml-curl-0.9.1-3.src.rpm
+ install -d /tmp/B.rk321j82/BUILD /tmp/B.rk321j82/RPMS
+ LC_ALL=en_US.UTF-8
+ rpm -qp --changelog ocaml-curl-0.9.1-3.src.rpm
* Mon Nov 22 2021 PLD Linux Team <feedback@pld-linux.org>
- For complete changelog see: http://git.pld-linux.org/?p=packages/ocaml-curl.git;a=log;h=master
* Sat Nov 20 2021 Jan Rękorajski <baggins@pld-linux.org> 75901a6
- rebuild with separate debuginfo build-ids * Sat Mar 27 2021 Jan Rękorajski <baggins@pld-linux.org> 90c843a
- fix non-opt files * Sat Mar 27 2021 Jan Rękorajski <baggins@pld-linux.org> a1673ef
- cleanup files - rel 2 * Wed Mar 24 2021 Jan Rękorajski <baggins@pld-linux.org> 9ed0416
- updated opt patch - install META where dune expects it * Wed Mar 24 2021 Jan Rękorajski <baggins@pld-linux.org> e88cf73
- up to 0.9.1 * Mon Jun 05 2017 Jan Rękorajski <baggins@pld-linux.org> 10d7111
- rebuild with ocaml 4.04.1 - release 5 (by relup.sh) * Fri Mar 18 2016 Jan Rękorajski <baggins@pld-linux.org> a53b4f3
- release 4 (by relup.sh) * Sat Jul 25 2015 Jan Rękorajski <baggins@pld-linux.org> a82d6b2
- release 3 (by relup.sh) * Sat Jul 25 2015 Jan Rękorajski <baggins@pld-linux.org> 5750614
- cleaned up ocaml_opt bcond usage * Sat Jul 25 2015 Jan Rękorajski <baggins@pld-linux.org> 9781d07
- fix install without ocaml opt build * Sun Nov 16 2014 Jan Rękorajski <baggins@pld-linux.org> c63f57e
- strict ocaml deps - rel 2 * Sat Aug 30 2014 Jan Rękorajski <baggins@pld-linux.org> 8fd8b94
- up to 0.7.1 * Mon Feb 17 2014 Jan Rękorajski <baggins@pld-linux.org> d878cf6
- fix source url and md5sum * Mon Feb 17 2014 Jan Rękorajski <baggins@pld-linux.org> ec5b7a8
- up to 0.6.1 * Sun Nov 24 2013 Elan Ruusamäe <glen@delfi.ee> 4790749
- package site meta for ocamlfind to work * Sat Nov 23 2013 Elan Ruusamäe <glen@delfi.ee> f6f0b5d
- rename to curl to match module name * Sat Nov 23 2013 Elan Ruusamäe <glen@delfi.ee> 56573ec
- up to 0.6.0, new upstream * Sat Nov 23 2013 Elan Ruusamäe <glen@delfi.ee> c81abe3
- fix package name * Sat Nov 23 2013 Elan Ruusamäe <glen@delfi.ee> 26de232
- new, version 0.5.3 + rpm -Uhv --nodeps --define '_topdir /tmp/B.rk321j82' --define '_specdir %{_topdir}' --define '_sourcedir %{_specdir}' --define '_rpmdir %{_topdir}/RPMS' --define '_builddir %{_topdir}/BUILD' ocaml-curl-0.9.1-3.src.rpm Updating / installing... ocaml-curl-0.9.1-3 ######################################## + rm -f ocaml-curl-0.9.1-3.src.rpm + install -m 700 -d /tmp/B.rk321j82/BUILD/tmp + TMPDIR=/tmp/B.rk321j82/BUILD/tmp + exec nice -n 0 rpmbuild -bp --short-circuit --nodeps --define '_topdir /tmp/B.rk321j82' --define '_specdir %{_topdir}' --define '_sourcedir %{_specdir}' --define '_rpmdir %{_topdir}/RPMS' --define '_builddir %{_topdir}/BUILD' --target x32-pld-linux --define 'prep exit 0' /tmp/B.rk321j82/ocaml-curl.spec Building target platforms: x32-pld-linux Building for target x32-pld-linux checking BuildConflict-ing packages rpm: Building target platforms: x32-pld-linux rpm: Building for target x32-pld-linux no BuildConflicts found checking BR rpm: Building target platforms: x32-pld-linux rpm: Building for target x32-pld-linux no BR needed building RPM using: set -ex; : build-id: 0d4ce52c-17ea-4274-8331-a8997f7aee0b; TMPDIR=/tmp/B.rk321j82/BUILD/tmp exec nice -n 0 rpmbuild -bb --define '_smp_mflags -j9' --define '_make_opts -Otarget' --define '_pld_builder 1' --define '_topdir /tmp/B.rk321j82' --define '_specdir %{_topdir}' --define '_sourcedir %{_specdir}' --define '_rpmdir %{_topdir}/RPMS' --define '_builddir %{_topdir}/BUILD' --target x32-pld-linux /tmp/B.rk321j82/ocaml-curl.spec + : build-id: 0d4ce52c-17ea-4274-8331-a8997f7aee0b + TMPDIR=/tmp/B.rk321j82/BUILD/tmp + exec nice -n 0 rpmbuild -bb --define '_smp_mflags -j9' --define '_make_opts -Otarget' --define '_pld_builder 1' --define '_topdir /tmp/B.rk321j82' --define '_specdir %{_topdir}' --define '_sourcedir %{_specdir}' --define '_rpmdir %{_topdir}/RPMS' --define '_builddir %{_topdir}/BUILD' --target x32-pld-linux /tmp/B.rk321j82/ocaml-curl.spec Building target platforms: x32-pld-linux Building for target x32-pld-linux Executing(%prep): /bin/sh -e /tmp/B.rk321j82/BUILD/tmp/rpm-tmp.f1KwbV + umask 022 + cd /tmp/B.rk321j82/BUILD + cd /tmp/B.rk321j82/BUILD + rm -rf ocurl-0.9.1 + /bin/gzip -dc /tmp/B.rk321j82/ocurl-0.9.1.tar.gz + /bin/tar -xof - + STATUS=0 + '[' 0 -ne 0 ']' + cd ocurl-0.9.1 + /bin/chmod -Rf a+rX,u+w,g-w,o-w . + echo 'Patch #0 (ocaml_opt.patch):' Patch #0 (ocaml_opt.patch): + </tmp/B.rk321j82/ocaml_opt.patch + /usr/bin/patch -s -p1 '--fuzz=0' + RPM_EC=0 + jobs -p + exit 0 Executing(%build): /bin/sh -e /tmp/B.rk321j82/BUILD/tmp/rpm-tmp.eNCYgN HOME=/home/users/builder PATH=/home/users/builder/GNUstep/Tools:/bin:/usr/bin:/usr/local/bin TMPDIR=/tmp/B.rk321j82/BUILD/tmp + umask 022 + cd /tmp/B.rk321j82/BUILD + cd ocurl-0.9.1 + ./configure 'LDFLAGS=-Wl,--as-needed -Wl,--no-copy-dt-needed-entries -Wl,-z,relro -Wl,-z,combreloc ' 'CFLAGS=-O2 -fwrapv -pipe -Wformat -Werror=format-security -gdwarf-4 -fno-debug-types-section -fvar-tracking-assignments -g2 -Wp,-D_FORTIFY_SOURCE=2 -fstack-protector-strong --param=ssp-buffer-size=4 -Werror=trampolines -fPIC -mtune=generic -march=x86-64 -gdwarf-4 -fno-debug-types-section -fvar-tracking-assignments -g2 ' 'CXXFLAGS=-O2 -fwrapv -pipe -Wformat -Werror=format-security -gdwarf-4 -fno-debug-types-section -fvar-tracking-assignments -g2 -Wp,-D_FORTIFY_SOURCE=2 -fstack-protector-strong --param=ssp-buffer-size=4 -Werror=trampolines -fPIC -mtune=generic -march=x86-64 -gdwarf-4 -fno-debug-types-section -fvar-tracking-assignments -g2 ' 'FFLAGS=-O2 -fwrapv -pipe -Wformat -Werror=format-security -gdwarf-4 -fno-debug-types-section -fvar-tracking-assignments -g2 -Wp,-D_FORTIFY_SOURCE=2 -fstack-protector-strong --param=ssp-buffer-size=4 -Werror=trampolines -fPIC -mtune=generic -march=x86-64 -gdwarf-4 -fno-debug-types-section -fvar-tracking-assignments -g2 ' 'FCFLAGS=-O2 -fwrapv -pipe -Wformat -Werror=format-security -gdwarf-4 -fno-debug-types-section -fvar-tracking-assignments -g2 -Wp,-D_FORTIFY_SOURCE=2 -fstack-protector-strong --param=ssp-buffer-size=4 -Werror=trampolines -fPIC -mtune=generic -march=x86-64 -gdwarf-4 -fno-debug-types-section -fvar-tracking-assignments -g2 ' 'CPPFLAGS=' 'CC=x86_64-pld-linux-gnux32-gcc' 'CXX=x86_64-pld-linux-gnux32-g++' '--host=x86_64-pld-linux-gnux32' '--build=x86_64-pld-linux-gnux32' '--prefix=/usr' '--exec-prefix=/usr' '--bindir=/usr/bin' '--sbindir=/usr/sbin' '--sysconfdir=/etc' '--datadir=/usr/share' '--includedir=/usr/include' '--libdir=/usr/libx32' '--libexecdir=/usr/libexec' '--localstatedir=/var' '--sharedstatedir=/var/lib' '--mandir=/usr/share/man' '--infodir=/usr/share/info' '--x-libraries=/usr/libx32' checking for x86_64-pld-linux-gnux32-gcc... x86_64-pld-linux-gnux32-gcc checking whether the C compiler works... yes checking for C compiler default output file name... a.out checking for suffix of executables... checking whether we are cross compiling... no checking for suffix of object files... o checking whether we are using the GNU C compiler... yes checking whether x86_64-pld-linux-gnux32-gcc accepts -g... yes checking for x86_64-pld-linux-gnux32-gcc option to accept ISO C89... none needed checking for libcurl cflags... checking for libcurl libs... -lcurl checking for libcurl version >= 7.28.0... 7.80.0 checking for a BSD-compatible install... /usr/bin/install -c checking for x86_64-pld-linux-gnux32-ocamlc... no checking for ocamlc... ocamlc OCaml version is 4.12.0 OCaml library path is /usr/libx32/ocaml checking for x86_64-pld-linux-gnux32-ocamlopt... no checking for ocamlopt... no configure: WARNING: Cannot find ocamlopt; bytecode compilation only. checking for x86_64-pld-linux-gnux32-ocamlc.opt... no checking for ocamlc.opt... no checking for x86_64-pld-linux-gnux32-ocaml... no checking for ocaml... ocaml checking for x86_64-pld-linux-gnux32-ocamldep... no checking for ocamldep... ocamldep checking for x86_64-pld-linux-gnux32-ocamlmktop... no checking for ocamlmktop... ocamlmktop checking for x86_64-pld-linux-gnux32-ocamlmklib... no checking for ocamlmklib... ocamlmklib checking for x86_64-pld-linux-gnux32-ocamldoc... no checking for ocamldoc... ocamldoc checking for x86_64-pld-linux-gnux32-ocamlbuild... no checking for ocamlbuild... ocamlbuild checking for x86_64-pld-linux-gnux32-ocamlfind... no checking for ocamlfind... ocamlfind checking for OCaml findlib package bytes... found checking for OCaml findlib package lwt.unix... found checking for OCaml findlib package lwt_ppx... not found findlib: [WARNING] Interface topdirs.cmi occurs in several directories: /usr/libx32/ocaml, /usr/libx32/ocaml/compiler-libs checking for bin-annot support... yes checking for ext_dll... .so checking for ext_lib... .a checking for ext_obj... .o checking how to run the C preprocessor... x86_64-pld-linux-gnux32-gcc -E checking for grep that handles long lines and -e... /bin/grep checking for egrep... /bin/grep -E checking for ANSI C header files... yes checking for sys/types.h... yes checking for sys/stat.h... yes checking for stdlib.h... yes checking for string.h... yes checking for memory.h... yes checking for strings.h... yes checking for inttypes.h... yes checking for stdint.h... yes checking for unistd.h... yes checking curl/curl.h usability... yes checking curl/curl.h presence... yes checking for curl/curl.h... yes checking whether CURLMOPT_TIMERFUNCTION is declared... yes checking whether CURLMOPT_TIMERDATA is declared... yes checking whether CURLMOPT_SOCKETFUNCTION is declared... yes checking whether CURLMOPT_SOCKETDATA is declared... yes checking whether CURLOPT_FILE is declared... yes checking whether CURLOPT_URL is declared... yes checking whether CURLOPT_PORT is declared... yes checking whether CURLOPT_PROXY is declared... yes checking whether CURLOPT_USERPWD is declared... yes checking whether CURLOPT_PROXYUSERPWD is declared... yes checking whether CURLOPT_RANGE is declared... yes checking whether CURLOPT_INFILE is declared... yes checking whether CURLOPT_ERRORBUFFER is declared... yes checking whether CURLOPT_WRITEFUNCTION is declared... yes checking whether CURLOPT_READFUNCTION is declared... yes checking whether CURLOPT_TIMEOUT is declared... yes checking whether CURLOPT_INFILESIZE is declared... yes checking whether CURLOPT_POSTFIELDS is declared... yes checking whether CURLOPT_REFERER is declared... yes checking whether CURLOPT_FTPPORT is declared... yes checking whether CURLOPT_USERAGENT is declared... yes checking whether CURLOPT_LOW_SPEED_LIMIT is declared... yes checking whether CURLOPT_LOW_SPEED_TIME is declared... yes checking whether CURLOPT_RESUME_FROM is declared... yes checking whether CURLOPT_COOKIE is declared... yes checking whether CURLOPT_HTTPHEADER is declared... yes checking whether CURLOPT_HTTPPOST is declared... yes checking whether CURLOPT_SSLCERT is declared... yes checking whether CURLOPT_SSLCERTPASSWD is declared... yes checking whether CURLOPT_SSLKEYPASSWD is declared... yes checking whether CURLOPT_CRLF is declared... yes checking whether CURLOPT_QUOTE is declared... yes checking whether CURLOPT_WRITEHEADER is declared... yes checking whether CURLOPT_COOKIEFILE is declared... yes checking whether CURLOPT_SSLVERSION is declared... yes checking whether CURLOPT_TIMECONDITION is declared... yes checking whether CURLOPT_TIMEVALUE is declared... yes checking whether CURLOPT_CUSTOMREQUEST is declared... yes checking whether CURLOPT_POSTQUOTE is declared... yes checking whether CURLOPT_WRITEINFO is declared... yes checking whether CURLOPT_VERBOSE is declared... yes checking whether CURLOPT_HEADER is declared... yes checking whether CURLOPT_NOPROGRESS is declared... yes checking whether CURLOPT_NOBODY is declared... yes checking whether CURLOPT_FAILONERROR is declared... yes checking whether CURLOPT_UPLOAD is declared... yes checking whether CURLOPT_POST is declared... yes checking whether CURLOPT_FTPLISTONLY is declared... yes checking whether CURLOPT_FTPAPPEND is declared... yes checking whether CURLOPT_NETRC is declared... yes checking whether CURLOPT_FOLLOWLOCATION is declared... yes checking whether CURLOPT_TRANSFERTEXT is declared... yes checking whether CURLOPT_PUT is declared... yes checking whether CURLOPT_PROGRESSFUNCTION is declared... yes checking whether CURLOPT_PROGRESSDATA is declared... yes checking whether CURLOPT_AUTOREFERER is declared... yes checking whether CURLOPT_PROXYPORT is declared... yes checking whether CURLOPT_POSTFIELDSIZE is declared... yes checking whether CURLOPT_HTTPPROXYTUNNEL is declared... yes checking whether CURLOPT_INTERFACE is declared... yes checking whether CURLOPT_KRB4LEVEL is declared... yes checking whether CURLOPT_SSL_VERIFYPEER is declared... yes checking whether CURLOPT_CAINFO is declared... yes checking whether CURLOPT_MAXREDIRS is declared... yes checking whether CURLOPT_FILETIME is declared... yes checking whether CURLOPT_TELNETOPTIONS is declared... yes checking whether CURLOPT_MAXCONNECTS is declared... yes checking whether CURLOPT_CLOSEPOLICY is declared... yes checking whether CURLOPT_FRESH_CONNECT is declared... yes checking whether CURLOPT_FORBID_REUSE is declared... yes checking whether CURLOPT_RANDOM_FILE is declared... yes checking whether CURLOPT_EGDSOCKET is declared... yes checking whether CURLOPT_CONNECTTIMEOUT is declared... yes checking whether CURLOPT_HEADERFUNCTION is declared... yes checking whether CURLOPT_HTTPGET is declared... yes checking whether CURLOPT_SSL_VERIFYHOST is declared... yes checking whether CURLOPT_COOKIEJAR is declared... yes checking whether CURLOPT_SSL_CIPHER_LIST is declared... yes checking whether CURLOPT_HTTP_VERSION is declared... yes checking whether CURLOPT_FTP_USE_EPSV is declared... yes checking whether CURLOPT_SSLCERTTYPE is declared... yes checking whether CURLOPT_SSLKEY is declared... yes checking whether CURLOPT_SSLKEYTYPE is declared... yes checking whether CURLOPT_SSLENGINE is declared... yes checking whether CURLOPT_SSLENGINE_DEFAULT is declared... yes checking whether CURLOPT_DNS_USE_GLOBAL_CACHE is declared... yes checking whether CURLOPT_DNS_CACHE_TIMEOUT is declared... yes checking whether CURLOPT_PREQUOTE is declared... yes checking whether CURLOPT_DEBUGFUNCTION is declared... yes checking whether CURLOPT_DEBUGDATA is declared... yes checking whether CURLOPT_COOKIESESSION is declared... yes checking whether CURLOPT_CAPATH is declared... yes checking whether CURLOPT_BUFFERSIZE is declared... yes checking whether CURLOPT_NOSIGNAL is declared... yes checking whether CURLOPT_SHARE is declared... yes checking whether CURLOPT_PROXYTYPE is declared... yes checking whether CURLOPT_ENCODING is declared... yes checking whether CURLOPT_HTTP200ALIASES is declared... yes checking whether CURLOPT_UNRESTRICTED_AUTH is declared... yes checking whether CURLOPT_FTP_USE_EPRT is declared... yes checking whether CURLOPT_HTTPAUTH is declared... yes checking whether CURLOPT_FTP_CREATE_MISSING_DIRS is declared... yes checking whether CURLOPT_PROXYAUTH is declared... yes checking whether CURLOPT_FTP_RESPONSE_TIMEOUT is declared... yes checking whether CURLOPT_IPRESOLVE is declared... yes checking whether CURLOPT_MAXFILESIZE is declared... yes checking whether CURLOPT_INFILESIZE_LARGE is declared... yes checking whether CURLOPT_RESUME_FROM_LARGE is declared... yes checking whether CURLOPT_MAXFILESIZE_LARGE is declared... yes checking whether CURLOPT_NETRC_FILE is declared... yes checking whether CURLOPT_FTP_SSL is declared... yes checking whether CURLOPT_POSTFIELDSIZE_LARGE is declared... yes checking whether CURLOPT_TCP_NODELAY is declared... yes checking whether CURLOPT_FTPSSLAUTH is declared... yes checking whether CURLOPT_IOCTLFUNCTION is declared... yes checking whether CURLOPT_FTP_ACCOUNT is declared... yes checking whether CURLOPT_COOKIELIST is declared... yes checking whether CURLOPT_IGNORE_CONTENT_LENGTH is declared... yes checking whether CURLOPT_FTP_SKIP_PASV_IP is declared... yes checking whether CURLOPT_FTP_FILEMETHOD is declared... yes checking whether CURLOPT_LOCALPORT is declared... yes checking whether CURLOPT_LOCALPORTRANGE is declared... yes checking whether CURLOPT_CONNECT_ONLY is declared... yes checking whether CURLOPT_MAX_SEND_SPEED_LARGE is declared... yes checking whether CURLOPT_MAX_RECV_SPEED_LARGE is declared... yes checking whether CURLOPT_FTP_ALTERNATIVE_TO_USER is declared... yes checking whether CURLOPT_SSL_SESSIONID_CACHE is declared... yes checking whether CURLOPT_SSH_AUTH_TYPES is declared... yes checking whether CURLOPT_SSH_PUBLIC_KEYFILE is declared... yes checking whether CURLOPT_SSH_PRIVATE_KEYFILE is declared... yes checking whether CURLOPT_FTP_SSL_CCC is declared... yes checking whether CURLOPT_TIMEOUT_MS is declared... yes checking whether CURLOPT_CONNECTTIMEOUT_MS is declared... yes checking whether CURLOPT_HTTP_TRANSFER_DECODING is declared... yes checking whether CURLOPT_HTTP_CONTENT_DECODING is declared... yes checking whether CURLOPT_NEW_FILE_PERMS is declared... yes checking whether CURLOPT_NEW_DIRECTORY_PERMS is declared... yes checking whether CURLOPT_POST301 is declared... yes checking whether CURLOPT_SSH_HOST_PUBLIC_KEY_MD5 is declared... yes checking whether CURLOPT_COPYPOSTFIELDS is declared... yes checking whether CURLOPT_PROXY_TRANSFER_MODE is declared... yes checking whether CURLOPT_SEEKFUNCTION is declared... yes checking whether CURLOPT_OPENSOCKETFUNCTION is declared... yes checking whether CURLOPT_PROTOCOLS is declared... yes checking whether CURLOPT_REDIR_PROTOCOLS is declared... yes checking whether CURLOPT_RESOLVE is declared... yes checking whether CURLOPT_DNS_SERVERS is declared... yes checking whether CURLOPT_MAIL_FROM is declared... yes checking whether CURLOPT_MAIL_RCPT is declared... yes checking whether CURLOPT_PIPEWAIT is declared... yes checking whether CURLOPT_CERTINFO is declared... yes checking whether CURLOPT_USERNAME is declared... yes checking whether CURLOPT_PASSWORD is declared... yes checking whether CURLOPT_LOGIN_OPTIONS is declared... yes checking whether CURLOPT_CONNECT_TO is declared... yes checking whether CURLOPT_POSTREDIR is declared... yes checking whether CURLOPT_MIMEPOST is declared... yes checking whether CURLINFO_EFFECTIVE_URL is declared... yes checking whether CURLINFO_RESPONSE_CODE is declared... yes checking whether CURLINFO_TOTAL_TIME is declared... yes checking whether CURLINFO_NAMELOOKUP_TIME is declared... yes checking whether CURLINFO_CONNECT_TIME is declared... yes checking whether CURLINFO_PRETRANSFER_TIME is declared... yes checking whether CURLINFO_SIZE_UPLOAD is declared... yes checking whether CURLINFO_SIZE_DOWNLOAD is declared... yes checking whether CURLINFO_SPEED_DOWNLOAD is declared... yes checking whether CURLINFO_SPEED_UPLOAD is declared... yes checking whether CURLINFO_HEADER_SIZE is declared... yes checking whether CURLINFO_REQUEST_SIZE is declared... yes checking whether CURLINFO_SSL_VERIFYRESULT is declared... yes checking whether CURLINFO_FILETIME is declared... yes checking whether CURLINFO_CONTENT_LENGTH_DOWNLOAD is declared... yes checking whether CURLINFO_CONTENT_LENGTH_UPLOAD is declared... yes checking whether CURLINFO_STARTTRANSFER_TIME is declared... yes checking whether CURLINFO_CONTENT_TYPE is declared... yes checking whether CURLINFO_REDIRECT_TIME is declared... yes checking whether CURLINFO_REDIRECT_COUNT is declared... yes checking whether CURLINFO_HTTP_CONNECTCODE is declared... yes checking whether CURLINFO_HTTPAUTH_AVAIL is declared... yes checking whether CURLINFO_PROXYAUTH_AVAIL is declared... yes checking whether CURLINFO_OS_ERRNO is declared... yes checking whether CURLINFO_NUM_CONNECTS is declared... yes checking whether CURLINFO_SSL_ENGINES is declared... yes checking whether CURLINFO_COOKIELIST is declared... yes checking whether CURLINFO_LASTSOCKET is declared... yes checking whether CURLINFO_FTP_ENTRY_PATH is declared... yes checking whether CURLINFO_REDIRECT_URL is declared... yes checking whether CURLINFO_PRIMARY_IP is declared... yes checking whether CURLINFO_LOCAL_IP is declared... yes checking whether CURLINFO_LOCAL_PORT is declared... yes checking whether CURLINFO_CONDITION_UNMET is declared... yes checking whether CURLINFO_CERTINFO is declared... yes checking whether CURLE_UNSUPPORTED_PROTOCOL is declared... yes checking whether CURLE_FAILED_INIT is declared... yes checking whether CURLE_URL_MALFORMAT is declared... yes checking whether CURLE_URL_MALFORMAT_USER is declared... yes checking whether CURLE_COULDNT_RESOLVE_PROXY is declared... yes checking whether CURLE_COULDNT_RESOLVE_HOST is declared... yes checking whether CURLE_COULDNT_CONNECT is declared... yes checking whether CURLE_FTP_WEIRD_SERVER_REPLY is declared... yes checking whether CURLE_FTP_ACCESS_DENIED is declared... yes checking whether CURLE_FTP_USER_PASSWORD_INCORRECT is declared... yes checking whether CURLE_FTP_WEIRD_PASS_REPLY is declared... yes checking whether CURLE_FTP_WEIRD_USER_REPLY is declared... yes checking whether CURLE_FTP_WEIRD_PASV_REPLY is declared... yes checking whether CURLE_FTP_WEIRD_227_FORMAT is declared... yes checking whether CURLE_FTP_CANT_GET_HOST is declared... yes checking whether CURLE_FTP_CANT_RECONNECT is declared... yes checking whether CURLE_FTP_COULDNT_SET_BINARY is declared... yes checking whether CURLE_PARTIAL_FILE is declared... yes checking whether CURLE_FTP_COULDNT_RETR_FILE is declared... yes checking whether CURLE_FTP_WRITE_ERROR is declared... yes checking whether CURLE_FTP_QUOTE_ERROR is declared... yes checking whether CURLE_HTTP_RETURNED_ERROR is declared... yes checking whether CURLE_WRITE_ERROR is declared... yes checking whether CURLE_MALFORMAT_USER is declared... yes checking whether CURLE_FTP_COULDNT_STOR_FILE is declared... yes checking whether CURLE_READ_ERROR is declared... yes checking whether CURLE_OUT_OF_MEMORY is declared... yes checking whether CURLE_OPERATION_TIMEOUTED is declared... yes checking whether CURLE_FTP_COULDNT_SET_ASCII is declared... yes checking whether CURLE_FTP_PORT_FAILED is declared... yes checking whether CURLE_FTP_COULDNT_USE_REST is declared... yes checking whether CURLE_FTP_COULDNT_GET_SIZE is declared... yes checking whether CURLE_HTTP_RANGE_ERROR is declared... yes checking whether CURLE_HTTP_POST_ERROR is declared... yes checking whether CURLE_SSL_CONNECT_ERROR is declared... yes checking whether CURLE_BAD_DOWNLOAD_RESUME is declared... yes checking whether CURLE_FILE_COULDNT_READ_FILE is declared... yes checking whether CURLE_LDAP_CANNOT_BIND is declared... yes checking whether CURLE_LDAP_SEARCH_FAILED is declared... yes checking whether CURLE_LIBRARY_NOT_FOUND is declared... yes checking whether CURLE_FUNCTION_NOT_FOUND is declared... yes checking whether CURLE_ABORTED_BY_CALLBACK is declared... yes checking whether CURLE_BAD_FUNCTION_ARGUMENT is declared... yes checking whether CURLE_BAD_CALLING_ORDER is declared... yes checking whether CURLE_INTERFACE_FAILED is declared... yes checking whether CURLE_BAD_PASSWORD_ENTERED is declared... yes checking whether CURLE_TOO_MANY_REDIRECTS is declared... yes checking whether CURLE_UNKNOWN_TELNET_OPTION is declared... yes checking whether CURLE_TELNET_OPTION_SYNTAX is declared... yes checking whether CURLE_SSL_PEER_CERTIFICATE is declared... yes checking whether CURLE_GOT_NOTHING is declared... yes checking whether CURLE_SSL_ENGINE_NOTFOUND is declared... yes checking whether CURLE_SSL_ENGINE_SETFAILED is declared... yes checking whether CURLE_SEND_ERROR is declared... yes checking whether CURLE_RECV_ERROR is declared... yes checking whether CURLE_SHARE_IN_USE is declared... yes checking whether CURLE_SSL_CERTPROBLEM is declared... yes checking whether CURLE_SSL_CIPHER is declared... yes checking whether CURLE_SSL_CACERT is declared... yes checking whether CURLE_BAD_CONTENT_ENCODING is declared... yes checking whether CURLE_LDAP_INVALID_URL is declared... yes checking whether CURLE_FILESIZE_EXCEEDED is declared... yes checking whether CURLE_FTP_SSL_FAILED is declared... yes checking whether CURLE_SEND_FAIL_REWIND is declared... yes checking whether CURLE_SSL_ENGINE_INITFAILED is declared... yes checking whether CURLE_LOGIN_DENIED is declared... yes checking whether CURLE_TFTP_NOTFOUND is declared... yes checking whether CURLE_TFTP_PERM is declared... yes checking whether CURLE_REMOTE_DISK_FULL is declared... yes checking whether CURLE_TFTP_ILLEGAL is declared... yes checking whether CURLE_TFTP_UNKNOWNID is declared... yes checking whether CURLE_REMOTE_FILE_EXISTS is declared... yes checking whether CURLE_TFTP_NOSUCHUSER is declared... yes checking whether CURLE_CONV_FAILED is declared... yes checking whether CURLE_CONV_REQD is declared... yes checking whether CURLE_SSL_CACERT_BADFILE is declared... yes checking whether CURLE_REMOTE_FILE_NOT_FOUND is declared... yes checking whether CURLE_SSH is declared... yes checking whether CURLE_SSL_SHUTDOWN_FAILED is declared... yes checking whether CURLE_AGAIN is declared... yes checking whether CURLMOPT_MAXCONNECTS is declared... yes checking whether CURLMOPT_PIPELINING is declared... yes checking whether CURLMOPT_MAX_PIPELINE_LENGTH is declared... yes checking whether CURLMOPT_MAX_HOST_CONNECTIONS is declared... yes checking whether CURL_SSLVERSION_TLSv1_0 is declared... yes checking whether CURL_SSLVERSION_TLSv1_1 is declared... yes checking whether CURL_SSLVERSION_TLSv1_2 is declared... yes checking whether CURL_SSLVERSION_TLSv1_3 is declared... yes checking whether CURL_HTTP_VERSION_2 is declared... yes checking whether CURL_HTTP_VERSION_2_0 is declared... yes checking whether CURL_HTTP_VERSION_2TLS is declared... yes checking whether CURL_HTTP_VERSION_2_PRIOR_KNOWLEDGE is declared... yes checking whether CURL_HTTP_VERSION_3 is declared... yes checking whether CURL_VERSION_TLSAUTH_SRP is declared... yes checking whether CURL_VERSION_NTLM_WB is declared... yes configure: creating ./config.status config.status: creating Makefile config.status: creating examples/Makefile config.status: creating config.h + /usr/bin/make -Otarget -j9 -j1 all make[1]: Entering directory '/tmp/B.rk321j82/BUILD/ocurl-0.9.1' make[1]: Leaving directory '/tmp/B.rk321j82/BUILD/ocurl-0.9.1' make[1]: Entering directory '/tmp/B.rk321j82/BUILD/ocurl-0.9.1' ocamlc -c -g -bin-annot curl.mli -o curl.cmi ocamlc -c -g -bin-annot curl.ml -o curl.cmo ocamlc -c -ccopt "-O2 -fwrapv -pipe -Wformat -Werror=format-security -gdwarf-4 -fno-debug-types-section -fvar-tracking-assignments -g2 -Wp,-D_FORTIFY_SOURCE=2 -fstack-protector-strong --param=ssp-buffer-size=4 -Werror=trampolines -fPIC -mtune=generic -march=x86-64 -gdwarf-4 -fno-debug-types-section -fvar-tracking-assignments -g2 -DHAVE_CONFIG_H -Wall -Wundef" curl-helper.c curl-helper.c:2805: warning: "CURLOPT" redefined 2805 | #define CURLOPT(name) { handle_ ## name, "CURLOPT_"#name } | In file included from curl-helper.c:23: /usr/include/curl/curl.h:1056: note: this is the location of the previous definition 1056 | #define CURLOPT(na,t,nu) na = t + nu | ocamlmklib -oc curl-helper curl-helper.o -lcurl ocamlmklib -o curl curl.cmo -oc curl-helper -lcurl make[1]: 'libcurl-helper.a' is up to date. make[1]: 'dllcurl-helper.so' is up to date. ocamlfind c -package lwt -c -g -bin-annot curl_lwt.mli -o curl_lwt.cmi ocamlfind c -thread -package lwt.unix -c -g -bin-annot curl_lwt.ml -o curl_lwt.cmo make[1]: Leaving directory '/tmp/B.rk321j82/BUILD/ocurl-0.9.1' + RPM_EC=0 + jobs -p + exit 0 Executing(%install): /bin/sh -e /tmp/B.rk321j82/BUILD/tmp/rpm-tmp.iHIXPy HOME=/home/users/builder PATH=/home/users/builder/GNUstep/Tools:/bin:/usr/bin:/usr/local/bin TMPDIR=/tmp/B.rk321j82/BUILD/tmp + umask 022 + cd /tmp/B.rk321j82/BUILD + /bin/rm '--interactive=never' -rf /tmp/B.rk321j82/BUILD/tmp/ocaml-curl-0.9.1-x32-root-builder + /bin/mkdir -p /tmp/B.rk321j82/BUILD/tmp/ocaml-curl-0.9.1-x32-root-builder + cd ocurl-0.9.1 + rm -rf /tmp/B.rk321j82/BUILD/tmp/ocaml-curl-0.9.1-x32-root-builder + export 'OCAMLFIND_DESTDIR=/tmp/B.rk321j82/BUILD/tmp/ocaml-curl-0.9.1-x32-root-builder/usr/libx32/ocaml' + install -d /tmp/B.rk321j82/BUILD/tmp/ocaml-curl-0.9.1-x32-root-builder/usr/libx32/ocaml /tmp/B.rk321j82/BUILD/tmp/ocaml-curl-0.9.1-x32-root-builder/usr/libx32/ocaml/stublibs + /usr/bin/make -Otarget -j9 install 'DESTDIR=/tmp/B.rk321j82/BUILD/tmp/ocaml-curl-0.9.1-x32-root-builder' ocamlfind install -patch-version 0.9.1 -ldconf ignore curl META curl.cmi curl.mli curl.cma libcurl-helper.a dllcurl-helper.so curl_lwt.cmo curl.cmt curl.cmti curl_lwt.cmi curl_lwt.mli curl_lwt.o curl_lwt.cmt curl_lwt.cmti Installed /tmp/B.rk321j82/BUILD/tmp/ocaml-curl-0.9.1-x32-root-builder/usr/libx32/ocaml/curl/curl_lwt.cmti Installed /tmp/B.rk321j82/BUILD/tmp/ocaml-curl-0.9.1-x32-root-builder/usr/libx32/ocaml/curl/curl_lwt.cmt ocamlfind: curl_lwt.o: No such file or directory make: *** [Makefile:135: install] Error 2 error: Bad exit status from /tmp/B.rk321j82/BUILD/tmp/rpm-tmp.iHIXPy (%install) RPM build errors: Bad exit status from /tmp/B.rk321j82/BUILD/tmp/rpm-tmp.iHIXPy (%install) ended at: Mon Nov 22 08:56:31 2021, done in 0:00:22.918871 error: No files produced. + chmod -R u+rwX /tmp/B.rk321j82/BUILD + rm -rf /tmp/B.rk321j82/tmp /tmp/B.rk321j82/BUILD + rm -rf /tmp/B.rk321j82 Begin-PLD-Builder-Info Build-Time: user:20.10s sys:6.40s real:24.66s (faults io:3 non-io:1206389) End-PLD-Builder-Info
[Back to list of logs] [View rpm -qa of builder]