FailedOk

th/SRPMS[OK]
th/x32[OK]
th/i686[OK]
th/x86_64[OK]

ac/SRPMS[OK]
ac/i386[OK]
ac/i586[OK]
ac/i686[OK]
ac/alpha[OK]
ac/amd64[OK]
ac/athlon[OK]
ac/ppc[OK]
ac/sparc[OK]
ac/sparc64[OK]

Advanced Search
main()
Powered by PLD Linux
(c) 2002-2021 PLD Team
$Revision: 1.37 $
Powered by sfistak.
Your IP: 34.207.230.188

ocaml-curl 0d4ce52c-17ea-4274-8331-a8997f7aee0b

Status:Failed
Source URL:https://buildlogs.pld-linux.org/pld/th/x32/FAIL/ocaml-curl,0d4ce52c-17ea-4274-8331-a8997f7aee0b.bz2
text/plain URL:View!
full text:View!
rpm -qa of builder:View!
Date:2021/11/22 08:56:31
Runtime:0:00:22.918871

Toc:

  • error 1
  • error: Bad exit status from /tmp/B.rk321j82/BUILD/tmp/rpm-tmp.iHIXPy (%install)
  • error 2
  • RPM build errors:
  • error 3
  • error: No files produced.

Content:

checking whether CURLE_BAD_FUNCTION_ARGUMENT is declared... yes
checking whether CURLE_BAD_CALLING_ORDER is declared... yes
checking whether CURLE_INTERFACE_FAILED is declared... yes
checking whether CURLE_BAD_PASSWORD_ENTERED is declared... yes
checking whether CURLE_TOO_MANY_REDIRECTS is declared... yes
checking whether CURLE_UNKNOWN_TELNET_OPTION is declared... yes
checking whether CURLE_TELNET_OPTION_SYNTAX is declared... yes
checking whether CURLE_SSL_PEER_CERTIFICATE is declared... yes
checking whether CURLE_GOT_NOTHING is declared... yes
checking whether CURLE_SSL_ENGINE_NOTFOUND is declared... yes
checking whether CURLE_SSL_ENGINE_SETFAILED is declared... yes
checking whether CURLE_SEND_ERROR is declared... yes
checking whether CURLE_RECV_ERROR is declared... yes
checking whether CURLE_SHARE_IN_USE is declared... yes
checking whether CURLE_SSL_CERTPROBLEM is declared... yes
checking whether CURLE_SSL_CIPHER is declared... yes
checking whether CURLE_SSL_CACERT is declared... yes
checking whether CURLE_BAD_CONTENT_ENCODING is declared... yes
checking whether CURLE_LDAP_INVALID_URL is declared... yes
checking whether CURLE_FILESIZE_EXCEEDED is declared... yes
checking whether CURLE_FTP_SSL_FAILED is declared... yes
checking whether CURLE_SEND_FAIL_REWIND is declared... yes
checking whether CURLE_SSL_ENGINE_INITFAILED is declared... yes
checking whether CURLE_LOGIN_DENIED is declared... yes
checking whether CURLE_TFTP_NOTFOUND is declared... yes
checking whether CURLE_TFTP_PERM is declared... yes
checking whether CURLE_REMOTE_DISK_FULL is declared... yes
checking whether CURLE_TFTP_ILLEGAL is declared... yes
checking whether CURLE_TFTP_UNKNOWNID is declared... yes
checking whether CURLE_REMOTE_FILE_EXISTS is declared... yes
checking whether CURLE_TFTP_NOSUCHUSER is declared... yes
checking whether CURLE_CONV_FAILED is declared... yes
checking whether CURLE_CONV_REQD is declared... yes
checking whether CURLE_SSL_CACERT_BADFILE is declared... yes
checking whether CURLE_REMOTE_FILE_NOT_FOUND is declared... yes
checking whether CURLE_SSH is declared... yes
checking whether CURLE_SSL_SHUTDOWN_FAILED is declared... yes
checking whether CURLE_AGAIN is declared... yes
checking whether CURLMOPT_MAXCONNECTS is declared... yes
checking whether CURLMOPT_PIPELINING is declared... yes
checking whether CURLMOPT_MAX_PIPELINE_LENGTH is declared... yes
checking whether CURLMOPT_MAX_HOST_CONNECTIONS is declared... yes
checking whether CURL_SSLVERSION_TLSv1_0 is declared... yes
checking whether CURL_SSLVERSION_TLSv1_1 is declared... yes
checking whether CURL_SSLVERSION_TLSv1_2 is declared... yes
checking whether CURL_SSLVERSION_TLSv1_3 is declared... yes
checking whether CURL_HTTP_VERSION_2 is declared... yes
checking whether CURL_HTTP_VERSION_2_0 is declared... yes
checking whether CURL_HTTP_VERSION_2TLS is declared... yes
checking whether CURL_HTTP_VERSION_2_PRIOR_KNOWLEDGE is declared... yes
checking whether CURL_HTTP_VERSION_3 is declared... yes
checking whether CURL_VERSION_TLSAUTH_SRP is declared... yes
checking whether CURL_VERSION_NTLM_WB is declared... yes
configure: creating ./config.status
config.status: creating Makefile
config.status: creating examples/Makefile
config.status: creating config.h
+ /usr/bin/make -Otarget -j9 -j1 all
make[1]: Entering directory '/tmp/B.rk321j82/BUILD/ocurl-0.9.1'
make[1]: Leaving directory '/tmp/B.rk321j82/BUILD/ocurl-0.9.1'
make[1]: Entering directory '/tmp/B.rk321j82/BUILD/ocurl-0.9.1'
ocamlc -c -g -bin-annot curl.mli -o curl.cmi
ocamlc -c -g -bin-annot curl.ml -o curl.cmo
ocamlc -c -ccopt "-O2 -fwrapv -pipe -Wformat -Werror=format-security -gdwarf-4 -fno-debug-types-section -fvar-tracking-assignments -g2 -Wp,-D_FORTIFY_SOURCE=2 -fstack-protector-strong --param=ssp-buffer-size=4 -Werror=trampolines -fPIC -mtune=generic -march=x86-64 -gdwarf-4 -fno-debug-types-section -fvar-tracking-assignments -g2   -DHAVE_CONFIG_H -Wall -Wundef" curl-helper.c
curl-helper.c:2805: warning: "CURLOPT" redefined
 2805 | #define CURLOPT(name) { handle_ ## name, "CURLOPT_"#name }
      | 
In file included from curl-helper.c:23:
/usr/include/curl/curl.h:1056: note: this is the location of the previous definition
 1056 | #define CURLOPT(na,t,nu) na = t + nu
      | 
ocamlmklib -oc curl-helper curl-helper.o -lcurl
ocamlmklib -o curl curl.cmo -oc curl-helper -lcurl
make[1]: 'libcurl-helper.a' is up to date.
make[1]: 'dllcurl-helper.so' is up to date.
ocamlfind c -package lwt -c -g -bin-annot curl_lwt.mli -o curl_lwt.cmi
ocamlfind c -thread -package lwt.unix -c -g -bin-annot curl_lwt.ml -o curl_lwt.cmo
make[1]: Leaving directory '/tmp/B.rk321j82/BUILD/ocurl-0.9.1'
+ RPM_EC=0 
+ jobs -p
+ exit 0
Executing(%install): /bin/sh -e /tmp/B.rk321j82/BUILD/tmp/rpm-tmp.iHIXPy
HOME=/home/users/builder
PATH=/home/users/builder/GNUstep/Tools:/bin:/usr/bin:/usr/local/bin
TMPDIR=/tmp/B.rk321j82/BUILD/tmp
+ umask 022
+ cd /tmp/B.rk321j82/BUILD
+ /bin/rm '--interactive=never' -rf /tmp/B.rk321j82/BUILD/tmp/ocaml-curl-0.9.1-x32-root-builder
+ /bin/mkdir -p /tmp/B.rk321j82/BUILD/tmp/ocaml-curl-0.9.1-x32-root-builder
+ cd ocurl-0.9.1
+ rm -rf /tmp/B.rk321j82/BUILD/tmp/ocaml-curl-0.9.1-x32-root-builder
+ export 'OCAMLFIND_DESTDIR=/tmp/B.rk321j82/BUILD/tmp/ocaml-curl-0.9.1-x32-root-builder/usr/libx32/ocaml'
+ install -d /tmp/B.rk321j82/BUILD/tmp/ocaml-curl-0.9.1-x32-root-builder/usr/libx32/ocaml /tmp/B.rk321j82/BUILD/tmp/ocaml-curl-0.9.1-x32-root-builder/usr/libx32/ocaml/stublibs
+ /usr/bin/make -Otarget -j9 install 'DESTDIR=/tmp/B.rk321j82/BUILD/tmp/ocaml-curl-0.9.1-x32-root-builder'
ocamlfind install -patch-version 0.9.1 -ldconf ignore curl META curl.cmi curl.mli curl.cma libcurl-helper.a dllcurl-helper.so curl_lwt.cmo curl.cmt curl.cmti curl_lwt.cmi curl_lwt.mli curl_lwt.o curl_lwt.cmt curl_lwt.cmti
Installed /tmp/B.rk321j82/BUILD/tmp/ocaml-curl-0.9.1-x32-root-builder/usr/libx32/ocaml/curl/curl_lwt.cmti
Installed /tmp/B.rk321j82/BUILD/tmp/ocaml-curl-0.9.1-x32-root-builder/usr/libx32/ocaml/curl/curl_lwt.cmt
ocamlfind: curl_lwt.o: No such file or directory
make: *** [Makefile:135: install] Error 2
error: Bad exit status from /tmp/B.rk321j82/BUILD/tmp/rpm-tmp.iHIXPy (%install)


RPM build errors:
    Bad exit status from /tmp/B.rk321j82/BUILD/tmp/rpm-tmp.iHIXPy (%install)
ended at: Mon Nov 22 08:56:31 2021, done in 0:00:22.918871
error: No files produced.
+ chmod -R u+rwX /tmp/B.rk321j82/BUILD
+ rm -rf /tmp/B.rk321j82/tmp /tmp/B.rk321j82/BUILD
+ rm -rf /tmp/B.rk321j82
Begin-PLD-Builder-Info
Build-Time: user:20.10s sys:6.40s real:24.66s (faults io:3 non-io:1206389)

End-PLD-Builder-Info
[Back to list of logs] [View rpm -qa of builder]