FailedOk

th/SRPMS[OK]
th/x32[OK]
th/i686[OK]
th/x86_64[OK]

ac/SRPMS[OK]
ac/i386[OK]
ac/i586[OK]
ac/i686[OK]
ac/alpha[OK]
ac/amd64[OK]
ac/athlon[OK]
ac/ppc[OK]
ac/sparc[OK]
ac/sparc64[OK]

Advanced Search
main()
Powered by PLD Linux
(c) 2002-2024 PLD Team
$Revision: 1.37 $
Powered by /dev/drzewo.
Your IP: 3.235.182.206

perl-XML-GDOME 04c9cc45-d871-47eb-a232-706292d65073

Status:Failed
Source URL:https://buildlogs.pld-linux.org/pld/th/x32/FAIL/perl-XML-GDOME,04c9cc45-d871-47eb-a232-706292d65073.bz2
text/plain URL:View!
rpm -qa of builder:View!
Date:2024/06/30 13:55:03
Runtime:0:00:01.467512

Toc:

  • prep
  • Executing(%prep): /bin/sh -e /tmp/B.jbc_j5t1/BUILD/tmp/rpm-tmp.MmNnni
  • build
  • Executing(%build): /bin/sh -e /tmp/B.jbc_j5t1/BUILD/tmp/rpm-tmp.FtCLRp
  • error 1
  • dom.h:4:1: error: unknown type name 'xmlChar'
  • error 2
  • dom.h:7:46: error: unknown type name 'xmlChar'
  • error 3
  • GDOME.xs:24:3: error: unknown type name 'xmlNode'
  • error 4
  • GDOME.xs:27:3: error: unknown type name 'xmlNs'
  • error 5
  • GDOME.xs:30:1: error: unknown type name 'xmlNs'
  • error 6
  • GDOME.xs:30:35: error: unknown type name 'xmlAttr'
  • error 7
  • GDOME.xs:575:9: error: unknown type name 'xmlNs'
  • error 8
  • GDOME.xs:578:20: error: request for member 'type' in something not a structure or union
  • error 9
  • GDOME.xs:578:30: error: 'XML_ATTRIBUTE_NODE' undeclared (first use in this function); did you mean 'GDOME_ATTRIBUTE_NODE'?
  • error 10
  • GDOME.xs:579:42: error: 'xmlAttr' undeclared (first use in this function)
  • error 11
  • GDOME.xs:579:51: error: expected expression before ')' token
  • error 12
  • GDOME.xs:584:27: error: request for member 'type' in something not a structure or union
  • error 13
  • GDOME.xs:584:37: error: 'XML_NAMESPACE_DECL' undeclared (first use in this function)
  • error 14
  • GDOME.xs:585:33: error: request for member 'ns' in something not a structure or union
  • error 15
  • GDOME.xs:596:9: error: unknown type name 'xmlBufferPtr'
  • error 16
  • GDOME.xs:601:37: error: request for member 'doc' in something not a structure or union
  • error 17
  • GDOME.xs:602:20: error: invalid type argument of '->' (have 'int')
  • error 18
  • GDOME.xs:603:35: error: invalid type argument of '->' (have 'int')
  • error 19
  • GDOME.xs:607:21: error: request for member 'doc' in something not a structure or union
  • error 20
  • GDOME.xs:608:13: error: unknown type name 'xmlChar'
  • error 21
  • GDOME.xs:608:59: error: request for member 'doc' in something not a structure or union
  • error 22
  • GDOME.xs:630:21: error: request for member 'doc' in something not a structure or union
  • error 23
  • GDOME.xs:631:13: error: unknown type name 'xmlChar'
  • error 24
  • GDOME.xs:631:59: error: request for member 'doc' in something not a structure or union
  • error 25
  • GDOME.xs:1116:29: error: 'xmlDocPtr' undeclared (first use in this function); did you mean 'xmlErrorPtr'?
  • error 26
  • GDOME.xs:1116:39: error: expected ')' before 'priv'
  • error 27
  • GDOME.xs:315:32: error: 'xmlInputMatchCallback' undeclared (first use in this function)
  • error 28
  • GDOME.xs:315:54: error: expected ')' before 'GDOMEPerl_input_match'
  • error 29
  • error: Bad exit status from /tmp/B.jbc_j5t1/BUILD/tmp/rpm-tmp.FtCLRp (%build)
  • error 30
  • RPM build errors:
  • error 31
  • error: No files produced.

Content:

request from: atler
checking if we should skip the build
started at: Sun Jun 30 13:54:59 2024
killing old processes on a builder
sending signal 9 to pid -1
cleaning up /tmp
fetching https://srcbuilder.pld-linux.org/th//srpms/04c9cc45-d871-47eb-a232-706292d65073/perl-XML-GDOME-0.86-19.src.rpm
fetched 56338 bytes, 212.6 K/s
installing srpm: perl-XML-GDOME-0.86-19.src.rpm
+ install -d /tmp/B.jbc_j5t1/BUILD /tmp/B.jbc_j5t1/RPMS
+ LC_ALL=en_US.UTF-8
+ rpm -qp --changelog perl-XML-GDOME-0.86-19.src.rpm
* Sun Jun 30 2024 PLD Linux Team <feedback@pld-linux.org>
- For complete changelog see: http://git.pld-linux.org/?p=packages/perl-XML-GDOME.git;a=log;h=master
* Thu Jul 06 2023 Jan Palus <atler@pld-linux.org> 6ccc2af
- perl 5.38.0 rebuild * Mon Aug 22 2022 Jan Palus <atler@pld-linux.org> de147a5
- perl 5.36.0 rebuild * Sun Feb 27 2022 Jan Rękorajski <baggins@pld-linux.org> f963d97
- rebuild with perl 5.34.0 * Fri May 07 2021 Jan Rękorajski <baggins@pld-linux.org> 2bb1086
- rebuild with perl 5.32 * Sat Jan 25 2020 Jan Rękorajski <baggins@pld-linux.org> 4719c02
- drop obsolete and outdated manual inclusion of rpm macros * Wed Dec 04 2019 Jan Rękorajski <baggins@pld-linux.org> 16a6e1a
- rebuild with perl 5.30.0 - release 15 (by relup.sh) * Thu Aug 30 2018 Jan Rękorajski <baggins@pld-linux.org> d03973d
- rebuild with perl 5.28.0 - release 14 (by relup.sh) * Sun Jun 11 2017 Jan Rękorajski <baggins@pld-linux.org> 981962f
- perl req/prov fix - release 13 (by relup.sh) * Sun Jun 11 2017 Jan Rękorajski <baggins@pld-linux.org> 3eee1c5
- rebuild with perl 5.26 - release 12 (by relup.sh) * Sun Oct 30 2016 Jan Rękorajski <baggins@pld-linux.org> 2e99c64
- rebuild with perl 5.24.0 - release 11 (by relup.sh) * Thu Dec 24 2015 Jan Rękorajski <baggins@pld-linux.org> 56b86f3
- release 10 (by relup.sh) * Thu Feb 26 2015 Jan Rękorajski <baggins@pld-linux.org> f1b2168
- x32 rebuild - release 9 (by relup.sh) * Sat Sep 13 2014 Jan Rękorajski <baggins@pld-linux.org> 7a6d1eb
- release 8 (by relup.sh) * Sat Sep 13 2014 Jan Rękorajski <baggins@pld-linux.org> 684448d
- removed zero-sized .bs file * Fri Sep 12 2014 Jan Rękorajski <baggins@pld-linux.org> 28a4f41
- rebuild for perl 5.20 - release 7 (by relup.sh) * Sat Jun 08 2013 Jan Rękorajski <baggins@pld-linux.org> 4ddbb03
- rebuild with perl 5.18.0 - release 6 (by relup.sh) * Wed Feb 02 2011 sparky <sparky@pld-linux.org> 98f7a09
- BR: glib-devel * Sun Jun 06 2010 Arkadiusz Miśkiewicz <arekm@maven.pl> d4345f3
- release 5 * Tue Mar 25 2008 Jakub Bogusz <qboosh@pld-linux.org> 56a8a3d
- generic URL * Sun Mar 02 2008 radek <radek@pld-linux.org> 38431c2
- release 4 + rpm -Uhv --nodeps --define '_topdir /tmp/B.jbc_j5t1' --define '_specdir %{_topdir}' --define '_sourcedir %{_specdir}' --define '_rpmdir %{_topdir}/RPMS' --define '_builddir %{_topdir}/BUILD' perl-XML-GDOME-0.86-19.src.rpm Updating / installing... perl-XML-GDOME-0.86-19 ######################################## + rm -f perl-XML-GDOME-0.86-19.src.rpm + install -m 700 -d /tmp/B.jbc_j5t1/BUILD/tmp + TMPDIR=/tmp/B.jbc_j5t1/BUILD/tmp + exec nice -n 0 rpmbuild -bp --short-circuit --nodeps --define '_topdir /tmp/B.jbc_j5t1' --define '_specdir %{_topdir}' --define '_sourcedir %{_specdir}' --define '_rpmdir %{_topdir}/RPMS' --define '_builddir %{_topdir}/BUILD' --target x32-pld-linux --define 'prep exit 0' /tmp/B.jbc_j5t1/perl-XML-GDOME.spec Building target platforms: x32-pld-linux Building for target x32-pld-linux checking BuildConflict-ing packages rpm: Building target platforms: x32-pld-linux rpm: Building for target x32-pld-linux no BuildConflicts found checking BR rpm: Building target platforms: x32-pld-linux rpm: Building for target x32-pld-linux no BR needed building RPM using: set -ex; : build-id: 04c9cc45-d871-47eb-a232-706292d65073; TMPDIR=/tmp/B.jbc_j5t1/BUILD/tmp exec nice -n 0 rpmbuild -bb --define '__jobs 28' --define '_smp_mflags -j28' --define '_make_opts -Otarget' --define '_pld_builder 1' --define '_topdir /tmp/B.jbc_j5t1' --define '_specdir %{_topdir}' --define '_sourcedir %{_specdir}' --define '_rpmdir %{_topdir}/RPMS' --define '_builddir %{_topdir}/BUILD' --target x32-pld-linux /tmp/B.jbc_j5t1/perl-XML-GDOME.spec + : build-id: 04c9cc45-d871-47eb-a232-706292d65073 + TMPDIR=/tmp/B.jbc_j5t1/BUILD/tmp + exec nice -n 0 rpmbuild -bb --define '__jobs 28' --define '_smp_mflags -j28' --define '_make_opts -Otarget' --define '_pld_builder 1' --define '_topdir /tmp/B.jbc_j5t1' --define '_specdir %{_topdir}' --define '_sourcedir %{_specdir}' --define '_rpmdir %{_topdir}/RPMS' --define '_builddir %{_topdir}/BUILD' --target x32-pld-linux /tmp/B.jbc_j5t1/perl-XML-GDOME.spec Building target platforms: x32-pld-linux Building for target x32-pld-linux Executing(%prep): /bin/sh -e /tmp/B.jbc_j5t1/BUILD/tmp/rpm-tmp.MmNnni + umask 022 + cd /tmp/B.jbc_j5t1/BUILD + cd /tmp/B.jbc_j5t1/BUILD + rm -rf XML-GDOME-0.86 + /bin/gzip -dc /tmp/B.jbc_j5t1/XML-GDOME-0.86.tar.gz + /bin/tar -xof - + STATUS=0 + '[' 0 -ne 0 ']' + cd XML-GDOME-0.86 + /bin/chmod -Rf a+rX,u+w,g-w,o-w . + RPM_EC=0 + jobs -p + exit 0 Executing(%build): /bin/sh -e /tmp/B.jbc_j5t1/BUILD/tmp/rpm-tmp.FtCLRp HOME=/home/users/builder PATH=/home/users/builder/GNUstep/Tools:/bin:/usr/bin:/usr/local/bin TMPDIR=/tmp/B.jbc_j5t1/BUILD/tmp + umask 022 + cd /tmp/B.jbc_j5t1/BUILD + cd XML-GDOME-0.86 + /usr/bin/perl Makefile.PL 'INSTALLDIRS=vendor' running gdome-config... Warning: prerequisite XML::LibXML::Common 0 not found. ok Checking if your kit is complete... Looks good Generating a Unix-style Makefile Writing Makefile for XML::GDOME Writing MYMETA.yml and MYMETA.json + /usr/bin/make -Otarget -j28 'CC=x86_64-pld-linux-gnux32-gcc' 'OPTIMIZE=-O2 -fwrapv -pipe -Wformat -Werror=format-security -gdwarf-4 -fno-debug-types-section -fvar-tracking-assignments -g2 -Wp,-D_FORTIFY_SOURCE=2 -fstack-protector-strong --param=ssp-buffer-size=4 -Werror=trampolines -fPIC -mtune=generic -march=x86-64 -gdwarf-4 -fno-debug-types-section -fvar-tracking-assignments -g2 ' Running Mkbootstrap for GDOME () chmod 644 "GDOME.bs" "/usr/bin/perl5.40.0" -MExtUtils::Command::MM -e 'cp_nonempty' -- GDOME.bs blib/arch/auto/XML/GDOME/GDOME.bs 644 cp lib/XML/GDOME/NamedNodeMap.pod blib/lib/XML/GDOME/NamedNodeMap.pod cp lib/XML/GDOME/DocumentFragment.pod blib/lib/XML/GDOME/DocumentFragment.pod cp lib/XML/GDOME/XPath/Result.pod blib/lib/XML/GDOME/XPath/Result.pod cp lib/XML/GDOME.pod blib/lib/XML/GDOME.pod cp lib/XML/GDOME/EntityReference.pod blib/lib/XML/GDOME/EntityReference.pod cp lib/XML/GDOME/XPath/Namespace.pod blib/lib/XML/GDOME/XPath/Namespace.pod cp lib/XML/GDOME/SAX/Builder.pm blib/lib/XML/GDOME/SAX/Builder.pm cp lib/XML/GDOME/CDATASection.pod blib/lib/XML/GDOME/CDATASection.pod cp lib/XML/GDOME/SAX/Parser.pm blib/lib/XML/GDOME/SAX/Parser.pm cp lib/XML/GDOME/ProcessingInstruction.pod blib/lib/XML/GDOME/ProcessingInstruction.pod cp lib/XML/GDOME/Entity.pod blib/lib/XML/GDOME/Entity.pod cp lib/XML/GDOME/Comment.pod blib/lib/XML/GDOME/Comment.pod cp lib/XML/GDOME/Element.pod blib/lib/XML/GDOME/Element.pod cp lib/XML/GDOME/Node.pod blib/lib/XML/GDOME/Node.pod cp GDOME.pm blib/lib/XML/GDOME.pm cp lib/XML/GDOME/XPath/NSResolver.pod blib/lib/XML/GDOME/XPath/NSResolver.pod cp lib/XML/GDOME/NodeList.pod blib/lib/XML/GDOME/NodeList.pod cp lib/XML/GDOME/Notation.pod blib/lib/XML/GDOME/Notation.pod cp lib/XML/GDOME/SAX/Generator.pm blib/lib/XML/GDOME/SAX/Generator.pm cp lib/XML/GDOME/DocumentType.pod blib/lib/XML/GDOME/DocumentType.pod cp lib/XML/GDOME/Document.pod blib/lib/XML/GDOME/Document.pod cp lib/XML/GDOME/XPath/Evaluator.pod blib/lib/XML/GDOME/XPath/Evaluator.pod cp lib/XML/GDOME/Text.pod blib/lib/XML/GDOME/Text.pod cp lib/XML/GDOME/Attr.pod blib/lib/XML/GDOME/Attr.pod cp lib/XML/GDOME/CharacterData.pod blib/lib/XML/GDOME/CharacterData.pod x86_64-pld-linux-gnux32-gcc -c -I/usr/include -I/usr/include/libgdome -I/usr/include/glib-1.2 -I/usr/libx32/glib/include -I/usr/include/libxml2 -D_REENTRANT -D_GNU_SOURCE -fwrapv -fno-strict-aliasing -pipe -fstack-protector-strong -I/usr/local/include -D_LARGEFILE_SOURCE -D_FILE_OFFSET_BITS=64 -O2 -fwrapv -pipe -Wformat -Werror=format-security -gdwarf-4 -fno-debug-types-section -fvar-tracking-assignments -g2 -Wp,-D_FORTIFY_SOURCE=2 -fstack-protector-strong --param=ssp-buffer-size=4 -Werror=trampolines -fPIC -mtune=generic -march=x86-64 -gdwarf-4 -fno-debug-types-section -fvar-tracking-assignments -g2 -DVERSION=\"0.86\" -DXS_VERSION=\"0.86\" -fPIC "-I/usr/libx32/perl5/5.40.0/x86_64-pld-linux-gnux32-thread-multi/CORE" dom.c "/usr/bin/perl5.40.0" "/usr/share/perl5/5.40.0/ExtUtils/xsubpp" -typemap '/usr/share/perl5/5.40.0/ExtUtils/typemap' -typemap '/tmp/B.jbc_j5t1/BUILD/XML-GDOME-0.86/typemap' GDOME.xs > GDOME.xsc mv GDOME.xsc GDOME.c x86_64-pld-linux-gnux32-gcc -c -I/usr/include -I/usr/include/libgdome -I/usr/include/glib-1.2 -I/usr/libx32/glib/include -I/usr/include/libxml2 -D_REENTRANT -D_GNU_SOURCE -fwrapv -fno-strict-aliasing -pipe -fstack-protector-strong -I/usr/local/include -D_LARGEFILE_SOURCE -D_FILE_OFFSET_BITS=64 -O2 -fwrapv -pipe -Wformat -Werror=format-security -gdwarf-4 -fno-debug-types-section -fvar-tracking-assignments -g2 -Wp,-D_FORTIFY_SOURCE=2 -fstack-protector-strong --param=ssp-buffer-size=4 -Werror=trampolines -fPIC -mtune=generic -march=x86-64 -gdwarf-4 -fno-debug-types-section -fvar-tracking-assignments -g2 -DVERSION=\"0.86\" -DXS_VERSION=\"0.86\" -fPIC "-I/usr/libx32/perl5/5.40.0/x86_64-pld-linux-gnux32-thread-multi/CORE" GDOME.c In file included from GDOME.xs:17: dom.h:4:1: error: unknown type name 'xmlChar' 4 | xmlChar* | ^~~~~~~ dom.h:7:46: error: unknown type name 'xmlChar' 7 | domDecodeString( const char *encoding, const xmlChar *string); | ^~~~~~~ GDOME.xs:24:3: error: unknown type name 'xmlNode' 24 | xmlNode *n; | ^~~~~~~ GDOME.xs:27:3: error: unknown type name 'xmlNs' 27 | xmlNs *ns; | ^~~~~ GDOME.xs:30:1: error: unknown type name 'xmlNs' 30 | xmlNs * gdome_xmlGetNsDeclByAttr (xmlAttr *a); | ^~~~~ GDOME.xs:30:35: error: unknown type name 'xmlAttr' 30 | xmlNs * gdome_xmlGetNsDeclByAttr (xmlAttr *a); | ^~~~~~~ In file included from /usr/libx32/perl5/5.40.0/x86_64-pld-linux-gnux32-thread-multi/CORE/perl.h:6225, from GDOME.xs:7: GDOME.c: In function 'XS_XML__GDOME__DOMImplementation_saveDocToString': GDOME.c:1029:40: warning: implicit declaration of function 'xmlStrlen'; did you mean 'strlen'? [-Wimplicit-function-declaration] 1029 | RETVALSV = newSVpv(RETVAL, xmlStrlen(RETVAL)); | ^~~~~~~~~ /usr/libx32/perl5/5.40.0/x86_64-pld-linux-gnux32-thread-multi/CORE/embed.h:438:70: note: in definition of macro 'newSVpv' 438 | # define newSVpv(a,b) Perl_newSVpv(aTHX_ a,b) | ^ GDOME.xs: In function 'XS_XML__GDOME__Node_gdome_ref': GDOME.xs:575:9: error: unknown type name 'xmlNs' 575 | xmlNs *ns; | ^~~~~ GDOME.xs:578:20: error: request for member 'type' in something not a structure or union 578 | if (priv->n->type == XML_ATTRIBUTE_NODE) { | ^~ GDOME.xs:578:30: error: 'XML_ATTRIBUTE_NODE' undeclared (first use in this function); did you mean 'GDOME_ATTRIBUTE_NODE'? 578 | if (priv->n->type == XML_ATTRIBUTE_NODE) { | ^~~~~~~~~~~~~~~~~~ | GDOME_ATTRIBUTE_NODE GDOME.xs:578:30: note: each undeclared identifier is reported only once for each function it appears in GDOME.xs:579:16: warning: implicit declaration of function 'gdome_xmlGetNsDeclByAttr' [-Wimplicit-function-declaration] 579 | ns = gdome_xmlGetNsDeclByAttr((xmlAttr *)priv->n); | ^~~~~~~~~~~~~~~~~~~~~~~~ GDOME.xs:579:42: error: 'xmlAttr' undeclared (first use in this function) 579 | ns = gdome_xmlGetNsDeclByAttr((xmlAttr *)priv->n); | ^~~~~~~ GDOME.xs:579:51: error: expected expression before ')' token 579 | ns = gdome_xmlGetNsDeclByAttr((xmlAttr *)priv->n); | ^ GDOME.xs:584:27: error: request for member 'type' in something not a structure or union 584 | } else if (priv->n->type == XML_NAMESPACE_DECL) | ^~ GDOME.xs:584:37: error: 'XML_NAMESPACE_DECL' undeclared (first use in this function) 584 | } else if (priv->n->type == XML_NAMESPACE_DECL) | ^~~~~~~~~~~~~~~~~~ GDOME.xs:585:33: error: request for member 'ns' in something not a structure or union 585 | RETVAL = (int) priv->n->ns; | ^~ GDOME.xs: In function 'XS_XML__GDOME__Node_toString': GDOME.xs:596:9: error: unknown type name 'xmlBufferPtr' 596 | xmlBufferPtr buffer; | ^~~~~~~~~~~~ GDOME.xs:600:18: warning: implicit declaration of function 'xmlBufferCreate' [-Wimplicit-function-declaration] 600 | buffer = xmlBufferCreate(); | ^~~~~~~~~~~~~~~ GDOME.xs:601:9: warning: implicit declaration of function 'xmlNodeDump' [-Wimplicit-function-declaration] 601 | xmlNodeDump( buffer, priv->n->doc, priv->n, 0, 0 ); | ^~~~~~~~~~~ GDOME.xs:601:37: error: request for member 'doc' in something not a structure or union 601 | xmlNodeDump( buffer, priv->n->doc, priv->n, 0, 0 ); | ^~ GDOME.xs:602:20: error: invalid type argument of '->' (have 'int') 602 | if ( buffer->content != 0 ) { | ^~ GDOME.xs:603:18: warning: implicit declaration of function 'xmlStrdup' [-Wimplicit-function-declaration] 603 | ret= xmlStrdup( buffer->content ); | ^~~~~~~~~ GDOME.xs:603:35: error: invalid type argument of '->' (have 'int') 603 | ret= xmlStrdup( buffer->content ); | ^~ GDOME.xs:605:9: warning: implicit declaration of function 'xmlBufferFree' [-Wimplicit-function-declaration] 605 | xmlBufferFree( buffer ); | ^~~~~~~~~~~~~ GDOME.xs:607:21: error: request for member 'doc' in something not a structure or union 607 | if ( priv->n->doc != NULL ) { | ^~ GDOME.xs:608:13: error: unknown type name 'xmlChar' 608 | xmlChar *retDecoded = domDecodeString( priv->n->doc->encoding, ret ); | ^~~~~~~ GDOME.xs:608:59: error: request for member 'doc' in something not a structure or union 608 | xmlChar *retDecoded = domDecodeString( priv->n->doc->encoding, ret ); | ^~ GDOME.xs:608:76: warning: passing argument 2 of 'domDecodeString' from incompatible pointer type [-Wincompatible-pointer-types] 608 | xmlChar *retDecoded = domDecodeString( priv->n->doc->encoding, ret ); | ^~~ | | | char * dom.h:7:55: note: expected 'const int *' but argument is of type 'char *' 7 | domDecodeString( const char *encoding, const xmlChar *string); | ~~~~~~~~~~~~~~~^~~~~~ GDOME.xs:609:13: warning: implicit declaration of function 'xmlFree' [-Wimplicit-function-declaration] 609 | xmlFree( ret ); | ^~~~~~~ GDOME.xs:610:20: warning: assignment to 'char *' from incompatible pointer type 'int *' [-Wincompatible-pointer-types] 610 | RETVAL = retDecoded; | ^ GDOME.xs: In function 'XS_XML__GDOME__Node_string_value': GDOME.xs:628:23: warning: implicit declaration of function 'xmlXPathCastNodeToString' [-Wimplicit-function-declaration] 628 | ret = (char *)xmlXPathCastNodeToString(priv->n); | ^~~~~~~~~~~~~~~~~~~~~~~~ GDOME.xs:630:21: error: request for member 'doc' in something not a structure or union 630 | if ( priv->n->doc != NULL ) { | ^~ GDOME.xs:631:13: error: unknown type name 'xmlChar' 631 | xmlChar *retDecoded = domDecodeString( priv->n->doc->encoding, ret ); | ^~~~~~~ GDOME.xs:631:59: error: request for member 'doc' in something not a structure or union 631 | xmlChar *retDecoded = domDecodeString( priv->n->doc->encoding, ret ); | ^~ GDOME.xs:631:76: warning: passing argument 2 of 'domDecodeString' from incompatible pointer type [-Wincompatible-pointer-types] 631 | xmlChar *retDecoded = domDecodeString( priv->n->doc->encoding, ret ); | ^~~ | | | char * dom.h:7:55: note: expected 'const int *' but argument is of type 'char *' 7 | domDecodeString( const char *encoding, const xmlChar *string); | ~~~~~~~~~~~~~~~^~~~~~ GDOME.xs:633:20: warning: assignment to 'char *' from incompatible pointer type 'int *' [-Wincompatible-pointer-types] 633 | RETVAL = retDecoded; | ^ GDOME.xs: In function 'XS_XML__GDOME__Document_process_xinclude': GDOME.xs:1116:9: warning: implicit declaration of function 'xmlXIncludeProcess' [-Wimplicit-function-declaration] 1116 | xmlXIncludeProcess((xmlDocPtr)priv->n); | ^~~~~~~~~~~~~~~~~~ GDOME.xs:1116:29: error: 'xmlDocPtr' undeclared (first use in this function); did you mean 'xmlErrorPtr'? 1116 | xmlXIncludeProcess((xmlDocPtr)priv->n); | ^~~~~~~~~ | xmlErrorPtr GDOME.xs:1116:39: error: expected ')' before 'priv' 1116 | xmlXIncludeProcess((xmlDocPtr)priv->n); | ~ ^~~~ | ) GDOME.xs: In function 'boot_XML__GDOME': GDOME.xs:314:5: warning: implicit declaration of function 'xmlInitParser' [-Wimplicit-function-declaration] 314 | xmlInitParser(); | ^~~~~~~~~~~~~ GDOME.xs:315:5: warning: implicit declaration of function 'xmlRegisterInputCallbacks' [-Wimplicit-function-declaration] 315 | xmlRegisterInputCallbacks((xmlInputMatchCallback) GDOMEPerl_input_match, | ^~~~~~~~~~~~~~~~~~~~~~~~~ GDOME.xs:315:32: error: 'xmlInputMatchCallback' undeclared (first use in this function) 315 | xmlRegisterInputCallbacks((xmlInputMatchCallback) GDOMEPerl_input_match, | ^~~~~~~~~~~~~~~~~~~~~ GDOME.xs:315:54: error: expected ')' before 'GDOMEPerl_input_match' 315 | xmlRegisterInputCallbacks((xmlInputMatchCallback) GDOMEPerl_input_match, | ~ ^~~~~~~~~~~~~~~~~~~~~~ | ) make: *** [Makefile:391: GDOME.o] Error 1 error: Bad exit status from /tmp/B.jbc_j5t1/BUILD/tmp/rpm-tmp.FtCLRp (%build) RPM build errors: Bad exit status from /tmp/B.jbc_j5t1/BUILD/tmp/rpm-tmp.FtCLRp (%build) ended at: Sun Jun 30 13:55:02 2024, done in 0:00:01.467512 error: No files produced. + chmod -R u+rwX /tmp/B.jbc_j5t1/BUILD + rm -rf /tmp/B.jbc_j5t1/tmp /tmp/B.jbc_j5t1/BUILD + rm -rf /tmp/B.jbc_j5t1 Begin-PLD-Builder-Info Build-Time: user:2.71s sys:1.16s real:3.60s (faults io:0 non-io:152130) End-PLD-Builder-Info
[Back to list of logs] [View rpm -qa of builder]