FailedOk

th/SRPMS[OK]
th/x32[OK]
th/i686[OK]
th/x86_64[OK]

ac/SRPMS[OK]
ac/i386[OK]
ac/i586[OK]
ac/i686[OK]
ac/alpha[OK]
ac/amd64[OK]
ac/athlon[OK]
ac/ppc[OK]
ac/sparc[OK]
ac/sparc64[OK]

Advanced Search
main()
Powered by PLD Linux
(c) 2002-2024 PLD Team
$Revision: 1.37 $
Powered by php.
Your IP: 35.172.230.21

perl-threads b6207091-e763-42f8-88a9-816f01ebdc79

Status:Failed
Source URL:https://buildlogs.pld-linux.org/pld/th/x32/FAIL/perl-threads,b6207091-e763-42f8-88a9-816f01ebdc79.bz2
text/plain URL:View!
full text:View!
rpm -qa of builder:View!
Date:2024/06/30 13:55:51
Runtime:0:00:00.911666

Toc:

  • error 1
  • threads.xs:773:50: error: 'PL_no_mem' undeclared (first use in this function); did you mean 'PL_no_aelem'?
  • error 2
  • error: Bad exit status from /tmp/B.d70skonn/BUILD/tmp/rpm-tmp.HF2mj4 (%build)
  • error 3
  • RPM build errors:
  • error 4
  • error: No files produced.

Content:

* Sun Oct 29 2017 Arkadiusz Miśkiewicz <arekm@maven.pl> 3aa29ff
- up to 2.16 * Sun Jun 11 2017 Jan Rękorajski <baggins@pld-linux.org> 215ee44
- perl req/prov fix - release 5 (by relup.sh) * Sun Jun 11 2017 Jan Rękorajski <baggins@pld-linux.org> ab6d565
- rebuild with perl 5.26 - release 4 (by relup.sh) * Sun Oct 30 2016 Jan Rękorajski <baggins@pld-linux.org> 312da76
- rebuild with perl 5.24.0 - release 3 (by relup.sh) * Thu Dec 24 2015 Jan Rękorajski <baggins@pld-linux.org> bb42ab5
- release 2 (by relup.sh) * Thu Jun 11 2015 Elan Ruusamäe <glen@delfi.ee> 920665c
- no examples subdir, verbose files * Wed Jun 10 2015 Arkadiusz Miśkiewicz <arekm@maven.pl> 7a1f11c
- initial + rpm -Uhv --nodeps --define '_topdir /tmp/B.d70skonn' --define '_specdir %{_topdir}' --define '_sourcedir %{_specdir}' --define '_rpmdir %{_topdir}/RPMS' --define '_builddir %{_topdir}/BUILD' perl-threads-2.21-6.src.rpm Updating / installing... perl-threads-2.21-6 ######################################## + rm -f perl-threads-2.21-6.src.rpm + install -m 700 -d /tmp/B.d70skonn/BUILD/tmp + TMPDIR=/tmp/B.d70skonn/BUILD/tmp + exec nice -n 0 rpmbuild -bp --short-circuit --nodeps --define '_topdir /tmp/B.d70skonn' --define '_specdir %{_topdir}' --define '_sourcedir %{_specdir}' --define '_rpmdir %{_topdir}/RPMS' --define '_builddir %{_topdir}/BUILD' --target x32-pld-linux --define 'prep exit 0' /tmp/B.d70skonn/perl-threads.spec Building target platforms: x32-pld-linux Building for target x32-pld-linux checking BuildConflict-ing packages rpm: Building target platforms: x32-pld-linux rpm: Building for target x32-pld-linux no BuildConflicts found checking BR rpm: Building target platforms: x32-pld-linux rpm: Building for target x32-pld-linux no BR needed building RPM using: set -ex; : build-id: b6207091-e763-42f8-88a9-816f01ebdc79; TMPDIR=/tmp/B.d70skonn/BUILD/tmp exec nice -n 0 rpmbuild -bb --define '__jobs 28' --define '_smp_mflags -j28' --define '_make_opts -Otarget' --define '_pld_builder 1' --define '_topdir /tmp/B.d70skonn' --define '_specdir %{_topdir}' --define '_sourcedir %{_specdir}' --define '_rpmdir %{_topdir}/RPMS' --define '_builddir %{_topdir}/BUILD' --target x32-pld-linux /tmp/B.d70skonn/perl-threads.spec + : build-id: b6207091-e763-42f8-88a9-816f01ebdc79 + TMPDIR=/tmp/B.d70skonn/BUILD/tmp + exec nice -n 0 rpmbuild -bb --define '__jobs 28' --define '_smp_mflags -j28' --define '_make_opts -Otarget' --define '_pld_builder 1' --define '_topdir /tmp/B.d70skonn' --define '_specdir %{_topdir}' --define '_sourcedir %{_specdir}' --define '_rpmdir %{_topdir}/RPMS' --define '_builddir %{_topdir}/BUILD' --target x32-pld-linux /tmp/B.d70skonn/perl-threads.spec Building target platforms: x32-pld-linux Building for target x32-pld-linux Executing(%prep): /bin/sh -e /tmp/B.d70skonn/BUILD/tmp/rpm-tmp.JDEWwW + umask 022 + cd /tmp/B.d70skonn/BUILD + cd /tmp/B.d70skonn/BUILD + rm -rf threads-2.21 + /bin/gzip -dc /tmp/B.d70skonn/threads-2.21.tar.gz + /bin/tar -xof - + STATUS=0 + '[' 0 -ne 0 ']' + cd threads-2.21 + /bin/chmod -Rf a+rX,u+w,g-w,o-w . + RPM_EC=0 + jobs -p + exit 0 Executing(%build): /bin/sh -e /tmp/B.d70skonn/BUILD/tmp/rpm-tmp.HF2mj4 HOME=/home/users/builder PATH=/home/users/builder/GNUstep/Tools:/bin:/usr/bin:/usr/local/bin TMPDIR=/tmp/B.d70skonn/BUILD/tmp + umask 022 + cd /tmp/B.d70skonn/BUILD + cd threads-2.21 + /usr/bin/perl Makefile.PL 'INSTALLDIRS=vendor' Checking if your kit is complete... Looks good Generating a Unix-style Makefile Writing Makefile for threads Writing MYMETA.yml and MYMETA.json + /usr/bin/make -Otarget -j28 'CC=x86_64-pld-linux-gnux32-gcc' 'OPTIMIZE=-O2 -fwrapv -pipe -Wformat -Werror=format-security -gdwarf-4 -fno-debug-types-section -fvar-tracking-assignments -g2 -Wp,-D_FORTIFY_SOURCE=2 -fstack-protector-strong --param=ssp-buffer-size=4 -Werror=trampolines -fPIC -mtune=generic -march=x86-64 -gdwarf-4 -fno-debug-types-section -fvar-tracking-assignments -g2 ' Running Mkbootstrap for threads () chmod 644 "threads.bs" cp lib/threads.pm blib/lib/threads.pm "/usr/bin/perl5.40.0" -MExtUtils::Command::MM -e 'cp_nonempty' -- threads.bs blib/arch/auto/threads/threads.bs 644 "/usr/bin/perl5.40.0" "/usr/share/perl5/5.40.0/ExtUtils/xsubpp" -typemap '/usr/share/perl5/5.40.0/ExtUtils/typemap' threads.xs > threads.xsc mv threads.xsc threads.c x86_64-pld-linux-gnux32-gcc -c -D_REENTRANT -D_GNU_SOURCE -fwrapv -fno-strict-aliasing -pipe -fstack-protector-strong -I/usr/local/include -D_LARGEFILE_SOURCE -D_FILE_OFFSET_BITS=64 -O2 -fwrapv -pipe -Wformat -Werror=format-security -gdwarf-4 -fno-debug-types-section -fvar-tracking-assignments -g2 -Wp,-D_FORTIFY_SOURCE=2 -fstack-protector-strong --param=ssp-buffer-size=4 -Werror=trampolines -fPIC -mtune=generic -march=x86-64 -gdwarf-4 -fno-debug-types-section -fvar-tracking-assignments -g2 -DVERSION=\"2.21\" -DXS_VERSION=\"2.21\" -fPIC "-I/usr/libx32/perl5/5.40.0/x86_64-pld-linux-gnux32-thread-multi/CORE" -DHAS_PPPORT_H threads.c In file included from threads.xs:24: ppport.h:4476: warning: "WIDEST_UTYPE" redefined 4476 | # define WIDEST_UTYPE U32 | In file included from /usr/libx32/perl5/5.40.0/x86_64-pld-linux-gnux32-thread-multi/CORE/perl.h:3329, from threads.xs:9: /usr/libx32/perl5/5.40.0/x86_64-pld-linux-gnux32-thread-multi/CORE/handy.h:1422: note: this is the location of the previous definition 1422 | #define WIDEST_UTYPE PERL_UINTMAX_T | ppport.h:6145: warning: "MUTABLE_PTR" redefined 6145 | # define MUTABLE_PTR(p) ({ void *_p = (p); _p; }) | /usr/libx32/perl5/5.40.0/x86_64-pld-linux-gnux32-thread-multi/CORE/handy.h:99: note: this is the location of the previous definition 99 | # define MUTABLE_PTR(p) ({ void *p_ = (p); p_; }) | threads.xs: In function 'S_ithread_create': threads.xs:773:50: error: 'PL_no_mem' undeclared (first use in this function); did you mean 'PL_no_aelem'? 773 | PERL_UNUSED_RESULT(PerlLIO_write(fd, PL_no_mem, strlen(PL_no_mem))); | ^~~~~~~~~ /usr/libx32/perl5/5.40.0/x86_64-pld-linux-gnux32-thread-multi/CORE/perl.h:628:59: note: in definition of macro 'PERL_UNUSED_RESULT' 628 | # define PERL_UNUSED_RESULT(v) STMT_START { __typeof__(v) z = (v); (void)sizeof(z); } STMT_END | ^ threads.xs:773:32: note: in expansion of macro 'PerlLIO_write' 773 | PERL_UNUSED_RESULT(PerlLIO_write(fd, PL_no_mem, strlen(PL_no_mem))); | ^~~~~~~~~~~~~ threads.xs:773:50: note: each undeclared identifier is reported only once for each function it appears in 773 | PERL_UNUSED_RESULT(PerlLIO_write(fd, PL_no_mem, strlen(PL_no_mem))); | ^~~~~~~~~ /usr/libx32/perl5/5.40.0/x86_64-pld-linux-gnux32-thread-multi/CORE/perl.h:628:59: note: in definition of macro 'PERL_UNUSED_RESULT' 628 | # define PERL_UNUSED_RESULT(v) STMT_START { __typeof__(v) z = (v); (void)sizeof(z); } STMT_END | ^ threads.xs:773:32: note: in expansion of macro 'PerlLIO_write' 773 | PERL_UNUSED_RESULT(PerlLIO_write(fd, PL_no_mem, strlen(PL_no_mem))); | ^~~~~~~~~~~~~ make: *** [Makefile:341: threads.o] Error 1 error: Bad exit status from /tmp/B.d70skonn/BUILD/tmp/rpm-tmp.HF2mj4 (%build) RPM build errors: Bad exit status from /tmp/B.d70skonn/BUILD/tmp/rpm-tmp.HF2mj4 (%build) ended at: Sun Jun 30 13:55:51 2024, done in 0:00:00.911666 error: No files produced. + chmod -R u+rwX /tmp/B.d70skonn/BUILD + rm -rf /tmp/B.d70skonn/tmp /tmp/B.d70skonn/BUILD + rm -rf /tmp/B.d70skonn Begin-PLD-Builder-Info Build-Time: user:2.02s sys:1.15s real:3.03s (faults io:0 non-io:143977) End-PLD-Builder-Info
[Back to list of logs] [View rpm -qa of builder]