FailedOk

th/SRPMS[OK]
th/x32[OK]
th/i686[OK]
th/x86_64[OK]

ac/SRPMS[OK]
ac/i386[OK]
ac/i586[OK]
ac/i686[OK]
ac/alpha[OK]
ac/amd64[OK]
ac/athlon[OK]
ac/ppc[OK]
ac/sparc[OK]
ac/sparc64[OK]

Advanced Search
main()
Powered by PLD Linux
(c) 2002-2024 PLD Team
$Revision: 1.37 $
Powered by Przewodniczacego Lepper-a.
Your IP: 44.210.77.73

php 5192a7be-734e-4743-aadb-8bab218a520b

Status:Failed
Source URL:https://buildlogs.pld-linux.org/pld/th/x32/FAIL/php,5192a7be-734e-4743-aadb-8bab218a520b.bz2
text/plain URL:View!
full text:View!
rpm -qa of builder:View!
Date:2023/11/26 14:36:55
Runtime:0:04:28.266196

Toc:

  • error 1
  • /tmp/B.2acy_rzy/BUILD/php-7.2.34/ext/dom/document.c:1590:29: error: 'xmlSaveNoEmptyTags' undeclared (first use in this function)
  • error 2
  • /tmp/B.2acy_rzy/BUILD/php-7.2.34/ext/dom/document.c:1642:37: error: 'xmlSaveNoEmptyTags' undeclared (first use in this function)
  • error 3
  • error: Bad exit status from /tmp/B.2acy_rzy/BUILD/tmp/rpm-tmp.qLE5Tq (%build)
  • error 4
  • RPM build errors:
  • error 5
  • error: No files produced.

Content:

/bin/sh /tmp/B.2acy_rzy/BUILD/php-7.2.34/libtool --silent --preserve-dup-deps --tag=CC --mode=compile x86_64-pld-linux-gnux32-gcc  -Iext/bz2/ -I/tmp/B.2acy_rzy/BUILD/php-7.2.34/ext/bz2/ -DPHP_ATOM_INC -I/tmp/B.2acy_rzy/BUILD/php-7.2.34/include -I/tmp/B.2acy_rzy/BUILD/php-7.2.34/main -I/tmp/B.2acy_rzy/BUILD/php-7.2.34 -I/tmp/B.2acy_rzy/BUILD/php-7.2.34/ext/date/lib -I/usr/include/libxml2 -I/usr/include/enchant -I/usr/include/freetype2 -I/usr/include/libpng16 -I/usr/include/harfbuzz -I/usr/include/glib-2.0 -I/usr/libx32/glib-2.0/include -I/usr/include/imap -I/tmp/B.2acy_rzy/BUILD/php-7.2.34/ext/mbstring/libmbfl -I/tmp/B.2acy_rzy/BUILD/php-7.2.34/ext/mbstring/libmbfl/mbfl -I/usr/include/pspell -I/usr/include/tidy -I/usr/include/xmlrpc-epi -I/tmp/B.2acy_rzy/BUILD/php-7.2.34/TSRM -I/tmp/B.2acy_rzy/BUILD/php-7.2.34/Zend  -DDEBUG_FASTCGI -DHAVE_STRNDUP -I/usr/include/xmlrpc-epi  -I/usr/include -O2 -fwrapv -pipe -Wformat -Werror=format-security -gdwarf-4 -fno-debug-types-section -fvar-tracking-assignments -g2 -Wp,-D_FORTIFY_SOURCE=2 -fstack-protector-strong --param=ssp-buffer-size=4 -Werror=trampolines -fPIC -mtune=generic -march=x86-64 -gdwarf-4 -fno-debug-types-section -fvar-tracking-assignments -g2 -DZEND_SIGNALS    -c /tmp/B.2acy_rzy/BUILD/php-7.2.34/ext/bz2/bz2_filter.c -o ext/bz2/bz2_filter.lo 
/bin/sh /tmp/B.2acy_rzy/BUILD/php-7.2.34/libtool --silent --preserve-dup-deps --tag=CC --mode=compile x86_64-pld-linux-gnux32-gcc -DZEND_ENABLE_STATIC_TSRMLS_CACHE=1 -Iext/xml/ -I/tmp/B.2acy_rzy/BUILD/php-7.2.34/ext/xml/ -DPHP_ATOM_INC -I/tmp/B.2acy_rzy/BUILD/php-7.2.34/include -I/tmp/B.2acy_rzy/BUILD/php-7.2.34/main -I/tmp/B.2acy_rzy/BUILD/php-7.2.34 -I/tmp/B.2acy_rzy/BUILD/php-7.2.34/ext/date/lib -I/usr/include/libxml2 -I/usr/include/enchant -I/usr/include/freetype2 -I/usr/include/libpng16 -I/usr/include/harfbuzz -I/usr/include/glib-2.0 -I/usr/libx32/glib-2.0/include -I/usr/include/imap -I/tmp/B.2acy_rzy/BUILD/php-7.2.34/ext/mbstring/libmbfl -I/tmp/B.2acy_rzy/BUILD/php-7.2.34/ext/mbstring/libmbfl/mbfl -I/usr/include/pspell -I/usr/include/tidy -I/usr/include/xmlrpc-epi -I/tmp/B.2acy_rzy/BUILD/php-7.2.34/TSRM -I/tmp/B.2acy_rzy/BUILD/php-7.2.34/Zend  -DDEBUG_FASTCGI -DHAVE_STRNDUP -I/usr/include/xmlrpc-epi  -I/usr/include -O2 -fwrapv -pipe -Wformat -Werror=format-security -gdwarf-4 -fno-debug-types-section -fvar-tracking-assignments -g2 -Wp,-D_FORTIFY_SOURCE=2 -fstack-protector-strong --param=ssp-buffer-size=4 -Werror=trampolines -fPIC -mtune=generic -march=x86-64 -gdwarf-4 -fno-debug-types-section -fvar-tracking-assignments -g2 -DZEND_SIGNALS    -c /tmp/B.2acy_rzy/BUILD/php-7.2.34/ext/xml/xml.c -o ext/xml/xml.lo 
/bin/sh /tmp/B.2acy_rzy/BUILD/php-7.2.34/libtool --silent --preserve-dup-deps --tag=CC --mode=compile x86_64-pld-linux-gnux32-gcc  -Iext/calendar/ -I/tmp/B.2acy_rzy/BUILD/php-7.2.34/ext/calendar/ -DPHP_ATOM_INC -I/tmp/B.2acy_rzy/BUILD/php-7.2.34/include -I/tmp/B.2acy_rzy/BUILD/php-7.2.34/main -I/tmp/B.2acy_rzy/BUILD/php-7.2.34 -I/tmp/B.2acy_rzy/BUILD/php-7.2.34/ext/date/lib -I/usr/include/libxml2 -I/usr/include/enchant -I/usr/include/freetype2 -I/usr/include/libpng16 -I/usr/include/harfbuzz -I/usr/include/glib-2.0 -I/usr/libx32/glib-2.0/include -I/usr/include/imap -I/tmp/B.2acy_rzy/BUILD/php-7.2.34/ext/mbstring/libmbfl -I/tmp/B.2acy_rzy/BUILD/php-7.2.34/ext/mbstring/libmbfl/mbfl -I/usr/include/pspell -I/usr/include/tidy -I/usr/include/xmlrpc-epi -I/tmp/B.2acy_rzy/BUILD/php-7.2.34/TSRM -I/tmp/B.2acy_rzy/BUILD/php-7.2.34/Zend  -DDEBUG_FASTCGI -DHAVE_STRNDUP -I/usr/include/xmlrpc-epi  -I/usr/include -O2 -fwrapv -pipe -Wformat -Werror=format-security -gdwarf-4 -fno-debug-types-section -fvar-tracking-assignments -g2 -Wp,-D_FORTIFY_SOURCE=2 -fstack-protector-strong --param=ssp-buffer-size=4 -Werror=trampolines -fPIC -mtune=generic -march=x86-64 -gdwarf-4 -fno-debug-types-section -fvar-tracking-assignments -g2 -DZEND_SIGNALS    -c /tmp/B.2acy_rzy/BUILD/php-7.2.34/ext/calendar/calendar.c -o ext/calendar/calendar.lo 
/bin/sh /tmp/B.2acy_rzy/BUILD/php-7.2.34/libtool --silent --preserve-dup-deps --tag=CC --mode=compile x86_64-pld-linux-gnux32-gcc -DZEND_ENABLE_STATIC_TSRMLS_CACHE=1 -Iext/spl/ -I/tmp/B.2acy_rzy/BUILD/php-7.2.34/ext/spl/ -DPHP_ATOM_INC -I/tmp/B.2acy_rzy/BUILD/php-7.2.34/include -I/tmp/B.2acy_rzy/BUILD/php-7.2.34/main -I/tmp/B.2acy_rzy/BUILD/php-7.2.34 -I/tmp/B.2acy_rzy/BUILD/php-7.2.34/ext/date/lib -I/usr/include/libxml2 -I/usr/include/enchant -I/usr/include/freetype2 -I/usr/include/libpng16 -I/usr/include/harfbuzz -I/usr/include/glib-2.0 -I/usr/libx32/glib-2.0/include -I/usr/include/imap -I/tmp/B.2acy_rzy/BUILD/php-7.2.34/ext/mbstring/libmbfl -I/tmp/B.2acy_rzy/BUILD/php-7.2.34/ext/mbstring/libmbfl/mbfl -I/usr/include/pspell -I/usr/include/tidy -I/usr/include/xmlrpc-epi -I/tmp/B.2acy_rzy/BUILD/php-7.2.34/TSRM -I/tmp/B.2acy_rzy/BUILD/php-7.2.34/Zend  -DDEBUG_FASTCGI -DHAVE_STRNDUP -I/usr/include/xmlrpc-epi  -I/usr/include -O2 -fwrapv -pipe -Wformat -Werror=format-security -gdwarf-4 -fno-debug-types-section -fvar-tracking-assignments -g2 -Wp,-D_FORTIFY_SOURCE=2 -fstack-protector-strong --param=ssp-buffer-size=4 -Werror=trampolines -fPIC -mtune=generic -march=x86-64 -gdwarf-4 -fno-debug-types-section -fvar-tracking-assignments -g2 -DZEND_SIGNALS    -c /tmp/B.2acy_rzy/BUILD/php-7.2.34/ext/spl/php_spl.c -o ext/spl/php_spl.lo 
/bin/sh /tmp/B.2acy_rzy/BUILD/php-7.2.34/libtool --silent --preserve-dup-deps --tag=CC --mode=compile x86_64-pld-linux-gnux32-gcc  -Iext/bz2/ -I/tmp/B.2acy_rzy/BUILD/php-7.2.34/ext/bz2/ -DPHP_ATOM_INC -I/tmp/B.2acy_rzy/BUILD/php-7.2.34/include -I/tmp/B.2acy_rzy/BUILD/php-7.2.34/main -I/tmp/B.2acy_rzy/BUILD/php-7.2.34 -I/tmp/B.2acy_rzy/BUILD/php-7.2.34/ext/date/lib -I/usr/include/libxml2 -I/usr/include/enchant -I/usr/include/freetype2 -I/usr/include/libpng16 -I/usr/include/harfbuzz -I/usr/include/glib-2.0 -I/usr/libx32/glib-2.0/include -I/usr/include/imap -I/tmp/B.2acy_rzy/BUILD/php-7.2.34/ext/mbstring/libmbfl -I/tmp/B.2acy_rzy/BUILD/php-7.2.34/ext/mbstring/libmbfl/mbfl -I/usr/include/pspell -I/usr/include/tidy -I/usr/include/xmlrpc-epi -I/tmp/B.2acy_rzy/BUILD/php-7.2.34/TSRM -I/tmp/B.2acy_rzy/BUILD/php-7.2.34/Zend  -DDEBUG_FASTCGI -DHAVE_STRNDUP -I/usr/include/xmlrpc-epi  -I/usr/include -O2 -fwrapv -pipe -Wformat -Werror=format-security -gdwarf-4 -fno-debug-types-section -fvar-tracking-assignments -g2 -Wp,-D_FORTIFY_SOURCE=2 -fstack-protector-strong --param=ssp-buffer-size=4 -Werror=trampolines -fPIC -mtune=generic -march=x86-64 -gdwarf-4 -fno-debug-types-section -fvar-tracking-assignments -g2 -DZEND_SIGNALS    -c /tmp/B.2acy_rzy/BUILD/php-7.2.34/ext/bz2/bz2.c -o ext/bz2/bz2.lo 
/bin/sh /tmp/B.2acy_rzy/BUILD/php-7.2.34/libtool --silent --preserve-dup-deps --tag=CC --mode=compile x86_64-pld-linux-gnux32-gcc  -Iext/curl/ -I/tmp/B.2acy_rzy/BUILD/php-7.2.34/ext/curl/ -DPHP_ATOM_INC -I/tmp/B.2acy_rzy/BUILD/php-7.2.34/include -I/tmp/B.2acy_rzy/BUILD/php-7.2.34/main -I/tmp/B.2acy_rzy/BUILD/php-7.2.34 -I/tmp/B.2acy_rzy/BUILD/php-7.2.34/ext/date/lib -I/usr/include/libxml2 -I/usr/include/enchant -I/usr/include/freetype2 -I/usr/include/libpng16 -I/usr/include/harfbuzz -I/usr/include/glib-2.0 -I/usr/libx32/glib-2.0/include -I/usr/include/imap -I/tmp/B.2acy_rzy/BUILD/php-7.2.34/ext/mbstring/libmbfl -I/tmp/B.2acy_rzy/BUILD/php-7.2.34/ext/mbstring/libmbfl/mbfl -I/usr/include/pspell -I/usr/include/tidy -I/usr/include/xmlrpc-epi -I/tmp/B.2acy_rzy/BUILD/php-7.2.34/TSRM -I/tmp/B.2acy_rzy/BUILD/php-7.2.34/Zend  -DDEBUG_FASTCGI -DHAVE_STRNDUP -I/usr/include/xmlrpc-epi  -I/usr/include -O2 -fwrapv -pipe -Wformat -Werror=format-security -gdwarf-4 -fno-debug-types-section -fvar-tracking-assignments -g2 -Wp,-D_FORTIFY_SOURCE=2 -fstack-protector-strong --param=ssp-buffer-size=4 -Werror=trampolines -fPIC -mtune=generic -march=x86-64 -gdwarf-4 -fno-debug-types-section -fvar-tracking-assignments -g2 -DZEND_SIGNALS    -c /tmp/B.2acy_rzy/BUILD/php-7.2.34/ext/curl/curl_file.c -o ext/curl/curl_file.lo 
/bin/sh /tmp/B.2acy_rzy/BUILD/php-7.2.34/libtool --silent --preserve-dup-deps --tag=CC --mode=compile x86_64-pld-linux-gnux32-gcc  -Iext/dba/ -I/tmp/B.2acy_rzy/BUILD/php-7.2.34/ext/dba/ -DPHP_ATOM_INC -I/tmp/B.2acy_rzy/BUILD/php-7.2.34/include -I/tmp/B.2acy_rzy/BUILD/php-7.2.34/main -I/tmp/B.2acy_rzy/BUILD/php-7.2.34 -I/tmp/B.2acy_rzy/BUILD/php-7.2.34/ext/date/lib -I/usr/include/libxml2 -I/usr/include/enchant -I/usr/include/freetype2 -I/usr/include/libpng16 -I/usr/include/harfbuzz -I/usr/include/glib-2.0 -I/usr/libx32/glib-2.0/include -I/usr/include/imap -I/tmp/B.2acy_rzy/BUILD/php-7.2.34/ext/mbstring/libmbfl -I/tmp/B.2acy_rzy/BUILD/php-7.2.34/ext/mbstring/libmbfl/mbfl -I/usr/include/pspell -I/usr/include/tidy -I/usr/include/xmlrpc-epi -I/tmp/B.2acy_rzy/BUILD/php-7.2.34/TSRM -I/tmp/B.2acy_rzy/BUILD/php-7.2.34/Zend  -DDEBUG_FASTCGI -DHAVE_STRNDUP -I/usr/include/xmlrpc-epi  -I/usr/include -O2 -fwrapv -pipe -Wformat -Werror=format-security -gdwarf-4 -fno-debug-types-section -fvar-tracking-assignments -g2 -Wp,-D_FORTIFY_SOURCE=2 -fstack-protector-strong --param=ssp-buffer-size=4 -Werror=trampolines -fPIC -mtune=generic -march=x86-64 -gdwarf-4 -fno-debug-types-section -fvar-tracking-assignments -g2 -DZEND_SIGNALS    -c /tmp/B.2acy_rzy/BUILD/php-7.2.34/ext/dba/dba_db1.c -o ext/dba/dba_db1.lo 
/bin/sh /tmp/B.2acy_rzy/BUILD/php-7.2.34/libtool --silent --preserve-dup-deps --tag=CC --mode=compile x86_64-pld-linux-gnux32-gcc  -DZEND_ENABLE_STATIC_TSRMLS_CACHE=1  -Iext/sqlite3/ -I/tmp/B.2acy_rzy/BUILD/php-7.2.34/ext/sqlite3/ -DPHP_ATOM_INC -I/tmp/B.2acy_rzy/BUILD/php-7.2.34/include -I/tmp/B.2acy_rzy/BUILD/php-7.2.34/main -I/tmp/B.2acy_rzy/BUILD/php-7.2.34 -I/tmp/B.2acy_rzy/BUILD/php-7.2.34/ext/date/lib -I/usr/include/libxml2 -I/usr/include/enchant -I/usr/include/freetype2 -I/usr/include/libpng16 -I/usr/include/harfbuzz -I/usr/include/glib-2.0 -I/usr/libx32/glib-2.0/include -I/usr/include/imap -I/tmp/B.2acy_rzy/BUILD/php-7.2.34/ext/mbstring/libmbfl -I/tmp/B.2acy_rzy/BUILD/php-7.2.34/ext/mbstring/libmbfl/mbfl -I/usr/include/pspell -I/usr/include/tidy -I/usr/include/xmlrpc-epi -I/tmp/B.2acy_rzy/BUILD/php-7.2.34/TSRM -I/tmp/B.2acy_rzy/BUILD/php-7.2.34/Zend  -DDEBUG_FASTCGI -DHAVE_STRNDUP -I/usr/include/xmlrpc-epi  -I/usr/include -O2 -fwrapv -pipe -Wformat -Werror=format-security -gdwarf-4 -fno-debug-types-section -fvar-tracking-assignments -g2 -Wp,-D_FORTIFY_SOURCE=2 -fstack-protector-strong --param=ssp-buffer-size=4 -Werror=trampolines -fPIC -mtune=generic -march=x86-64 -gdwarf-4 -fno-debug-types-section -fvar-tracking-assignments -g2 -DZEND_SIGNALS    -c /tmp/B.2acy_rzy/BUILD/php-7.2.34/ext/sqlite3/sqlite3.c -o ext/sqlite3/sqlite3.lo 
/bin/sh /tmp/B.2acy_rzy/BUILD/php-7.2.34/libtool --silent --preserve-dup-deps --tag=CC --mode=compile x86_64-pld-linux-gnux32-gcc  -Iext/dba/ -I/tmp/B.2acy_rzy/BUILD/php-7.2.34/ext/dba/ -DPHP_ATOM_INC -I/tmp/B.2acy_rzy/BUILD/php-7.2.34/include -I/tmp/B.2acy_rzy/BUILD/php-7.2.34/main -I/tmp/B.2acy_rzy/BUILD/php-7.2.34 -I/tmp/B.2acy_rzy/BUILD/php-7.2.34/ext/date/lib -I/usr/include/libxml2 -I/usr/include/enchant -I/usr/include/freetype2 -I/usr/include/libpng16 -I/usr/include/harfbuzz -I/usr/include/glib-2.0 -I/usr/libx32/glib-2.0/include -I/usr/include/imap -I/tmp/B.2acy_rzy/BUILD/php-7.2.34/ext/mbstring/libmbfl -I/tmp/B.2acy_rzy/BUILD/php-7.2.34/ext/mbstring/libmbfl/mbfl -I/usr/include/pspell -I/usr/include/tidy -I/usr/include/xmlrpc-epi -I/tmp/B.2acy_rzy/BUILD/php-7.2.34/TSRM -I/tmp/B.2acy_rzy/BUILD/php-7.2.34/Zend  -DDEBUG_FASTCGI -DHAVE_STRNDUP -I/usr/include/xmlrpc-epi  -I/usr/include -O2 -fwrapv -pipe -Wformat -Werror=format-security -gdwarf-4 -fno-debug-types-section -fvar-tracking-assignments -g2 -Wp,-D_FORTIFY_SOURCE=2 -fstack-protector-strong --param=ssp-buffer-size=4 -Werror=trampolines -fPIC -mtune=generic -march=x86-64 -gdwarf-4 -fno-debug-types-section -fvar-tracking-assignments -g2 -DZEND_SIGNALS    -c /tmp/B.2acy_rzy/BUILD/php-7.2.34/ext/dba/dba_dbm.c -o ext/dba/dba_dbm.lo 
/bin/sh /tmp/B.2acy_rzy/BUILD/php-7.2.34/libtool --silent --preserve-dup-deps --tag=CC --mode=compile x86_64-pld-linux-gnux32-gcc  -Iext/dba/ -I/tmp/B.2acy_rzy/BUILD/php-7.2.34/ext/dba/ -DPHP_ATOM_INC -I/tmp/B.2acy_rzy/BUILD/php-7.2.34/include -I/tmp/B.2acy_rzy/BUILD/php-7.2.34/main -I/tmp/B.2acy_rzy/BUILD/php-7.2.34 -I/tmp/B.2acy_rzy/BUILD/php-7.2.34/ext/date/lib -I/usr/include/libxml2 -I/usr/include/enchant -I/usr/include/freetype2 -I/usr/include/libpng16 -I/usr/include/harfbuzz -I/usr/include/glib-2.0 -I/usr/libx32/glib-2.0/include -I/usr/include/imap -I/tmp/B.2acy_rzy/BUILD/php-7.2.34/ext/mbstring/libmbfl -I/tmp/B.2acy_rzy/BUILD/php-7.2.34/ext/mbstring/libmbfl/mbfl -I/usr/include/pspell -I/usr/include/tidy -I/usr/include/xmlrpc-epi -I/tmp/B.2acy_rzy/BUILD/php-7.2.34/TSRM -I/tmp/B.2acy_rzy/BUILD/php-7.2.34/Zend  -DDEBUG_FASTCGI -DHAVE_STRNDUP -I/usr/include/xmlrpc-epi  -I/usr/include -O2 -fwrapv -pipe -Wformat -Werror=format-security -gdwarf-4 -fno-debug-types-section -fvar-tracking-assignments -g2 -Wp,-D_FORTIFY_SOURCE=2 -fstack-protector-strong --param=ssp-buffer-size=4 -Werror=trampolines -fPIC -mtune=generic -march=x86-64 -gdwarf-4 -fno-debug-types-section -fvar-tracking-assignments -g2 -DZEND_SIGNALS    -c /tmp/B.2acy_rzy/BUILD/php-7.2.34/ext/dba/dba_cdb.c -o ext/dba/dba_cdb.lo 
/bin/sh /tmp/B.2acy_rzy/BUILD/php-7.2.34/libtool --silent --preserve-dup-deps --tag=CC --mode=compile x86_64-pld-linux-gnux32-gcc  -Iext/dba/ -I/tmp/B.2acy_rzy/BUILD/php-7.2.34/ext/dba/ -DPHP_ATOM_INC -I/tmp/B.2acy_rzy/BUILD/php-7.2.34/include -I/tmp/B.2acy_rzy/BUILD/php-7.2.34/main -I/tmp/B.2acy_rzy/BUILD/php-7.2.34 -I/tmp/B.2acy_rzy/BUILD/php-7.2.34/ext/date/lib -I/usr/include/libxml2 -I/usr/include/enchant -I/usr/include/freetype2 -I/usr/include/libpng16 -I/usr/include/harfbuzz -I/usr/include/glib-2.0 -I/usr/libx32/glib-2.0/include -I/usr/include/imap -I/tmp/B.2acy_rzy/BUILD/php-7.2.34/ext/mbstring/libmbfl -I/tmp/B.2acy_rzy/BUILD/php-7.2.34/ext/mbstring/libmbfl/mbfl -I/usr/include/pspell -I/usr/include/tidy -I/usr/include/xmlrpc-epi -I/tmp/B.2acy_rzy/BUILD/php-7.2.34/TSRM -I/tmp/B.2acy_rzy/BUILD/php-7.2.34/Zend  -DDEBUG_FASTCGI -DHAVE_STRNDUP -I/usr/include/xmlrpc-epi  -I/usr/include -O2 -fwrapv -pipe -Wformat -Werror=format-security -gdwarf-4 -fno-debug-types-section -fvar-tracking-assignments -g2 -Wp,-D_FORTIFY_SOURCE=2 -fstack-protector-strong --param=ssp-buffer-size=4 -Werror=trampolines -fPIC -mtune=generic -march=x86-64 -gdwarf-4 -fno-debug-types-section -fvar-tracking-assignments -g2 -DZEND_SIGNALS    -c /tmp/B.2acy_rzy/BUILD/php-7.2.34/ext/dba/dba_db2.c -o ext/dba/dba_db2.lo 
/bin/sh /tmp/B.2acy_rzy/BUILD/php-7.2.34/libtool --silent --preserve-dup-deps --tag=CC --mode=compile x86_64-pld-linux-gnux32-gcc  -Iext/dba/ -I/tmp/B.2acy_rzy/BUILD/php-7.2.34/ext/dba/ -DPHP_ATOM_INC -I/tmp/B.2acy_rzy/BUILD/php-7.2.34/include -I/tmp/B.2acy_rzy/BUILD/php-7.2.34/main -I/tmp/B.2acy_rzy/BUILD/php-7.2.34 -I/tmp/B.2acy_rzy/BUILD/php-7.2.34/ext/date/lib -I/usr/include/libxml2 -I/usr/include/enchant -I/usr/include/freetype2 -I/usr/include/libpng16 -I/usr/include/harfbuzz -I/usr/include/glib-2.0 -I/usr/libx32/glib-2.0/include -I/usr/include/imap -I/tmp/B.2acy_rzy/BUILD/php-7.2.34/ext/mbstring/libmbfl -I/tmp/B.2acy_rzy/BUILD/php-7.2.34/ext/mbstring/libmbfl/mbfl -I/usr/include/pspell -I/usr/include/tidy -I/usr/include/xmlrpc-epi -I/tmp/B.2acy_rzy/BUILD/php-7.2.34/TSRM -I/tmp/B.2acy_rzy/BUILD/php-7.2.34/Zend  -DDEBUG_FASTCGI -DHAVE_STRNDUP -I/usr/include/xmlrpc-epi  -I/usr/include -O2 -fwrapv -pipe -Wformat -Werror=format-security -gdwarf-4 -fno-debug-types-section -fvar-tracking-assignments -g2 -Wp,-D_FORTIFY_SOURCE=2 -fstack-protector-strong --param=ssp-buffer-size=4 -Werror=trampolines -fPIC -mtune=generic -march=x86-64 -gdwarf-4 -fno-debug-types-section -fvar-tracking-assignments -g2 -DZEND_SIGNALS    -c /tmp/B.2acy_rzy/BUILD/php-7.2.34/ext/dba/dba_ndbm.c -o ext/dba/dba_ndbm.lo 
/bin/sh /tmp/B.2acy_rzy/BUILD/php-7.2.34/libtool --silent --preserve-dup-deps --tag=CC --mode=compile x86_64-pld-linux-gnux32-gcc  -Iext/curl/ -I/tmp/B.2acy_rzy/BUILD/php-7.2.34/ext/curl/ -DPHP_ATOM_INC -I/tmp/B.2acy_rzy/BUILD/php-7.2.34/include -I/tmp/B.2acy_rzy/BUILD/php-7.2.34/main -I/tmp/B.2acy_rzy/BUILD/php-7.2.34 -I/tmp/B.2acy_rzy/BUILD/php-7.2.34/ext/date/lib -I/usr/include/libxml2 -I/usr/include/enchant -I/usr/include/freetype2 -I/usr/include/libpng16 -I/usr/include/harfbuzz -I/usr/include/glib-2.0 -I/usr/libx32/glib-2.0/include -I/usr/include/imap -I/tmp/B.2acy_rzy/BUILD/php-7.2.34/ext/mbstring/libmbfl -I/tmp/B.2acy_rzy/BUILD/php-7.2.34/ext/mbstring/libmbfl/mbfl -I/usr/include/pspell -I/usr/include/tidy -I/usr/include/xmlrpc-epi -I/tmp/B.2acy_rzy/BUILD/php-7.2.34/TSRM -I/tmp/B.2acy_rzy/BUILD/php-7.2.34/Zend  -DDEBUG_FASTCGI -DHAVE_STRNDUP -I/usr/include/xmlrpc-epi  -I/usr/include -O2 -fwrapv -pipe -Wformat -Werror=format-security -gdwarf-4 -fno-debug-types-section -fvar-tracking-assignments -g2 -Wp,-D_FORTIFY_SOURCE=2 -fstack-protector-strong --param=ssp-buffer-size=4 -Werror=trampolines -fPIC -mtune=generic -march=x86-64 -gdwarf-4 -fno-debug-types-section -fvar-tracking-assignments -g2 -DZEND_SIGNALS    -c /tmp/B.2acy_rzy/BUILD/php-7.2.34/ext/curl/share.c -o ext/curl/share.lo 
/bin/sh /tmp/B.2acy_rzy/BUILD/php-7.2.34/libtool --silent --preserve-dup-deps --tag=CC --mode=compile x86_64-pld-linux-gnux32-gcc  -Iext/dba/ -I/tmp/B.2acy_rzy/BUILD/php-7.2.34/ext/dba/ -DPHP_ATOM_INC -I/tmp/B.2acy_rzy/BUILD/php-7.2.34/include -I/tmp/B.2acy_rzy/BUILD/php-7.2.34/main -I/tmp/B.2acy_rzy/BUILD/php-7.2.34 -I/tmp/B.2acy_rzy/BUILD/php-7.2.34/ext/date/lib -I/usr/include/libxml2 -I/usr/include/enchant -I/usr/include/freetype2 -I/usr/include/libpng16 -I/usr/include/harfbuzz -I/usr/include/glib-2.0 -I/usr/libx32/glib-2.0/include -I/usr/include/imap -I/tmp/B.2acy_rzy/BUILD/php-7.2.34/ext/mbstring/libmbfl -I/tmp/B.2acy_rzy/BUILD/php-7.2.34/ext/mbstring/libmbfl/mbfl -I/usr/include/pspell -I/usr/include/tidy -I/usr/include/xmlrpc-epi -I/tmp/B.2acy_rzy/BUILD/php-7.2.34/TSRM -I/tmp/B.2acy_rzy/BUILD/php-7.2.34/Zend  -DDEBUG_FASTCGI -DHAVE_STRNDUP -I/usr/include/xmlrpc-epi  -I/usr/include -O2 -fwrapv -pipe -Wformat -Werror=format-security -gdwarf-4 -fno-debug-types-section -fvar-tracking-assignments -g2 -Wp,-D_FORTIFY_SOURCE=2 -fstack-protector-strong --param=ssp-buffer-size=4 -Werror=trampolines -fPIC -mtune=generic -march=x86-64 -gdwarf-4 -fno-debug-types-section -fvar-tracking-assignments -g2 -DZEND_SIGNALS    -c /tmp/B.2acy_rzy/BUILD/php-7.2.34/ext/dba/dba_db3.c -o ext/dba/dba_db3.lo 
/bin/sh /tmp/B.2acy_rzy/BUILD/php-7.2.34/libtool --silent --preserve-dup-deps --tag=CC --mode=compile x86_64-pld-linux-gnux32-gcc  -Iext/dba/ -I/tmp/B.2acy_rzy/BUILD/php-7.2.34/ext/dba/ -DPHP_ATOM_INC -I/tmp/B.2acy_rzy/BUILD/php-7.2.34/include -I/tmp/B.2acy_rzy/BUILD/php-7.2.34/main -I/tmp/B.2acy_rzy/BUILD/php-7.2.34 -I/tmp/B.2acy_rzy/BUILD/php-7.2.34/ext/date/lib -I/usr/include/libxml2 -I/usr/include/enchant -I/usr/include/freetype2 -I/usr/include/libpng16 -I/usr/include/harfbuzz -I/usr/include/glib-2.0 -I/usr/libx32/glib-2.0/include -I/usr/include/imap -I/tmp/B.2acy_rzy/BUILD/php-7.2.34/ext/mbstring/libmbfl -I/tmp/B.2acy_rzy/BUILD/php-7.2.34/ext/mbstring/libmbfl/mbfl -I/usr/include/pspell -I/usr/include/tidy -I/usr/include/xmlrpc-epi -I/tmp/B.2acy_rzy/BUILD/php-7.2.34/TSRM -I/tmp/B.2acy_rzy/BUILD/php-7.2.34/Zend  -DDEBUG_FASTCGI -DHAVE_STRNDUP -I/usr/include/xmlrpc-epi  -I/usr/include -O2 -fwrapv -pipe -Wformat -Werror=format-security -gdwarf-4 -fno-debug-types-section -fvar-tracking-assignments -g2 -Wp,-D_FORTIFY_SOURCE=2 -fstack-protector-strong --param=ssp-buffer-size=4 -Werror=trampolines -fPIC -mtune=generic -march=x86-64 -gdwarf-4 -fno-debug-types-section -fvar-tracking-assignments -g2 -DZEND_SIGNALS    -c /tmp/B.2acy_rzy/BUILD/php-7.2.34/ext/dba/dba_gdbm.c -o ext/dba/dba_gdbm.lo 
/tmp/B.2acy_rzy/BUILD/php-7.2.34/ext/dba/dba_gdbm.c: In function 'dba_open_gdbm':
/tmp/B.2acy_rzy/BUILD/php-7.2.34/ext/dba/dba_gdbm.c:69:16: warning: assignment discards 'const' qualifier from pointer target type [-Wdiscarded-qualifiers]
   69 |         *error = gdbm_strerror(gdbm_errno);
      |                ^
/bin/sh /tmp/B.2acy_rzy/BUILD/php-7.2.34/libtool --silent --preserve-dup-deps --tag=CC --mode=compile x86_64-pld-linux-gnux32-gcc  -Iext/dba/ -I/tmp/B.2acy_rzy/BUILD/php-7.2.34/ext/dba/ -DPHP_ATOM_INC -I/tmp/B.2acy_rzy/BUILD/php-7.2.34/include -I/tmp/B.2acy_rzy/BUILD/php-7.2.34/main -I/tmp/B.2acy_rzy/BUILD/php-7.2.34 -I/tmp/B.2acy_rzy/BUILD/php-7.2.34/ext/date/lib -I/usr/include/libxml2 -I/usr/include/enchant -I/usr/include/freetype2 -I/usr/include/libpng16 -I/usr/include/harfbuzz -I/usr/include/glib-2.0 -I/usr/libx32/glib-2.0/include -I/usr/include/imap -I/tmp/B.2acy_rzy/BUILD/php-7.2.34/ext/mbstring/libmbfl -I/tmp/B.2acy_rzy/BUILD/php-7.2.34/ext/mbstring/libmbfl/mbfl -I/usr/include/pspell -I/usr/include/tidy -I/usr/include/xmlrpc-epi -I/tmp/B.2acy_rzy/BUILD/php-7.2.34/TSRM -I/tmp/B.2acy_rzy/BUILD/php-7.2.34/Zend  -DDEBUG_FASTCGI -DHAVE_STRNDUP -I/usr/include/xmlrpc-epi  -I/usr/include -O2 -fwrapv -pipe -Wformat -Werror=format-security -gdwarf-4 -fno-debug-types-section -fvar-tracking-assignments -g2 -Wp,-D_FORTIFY_SOURCE=2 -fstack-protector-strong --param=ssp-buffer-size=4 -Werror=trampolines -fPIC -mtune=generic -march=x86-64 -gdwarf-4 -fno-debug-types-section -fvar-tracking-assignments -g2 -DZEND_SIGNALS    -c /tmp/B.2acy_rzy/BUILD/php-7.2.34/ext/dba/dba_flatfile.c -o ext/dba/dba_flatfile.lo 
/bin/sh /tmp/B.2acy_rzy/BUILD/php-7.2.34/libtool --silent --preserve-dup-deps --tag=CC --mode=compile x86_64-pld-linux-gnux32-gcc  -Iext/openssl/ -I/tmp/B.2acy_rzy/BUILD/php-7.2.34/ext/openssl/ -DPHP_ATOM_INC -I/tmp/B.2acy_rzy/BUILD/php-7.2.34/include -I/tmp/B.2acy_rzy/BUILD/php-7.2.34/main -I/tmp/B.2acy_rzy/BUILD/php-7.2.34 -I/tmp/B.2acy_rzy/BUILD/php-7.2.34/ext/date/lib -I/usr/include/libxml2 -I/usr/include/enchant -I/usr/include/freetype2 -I/usr/include/libpng16 -I/usr/include/harfbuzz -I/usr/include/glib-2.0 -I/usr/libx32/glib-2.0/include -I/usr/include/imap -I/tmp/B.2acy_rzy/BUILD/php-7.2.34/ext/mbstring/libmbfl -I/tmp/B.2acy_rzy/BUILD/php-7.2.34/ext/mbstring/libmbfl/mbfl -I/usr/include/pspell -I/usr/include/tidy -I/usr/include/xmlrpc-epi -I/tmp/B.2acy_rzy/BUILD/php-7.2.34/TSRM -I/tmp/B.2acy_rzy/BUILD/php-7.2.34/Zend  -DDEBUG_FASTCGI -DHAVE_STRNDUP -I/usr/include/xmlrpc-epi  -I/usr/include -O2 -fwrapv -pipe -Wformat -Werror=format-security -gdwarf-4 -fno-debug-types-section -fvar-tracking-assignments -g2 -Wp,-D_FORTIFY_SOURCE=2 -fstack-protector-strong --param=ssp-buffer-size=4 -Werror=trampolines -fPIC -mtune=generic -march=x86-64 -gdwarf-4 -fno-debug-types-section -fvar-tracking-assignments -g2 -DZEND_SIGNALS    -c /tmp/B.2acy_rzy/BUILD/php-7.2.34/ext/openssl/xp_ssl.c -o ext/openssl/xp_ssl.lo 
/tmp/B.2acy_rzy/BUILD/php-7.2.34/ext/openssl/xp_ssl.c: In function 'php_openssl_select_crypto_method':
/tmp/B.2acy_rzy/BUILD/php-7.2.34/ext/openssl/xp_ssl.c:973:17: warning: 'TLSv1_client_method' is deprecated: Since OpenSSL 1.1.0 [-Wdeprecated-declarations]
  973 |                 return is_client ? TLSv1_client_method() : TLSv1_server_method();
      |                 ^~~~~~
In file included from /tmp/B.2acy_rzy/BUILD/php-7.2.34/ext/openssl/xp_ssl.c:34:
/usr/include/openssl/ssl.h:2020:50: note: declared here
 2020 | OSSL_DEPRECATEDIN_1_1_0 __owur const SSL_METHOD *TLSv1_client_method(void);
      |                                                  ^~~~~~~~~~~~~~~~~~~
/tmp/B.2acy_rzy/BUILD/php-7.2.34/ext/openssl/xp_ssl.c:973:17: warning: 'TLSv1_server_method' is deprecated: Since OpenSSL 1.1.0 [-Wdeprecated-declarations]
  973 |                 return is_client ? TLSv1_client_method() : TLSv1_server_method();
      |                 ^~~~~~
/usr/include/openssl/ssl.h:2019:50: note: declared here
 2019 | OSSL_DEPRECATEDIN_1_1_0 __owur const SSL_METHOD *TLSv1_server_method(void);
      |                                                  ^~~~~~~~~~~~~~~~~~~
/tmp/B.2acy_rzy/BUILD/php-7.2.34/ext/openssl/xp_ssl.c:976:17: warning: 'TLSv1_1_client_method' is deprecated: Since OpenSSL 1.1.0 [-Wdeprecated-declarations]
  976 |                 return is_client ? TLSv1_1_client_method() : TLSv1_1_server_method();
      |                 ^~~~~~
/usr/include/openssl/ssl.h:2028:50: note: declared here
 2028 | OSSL_DEPRECATEDIN_1_1_0 __owur const SSL_METHOD *TLSv1_1_client_method(void);
      |                                                  ^~~~~~~~~~~~~~~~~~~~~
/tmp/B.2acy_rzy/BUILD/php-7.2.34/ext/openssl/xp_ssl.c:976:17: warning: 'TLSv1_1_server_method' is deprecated: Since OpenSSL 1.1.0 [-Wdeprecated-declarations]
  976 |                 return is_client ? TLSv1_1_client_method() : TLSv1_1_server_method();
      |                 ^~~~~~
/usr/include/openssl/ssl.h:2027:50: note: declared here
 2027 | OSSL_DEPRECATEDIN_1_1_0 __owur const SSL_METHOD *TLSv1_1_server_method(void);
      |                                                  ^~~~~~~~~~~~~~~~~~~~~
/tmp/B.2acy_rzy/BUILD/php-7.2.34/ext/openssl/xp_ssl.c:984:17: warning: 'TLSv1_2_client_method' is deprecated: Since OpenSSL 1.1.0 [-Wdeprecated-declarations]
  984 |                 return is_client ? TLSv1_2_client_method() : TLSv1_2_server_method();
      |                 ^~~~~~
/usr/include/openssl/ssl.h:2036:50: note: declared here
 2036 | OSSL_DEPRECATEDIN_1_1_0 __owur const SSL_METHOD *TLSv1_2_client_method(void);
      |                                                  ^~~~~~~~~~~~~~~~~~~~~
/tmp/B.2acy_rzy/BUILD/php-7.2.34/ext/openssl/xp_ssl.c:984:17: warning: 'TLSv1_2_server_method' is deprecated: Since OpenSSL 1.1.0 [-Wdeprecated-declarations]
  984 |                 return is_client ? TLSv1_2_client_method() : TLSv1_2_server_method();
      |                 ^~~~~~
/usr/include/openssl/ssl.h:2035:50: note: declared here
 2035 | OSSL_DEPRECATEDIN_1_1_0 __owur const SSL_METHOD *TLSv1_2_server_method(void);
      |                                                  ^~~~~~~~~~~~~~~~~~~~~
/tmp/B.2acy_rzy/BUILD/php-7.2.34/ext/openssl/xp_ssl.c: In function 'php_openssl_set_server_dh_param':
/tmp/B.2acy_rzy/BUILD/php-7.2.34/ext/openssl/xp_ssl.c:1205:9: warning: 'PEM_read_bio_DHparams' is deprecated: Since OpenSSL 3.0 [-Wdeprecated-declarations]
 1205 |         dh = PEM_read_bio_DHparams(bio, NULL, NULL, NULL);
      |         ^~
In file included from /usr/include/openssl/ssl.h:36:
/usr/include/openssl/pem.h:472:1: note: declared here
  472 | DECLARE_PEM_rw_attr(OSSL_DEPRECATEDIN_3_0, DHparams, DH)
      | ^~~~~~~~~~~~~~~~~~~
/tmp/B.2acy_rzy/BUILD/php-7.2.34/ext/openssl/xp_ssl.c:1215:17: warning: 'DH_free' is deprecated: Since OpenSSL 3.0 [-Wdeprecated-declarations]
 1215 |                 DH_free(dh);
      |                 ^~~~~~~
In file included from /usr/include/openssl/dsa.h:31,
                 from /usr/include/openssl/x509.h:37,
                 from /usr/include/openssl/ssl.h:31:
/usr/include/openssl/dh.h:207:28: note: declared here
  207 | OSSL_DEPRECATEDIN_3_0 void DH_free(DH *dh);
      |                            ^~~~~~~
/tmp/B.2acy_rzy/BUILD/php-7.2.34/ext/openssl/xp_ssl.c:1219:9: warning: 'DH_free' is deprecated: Since OpenSSL 3.0 [-Wdeprecated-declarations]
 1219 |         DH_free(dh);
      |         ^~~~~~~
/usr/include/openssl/dh.h:207:28: note: declared here
  207 | OSSL_DEPRECATEDIN_3_0 void DH_free(DH *dh);
      |                            ^~~~~~~
/bin/sh /tmp/B.2acy_rzy/BUILD/php-7.2.34/libtool --silent --preserve-dup-deps --tag=CC --mode=compile x86_64-pld-linux-gnux32-gcc  -Iext/dba/ -I/tmp/B.2acy_rzy/BUILD/php-7.2.34/ext/dba/ -DPHP_ATOM_INC -I/tmp/B.2acy_rzy/BUILD/php-7.2.34/include -I/tmp/B.2acy_rzy/BUILD/php-7.2.34/main -I/tmp/B.2acy_rzy/BUILD/php-7.2.34 -I/tmp/B.2acy_rzy/BUILD/php-7.2.34/ext/date/lib -I/usr/include/libxml2 -I/usr/include/enchant -I/usr/include/freetype2 -I/usr/include/libpng16 -I/usr/include/harfbuzz -I/usr/include/glib-2.0 -I/usr/libx32/glib-2.0/include -I/usr/include/imap -I/tmp/B.2acy_rzy/BUILD/php-7.2.34/ext/mbstring/libmbfl -I/tmp/B.2acy_rzy/BUILD/php-7.2.34/ext/mbstring/libmbfl/mbfl -I/usr/include/pspell -I/usr/include/tidy -I/usr/include/xmlrpc-epi -I/tmp/B.2acy_rzy/BUILD/php-7.2.34/TSRM -I/tmp/B.2acy_rzy/BUILD/php-7.2.34/Zend  -DDEBUG_FASTCGI -DHAVE_STRNDUP -I/usr/include/xmlrpc-epi  -I/usr/include -O2 -fwrapv -pipe -Wformat -Werror=format-security -gdwarf-4 -fno-debug-types-section -fvar-tracking-assignments -g2 -Wp,-D_FORTIFY_SOURCE=2 -fstack-protector-strong --param=ssp-buffer-size=4 -Werror=trampolines -fPIC -mtune=generic -march=x86-64 -gdwarf-4 -fno-debug-types-section -fvar-tracking-assignments -g2 -DZEND_SIGNALS    -c /tmp/B.2acy_rzy/BUILD/php-7.2.34/ext/dba/dba_lmdb.c -o ext/dba/dba_lmdb.lo 
/bin/sh /tmp/B.2acy_rzy/BUILD/php-7.2.34/libtool --silent --preserve-dup-deps --tag=CC --mode=compile x86_64-pld-linux-gnux32-gcc  -Iext/curl/ -I/tmp/B.2acy_rzy/BUILD/php-7.2.34/ext/curl/ -DPHP_ATOM_INC -I/tmp/B.2acy_rzy/BUILD/php-7.2.34/include -I/tmp/B.2acy_rzy/BUILD/php-7.2.34/main -I/tmp/B.2acy_rzy/BUILD/php-7.2.34 -I/tmp/B.2acy_rzy/BUILD/php-7.2.34/ext/date/lib -I/usr/include/libxml2 -I/usr/include/enchant -I/usr/include/freetype2 -I/usr/include/libpng16 -I/usr/include/harfbuzz -I/usr/include/glib-2.0 -I/usr/libx32/glib-2.0/include -I/usr/include/imap -I/tmp/B.2acy_rzy/BUILD/php-7.2.34/ext/mbstring/libmbfl -I/tmp/B.2acy_rzy/BUILD/php-7.2.34/ext/mbstring/libmbfl/mbfl -I/usr/include/pspell -I/usr/include/tidy -I/usr/include/xmlrpc-epi -I/tmp/B.2acy_rzy/BUILD/php-7.2.34/TSRM -I/tmp/B.2acy_rzy/BUILD/php-7.2.34/Zend  -DDEBUG_FASTCGI -DHAVE_STRNDUP -I/usr/include/xmlrpc-epi  -I/usr/include -O2 -fwrapv -pipe -Wformat -Werror=format-security -gdwarf-4 -fno-debug-types-section -fvar-tracking-assignments -g2 -Wp,-D_FORTIFY_SOURCE=2 -fstack-protector-strong --param=ssp-buffer-size=4 -Werror=trampolines -fPIC -mtune=generic -march=x86-64 -gdwarf-4 -fno-debug-types-section -fvar-tracking-assignments -g2 -DZEND_SIGNALS    -c /tmp/B.2acy_rzy/BUILD/php-7.2.34/ext/curl/multi.c -o ext/curl/multi.lo 
/bin/sh /tmp/B.2acy_rzy/BUILD/php-7.2.34/libtool --silent --preserve-dup-deps --tag=CC --mode=compile x86_64-pld-linux-gnux32-gcc  -Iext/dba/ -I/tmp/B.2acy_rzy/BUILD/php-7.2.34/ext/dba/ -DPHP_ATOM_INC -I/tmp/B.2acy_rzy/BUILD/php-7.2.34/include -I/tmp/B.2acy_rzy/BUILD/php-7.2.34/main -I/tmp/B.2acy_rzy/BUILD/php-7.2.34 -I/tmp/B.2acy_rzy/BUILD/php-7.2.34/ext/date/lib -I/usr/include/libxml2 -I/usr/include/enchant -I/usr/include/freetype2 -I/usr/include/libpng16 -I/usr/include/harfbuzz -I/usr/include/glib-2.0 -I/usr/libx32/glib-2.0/include -I/usr/include/imap -I/tmp/B.2acy_rzy/BUILD/php-7.2.34/ext/mbstring/libmbfl -I/tmp/B.2acy_rzy/BUILD/php-7.2.34/ext/mbstring/libmbfl/mbfl -I/usr/include/pspell -I/usr/include/tidy -I/usr/include/xmlrpc-epi -I/tmp/B.2acy_rzy/BUILD/php-7.2.34/TSRM -I/tmp/B.2acy_rzy/BUILD/php-7.2.34/Zend  -DDEBUG_FASTCGI -DHAVE_STRNDUP -I/usr/include/xmlrpc-epi  -I/usr/include -O2 -fwrapv -pipe -Wformat -Werror=format-security -gdwarf-4 -fno-debug-types-section -fvar-tracking-assignments -g2 -Wp,-D_FORTIFY_SOURCE=2 -fstack-protector-strong --param=ssp-buffer-size=4 -Werror=trampolines -fPIC -mtune=generic -march=x86-64 -gdwarf-4 -fno-debug-types-section -fvar-tracking-assignments -g2 -DZEND_SIGNALS    -c /tmp/B.2acy_rzy/BUILD/php-7.2.34/ext/dba/dba_inifile.c -o ext/dba/dba_inifile.lo 
/bin/sh /tmp/B.2acy_rzy/BUILD/php-7.2.34/libtool --silent --preserve-dup-deps --tag=CC --mode=compile x86_64-pld-linux-gnux32-gcc -DZEND_ENABLE_STATIC_TSRMLS_CACHE=1 -Iext/spl/ -I/tmp/B.2acy_rzy/BUILD/php-7.2.34/ext/spl/ -DPHP_ATOM_INC -I/tmp/B.2acy_rzy/BUILD/php-7.2.34/include -I/tmp/B.2acy_rzy/BUILD/php-7.2.34/main -I/tmp/B.2acy_rzy/BUILD/php-7.2.34 -I/tmp/B.2acy_rzy/BUILD/php-7.2.34/ext/date/lib -I/usr/include/libxml2 -I/usr/include/enchant -I/usr/include/freetype2 -I/usr/include/libpng16 -I/usr/include/harfbuzz -I/usr/include/glib-2.0 -I/usr/libx32/glib-2.0/include -I/usr/include/imap -I/tmp/B.2acy_rzy/BUILD/php-7.2.34/ext/mbstring/libmbfl -I/tmp/B.2acy_rzy/BUILD/php-7.2.34/ext/mbstring/libmbfl/mbfl -I/usr/include/pspell -I/usr/include/tidy -I/usr/include/xmlrpc-epi -I/tmp/B.2acy_rzy/BUILD/php-7.2.34/TSRM -I/tmp/B.2acy_rzy/BUILD/php-7.2.34/Zend  -DDEBUG_FASTCGI -DHAVE_STRNDUP -I/usr/include/xmlrpc-epi  -I/usr/include -O2 -fwrapv -pipe -Wformat -Werror=format-security -gdwarf-4 -fno-debug-types-section -fvar-tracking-assignments -g2 -Wp,-D_FORTIFY_SOURCE=2 -fstack-protector-strong --param=ssp-buffer-size=4 -Werror=trampolines -fPIC -mtune=generic -march=x86-64 -gdwarf-4 -fno-debug-types-section -fvar-tracking-assignments -g2 -DZEND_SIGNALS    -c /tmp/B.2acy_rzy/BUILD/php-7.2.34/ext/spl/spl_array.c -o ext/spl/spl_array.lo 
/bin/sh /tmp/B.2acy_rzy/BUILD/php-7.2.34/libtool --silent --preserve-dup-deps --tag=CC --mode=compile x86_64-pld-linux-gnux32-gcc  -Iext/dba/ -I/tmp/B.2acy_rzy/BUILD/php-7.2.34/ext/dba/ -DPHP_ATOM_INC -I/tmp/B.2acy_rzy/BUILD/php-7.2.34/include -I/tmp/B.2acy_rzy/BUILD/php-7.2.34/main -I/tmp/B.2acy_rzy/BUILD/php-7.2.34 -I/tmp/B.2acy_rzy/BUILD/php-7.2.34/ext/date/lib -I/usr/include/libxml2 -I/usr/include/enchant -I/usr/include/freetype2 -I/usr/include/libpng16 -I/usr/include/harfbuzz -I/usr/include/glib-2.0 -I/usr/libx32/glib-2.0/include -I/usr/include/imap -I/tmp/B.2acy_rzy/BUILD/php-7.2.34/ext/mbstring/libmbfl -I/tmp/B.2acy_rzy/BUILD/php-7.2.34/ext/mbstring/libmbfl/mbfl -I/usr/include/pspell -I/usr/include/tidy -I/usr/include/xmlrpc-epi -I/tmp/B.2acy_rzy/BUILD/php-7.2.34/TSRM -I/tmp/B.2acy_rzy/BUILD/php-7.2.34/Zend  -DDEBUG_FASTCGI -DHAVE_STRNDUP -I/usr/include/xmlrpc-epi  -I/usr/include -O2 -fwrapv -pipe -Wformat -Werror=format-security -gdwarf-4 -fno-debug-types-section -fvar-tracking-assignments -g2 -Wp,-D_FORTIFY_SOURCE=2 -fstack-protector-strong --param=ssp-buffer-size=4 -Werror=trampolines -fPIC -mtune=generic -march=x86-64 -gdwarf-4 -fno-debug-types-section -fvar-tracking-assignments -g2 -DZEND_SIGNALS    -c /tmp/B.2acy_rzy/BUILD/php-7.2.34/ext/dba/dba_qdbm.c -o ext/dba/dba_qdbm.lo 
/bin/sh /tmp/B.2acy_rzy/BUILD/php-7.2.34/libtool --silent --preserve-dup-deps --tag=CC --mode=compile x86_64-pld-linux-gnux32-gcc  -Iext/dba/ -I/tmp/B.2acy_rzy/BUILD/php-7.2.34/ext/dba/ -DPHP_ATOM_INC -I/tmp/B.2acy_rzy/BUILD/php-7.2.34/include -I/tmp/B.2acy_rzy/BUILD/php-7.2.34/main -I/tmp/B.2acy_rzy/BUILD/php-7.2.34 -I/tmp/B.2acy_rzy/BUILD/php-7.2.34/ext/date/lib -I/usr/include/libxml2 -I/usr/include/enchant -I/usr/include/freetype2 -I/usr/include/libpng16 -I/usr/include/harfbuzz -I/usr/include/glib-2.0 -I/usr/libx32/glib-2.0/include -I/usr/include/imap -I/tmp/B.2acy_rzy/BUILD/php-7.2.34/ext/mbstring/libmbfl -I/tmp/B.2acy_rzy/BUILD/php-7.2.34/ext/mbstring/libmbfl/mbfl -I/usr/include/pspell -I/usr/include/tidy -I/usr/include/xmlrpc-epi -I/tmp/B.2acy_rzy/BUILD/php-7.2.34/TSRM -I/tmp/B.2acy_rzy/BUILD/php-7.2.34/Zend  -DDEBUG_FASTCGI -DHAVE_STRNDUP -I/usr/include/xmlrpc-epi  -I/usr/include -O2 -fwrapv -pipe -Wformat -Werror=format-security -gdwarf-4 -fno-debug-types-section -fvar-tracking-assignments -g2 -Wp,-D_FORTIFY_SOURCE=2 -fstack-protector-strong --param=ssp-buffer-size=4 -Werror=trampolines -fPIC -mtune=generic -march=x86-64 -gdwarf-4 -fno-debug-types-section -fvar-tracking-assignments -g2 -DZEND_SIGNALS    -c /tmp/B.2acy_rzy/BUILD/php-7.2.34/ext/dba/libcdb/cdb.c -o ext/dba/libcdb/cdb.lo 
/bin/sh /tmp/B.2acy_rzy/BUILD/php-7.2.34/libtool --silent --preserve-dup-deps --tag=CC --mode=compile x86_64-pld-linux-gnux32-gcc  -Iext/ctype/ -I/tmp/B.2acy_rzy/BUILD/php-7.2.34/ext/ctype/ -DPHP_ATOM_INC -I/tmp/B.2acy_rzy/BUILD/php-7.2.34/include -I/tmp/B.2acy_rzy/BUILD/php-7.2.34/main -I/tmp/B.2acy_rzy/BUILD/php-7.2.34 -I/tmp/B.2acy_rzy/BUILD/php-7.2.34/ext/date/lib -I/usr/include/libxml2 -I/usr/include/enchant -I/usr/include/freetype2 -I/usr/include/libpng16 -I/usr/include/harfbuzz -I/usr/include/glib-2.0 -I/usr/libx32/glib-2.0/include -I/usr/include/imap -I/tmp/B.2acy_rzy/BUILD/php-7.2.34/ext/mbstring/libmbfl -I/tmp/B.2acy_rzy/BUILD/php-7.2.34/ext/mbstring/libmbfl/mbfl -I/usr/include/pspell -I/usr/include/tidy -I/usr/include/xmlrpc-epi -I/tmp/B.2acy_rzy/BUILD/php-7.2.34/TSRM -I/tmp/B.2acy_rzy/BUILD/php-7.2.34/Zend  -DDEBUG_FASTCGI -DHAVE_STRNDUP -I/usr/include/xmlrpc-epi  -I/usr/include -O2 -fwrapv -pipe -Wformat -Werror=format-security -gdwarf-4 -fno-debug-types-section -fvar-tracking-assignments -g2 -Wp,-D_FORTIFY_SOURCE=2 -fstack-protector-strong --param=ssp-buffer-size=4 -Werror=trampolines -fPIC -mtune=generic -march=x86-64 -gdwarf-4 -fno-debug-types-section -fvar-tracking-assignments -g2 -DZEND_SIGNALS    -c /tmp/B.2acy_rzy/BUILD/php-7.2.34/ext/ctype/ctype.c -o ext/ctype/ctype.lo 
/bin/sh /tmp/B.2acy_rzy/BUILD/php-7.2.34/libtool --silent --preserve-dup-deps --tag=CC --mode=compile x86_64-pld-linux-gnux32-gcc  -Iext/dba/ -I/tmp/B.2acy_rzy/BUILD/php-7.2.34/ext/dba/ -DPHP_ATOM_INC -I/tmp/B.2acy_rzy/BUILD/php-7.2.34/include -I/tmp/B.2acy_rzy/BUILD/php-7.2.34/main -I/tmp/B.2acy_rzy/BUILD/php-7.2.34 -I/tmp/B.2acy_rzy/BUILD/php-7.2.34/ext/date/lib -I/usr/include/libxml2 -I/usr/include/enchant -I/usr/include/freetype2 -I/usr/include/libpng16 -I/usr/include/harfbuzz -I/usr/include/glib-2.0 -I/usr/libx32/glib-2.0/include -I/usr/include/imap -I/tmp/B.2acy_rzy/BUILD/php-7.2.34/ext/mbstring/libmbfl -I/tmp/B.2acy_rzy/BUILD/php-7.2.34/ext/mbstring/libmbfl/mbfl -I/usr/include/pspell -I/usr/include/tidy -I/usr/include/xmlrpc-epi -I/tmp/B.2acy_rzy/BUILD/php-7.2.34/TSRM -I/tmp/B.2acy_rzy/BUILD/php-7.2.34/Zend  -DDEBUG_FASTCGI -DHAVE_STRNDUP -I/usr/include/xmlrpc-epi  -I/usr/include -O2 -fwrapv -pipe -Wformat -Werror=format-security -gdwarf-4 -fno-debug-types-section -fvar-tracking-assignments -g2 -Wp,-D_FORTIFY_SOURCE=2 -fstack-protector-strong --param=ssp-buffer-size=4 -Werror=trampolines -fPIC -mtune=generic -march=x86-64 -gdwarf-4 -fno-debug-types-section -fvar-tracking-assignments -g2 -DZEND_SIGNALS    -c /tmp/B.2acy_rzy/BUILD/php-7.2.34/ext/dba/libcdb/uint32.c -o ext/dba/libcdb/uint32.lo 
/bin/sh /tmp/B.2acy_rzy/BUILD/php-7.2.34/libtool --silent --preserve-dup-deps --tag=CC --mode=compile x86_64-pld-linux-gnux32-gcc  -Iext/dba/ -I/tmp/B.2acy_rzy/BUILD/php-7.2.34/ext/dba/ -DPHP_ATOM_INC -I/tmp/B.2acy_rzy/BUILD/php-7.2.34/include -I/tmp/B.2acy_rzy/BUILD/php-7.2.34/main -I/tmp/B.2acy_rzy/BUILD/php-7.2.34 -I/tmp/B.2acy_rzy/BUILD/php-7.2.34/ext/date/lib -I/usr/include/libxml2 -I/usr/include/enchant -I/usr/include/freetype2 -I/usr/include/libpng16 -I/usr/include/harfbuzz -I/usr/include/glib-2.0 -I/usr/libx32/glib-2.0/include -I/usr/include/imap -I/tmp/B.2acy_rzy/BUILD/php-7.2.34/ext/mbstring/libmbfl -I/tmp/B.2acy_rzy/BUILD/php-7.2.34/ext/mbstring/libmbfl/mbfl -I/usr/include/pspell -I/usr/include/tidy -I/usr/include/xmlrpc-epi -I/tmp/B.2acy_rzy/BUILD/php-7.2.34/TSRM -I/tmp/B.2acy_rzy/BUILD/php-7.2.34/Zend  -DDEBUG_FASTCGI -DHAVE_STRNDUP -I/usr/include/xmlrpc-epi  -I/usr/include -O2 -fwrapv -pipe -Wformat -Werror=format-security -gdwarf-4 -fno-debug-types-section -fvar-tracking-assignments -g2 -Wp,-D_FORTIFY_SOURCE=2 -fstack-protector-strong --param=ssp-buffer-size=4 -Werror=trampolines -fPIC -mtune=generic -march=x86-64 -gdwarf-4 -fno-debug-types-section -fvar-tracking-assignments -g2 -DZEND_SIGNALS    -c /tmp/B.2acy_rzy/BUILD/php-7.2.34/ext/dba/dba_db4.c -o ext/dba/dba_db4.lo 
/bin/sh /tmp/B.2acy_rzy/BUILD/php-7.2.34/libtool --silent --preserve-dup-deps --tag=CC --mode=compile x86_64-pld-linux-gnux32-gcc  -Iext/dba/ -I/tmp/B.2acy_rzy/BUILD/php-7.2.34/ext/dba/ -DPHP_ATOM_INC -I/tmp/B.2acy_rzy/BUILD/php-7.2.34/include -I/tmp/B.2acy_rzy/BUILD/php-7.2.34/main -I/tmp/B.2acy_rzy/BUILD/php-7.2.34 -I/tmp/B.2acy_rzy/BUILD/php-7.2.34/ext/date/lib -I/usr/include/libxml2 -I/usr/include/enchant -I/usr/include/freetype2 -I/usr/include/libpng16 -I/usr/include/harfbuzz -I/usr/include/glib-2.0 -I/usr/libx32/glib-2.0/include -I/usr/include/imap -I/tmp/B.2acy_rzy/BUILD/php-7.2.34/ext/mbstring/libmbfl -I/tmp/B.2acy_rzy/BUILD/php-7.2.34/ext/mbstring/libmbfl/mbfl -I/usr/include/pspell -I/usr/include/tidy -I/usr/include/xmlrpc-epi -I/tmp/B.2acy_rzy/BUILD/php-7.2.34/TSRM -I/tmp/B.2acy_rzy/BUILD/php-7.2.34/Zend  -DDEBUG_FASTCGI -DHAVE_STRNDUP -I/usr/include/xmlrpc-epi  -I/usr/include -O2 -fwrapv -pipe -Wformat -Werror=format-security -gdwarf-4 -fno-debug-types-section -fvar-tracking-assignments -g2 -Wp,-D_FORTIFY_SOURCE=2 -fstack-protector-strong --param=ssp-buffer-size=4 -Werror=trampolines -fPIC -mtune=generic -march=x86-64 -gdwarf-4 -fno-debug-types-section -fvar-tracking-assignments -g2 -DZEND_SIGNALS    -c /tmp/B.2acy_rzy/BUILD/php-7.2.34/ext/dba/libflatfile/flatfile.c -o ext/dba/libflatfile/flatfile.lo 
/bin/sh /tmp/B.2acy_rzy/BUILD/php-7.2.34/libtool --silent --preserve-dup-deps --tag=CC --mode=compile x86_64-pld-linux-gnux32-gcc  -Iext/dba/ -I/tmp/B.2acy_rzy/BUILD/php-7.2.34/ext/dba/ -DPHP_ATOM_INC -I/tmp/B.2acy_rzy/BUILD/php-7.2.34/include -I/tmp/B.2acy_rzy/BUILD/php-7.2.34/main -I/tmp/B.2acy_rzy/BUILD/php-7.2.34 -I/tmp/B.2acy_rzy/BUILD/php-7.2.34/ext/date/lib -I/usr/include/libxml2 -I/usr/include/enchant -I/usr/include/freetype2 -I/usr/include/libpng16 -I/usr/include/harfbuzz -I/usr/include/glib-2.0 -I/usr/libx32/glib-2.0/include -I/usr/include/imap -I/tmp/B.2acy_rzy/BUILD/php-7.2.34/ext/mbstring/libmbfl -I/tmp/B.2acy_rzy/BUILD/php-7.2.34/ext/mbstring/libmbfl/mbfl -I/usr/include/pspell -I/usr/include/tidy -I/usr/include/xmlrpc-epi -I/tmp/B.2acy_rzy/BUILD/php-7.2.34/TSRM -I/tmp/B.2acy_rzy/BUILD/php-7.2.34/Zend  -DDEBUG_FASTCGI -DHAVE_STRNDUP -I/usr/include/xmlrpc-epi  -I/usr/include -O2 -fwrapv -pipe -Wformat -Werror=format-security -gdwarf-4 -fno-debug-types-section -fvar-tracking-assignments -g2 -Wp,-D_FORTIFY_SOURCE=2 -fstack-protector-strong --param=ssp-buffer-size=4 -Werror=trampolines -fPIC -mtune=generic -march=x86-64 -gdwarf-4 -fno-debug-types-section -fvar-tracking-assignments -g2 -DZEND_SIGNALS    -c /tmp/B.2acy_rzy/BUILD/php-7.2.34/ext/dba/libcdb/cdb_make.c -o ext/dba/libcdb/cdb_make.lo 
/bin/sh /tmp/B.2acy_rzy/BUILD/php-7.2.34/libtool --silent --preserve-dup-deps --tag=CC --mode=compile x86_64-pld-linux-gnux32-gcc  -Iext/dba/ -I/tmp/B.2acy_rzy/BUILD/php-7.2.34/ext/dba/ -DPHP_ATOM_INC -I/tmp/B.2acy_rzy/BUILD/php-7.2.34/include -I/tmp/B.2acy_rzy/BUILD/php-7.2.34/main -I/tmp/B.2acy_rzy/BUILD/php-7.2.34 -I/tmp/B.2acy_rzy/BUILD/php-7.2.34/ext/date/lib -I/usr/include/libxml2 -I/usr/include/enchant -I/usr/include/freetype2 -I/usr/include/libpng16 -I/usr/include/harfbuzz -I/usr/include/glib-2.0 -I/usr/libx32/glib-2.0/include -I/usr/include/imap -I/tmp/B.2acy_rzy/BUILD/php-7.2.34/ext/mbstring/libmbfl -I/tmp/B.2acy_rzy/BUILD/php-7.2.34/ext/mbstring/libmbfl/mbfl -I/usr/include/pspell -I/usr/include/tidy -I/usr/include/xmlrpc-epi -I/tmp/B.2acy_rzy/BUILD/php-7.2.34/TSRM -I/tmp/B.2acy_rzy/BUILD/php-7.2.34/Zend  -DDEBUG_FASTCGI -DHAVE_STRNDUP -I/usr/include/xmlrpc-epi  -I/usr/include -O2 -fwrapv -pipe -Wformat -Werror=format-security -gdwarf-4 -fno-debug-types-section -fvar-tracking-assignments -g2 -Wp,-D_FORTIFY_SOURCE=2 -fstack-protector-strong --param=ssp-buffer-size=4 -Werror=trampolines -fPIC -mtune=generic -march=x86-64 -gdwarf-4 -fno-debug-types-section -fvar-tracking-assignments -g2 -DZEND_SIGNALS    -c /tmp/B.2acy_rzy/BUILD/php-7.2.34/ext/dba/dba_tcadb.c -o ext/dba/dba_tcadb.lo 
/bin/sh /tmp/B.2acy_rzy/BUILD/php-7.2.34/libtool --silent --preserve-dup-deps --tag=CC --mode=compile x86_64-pld-linux-gnux32-gcc  -Iext/dom/ -I/tmp/B.2acy_rzy/BUILD/php-7.2.34/ext/dom/ -DPHP_ATOM_INC -I/tmp/B.2acy_rzy/BUILD/php-7.2.34/include -I/tmp/B.2acy_rzy/BUILD/php-7.2.34/main -I/tmp/B.2acy_rzy/BUILD/php-7.2.34 -I/tmp/B.2acy_rzy/BUILD/php-7.2.34/ext/date/lib -I/usr/include/libxml2 -I/usr/include/enchant -I/usr/include/freetype2 -I/usr/include/libpng16 -I/usr/include/harfbuzz -I/usr/include/glib-2.0 -I/usr/libx32/glib-2.0/include -I/usr/include/imap -I/tmp/B.2acy_rzy/BUILD/php-7.2.34/ext/mbstring/libmbfl -I/tmp/B.2acy_rzy/BUILD/php-7.2.34/ext/mbstring/libmbfl/mbfl -I/usr/include/pspell -I/usr/include/tidy -I/usr/include/xmlrpc-epi -I/tmp/B.2acy_rzy/BUILD/php-7.2.34/TSRM -I/tmp/B.2acy_rzy/BUILD/php-7.2.34/Zend  -DDEBUG_FASTCGI -DHAVE_STRNDUP -I/usr/include/xmlrpc-epi  -I/usr/include -O2 -fwrapv -pipe -Wformat -Werror=format-security -gdwarf-4 -fno-debug-types-section -fvar-tracking-assignments -g2 -Wp,-D_FORTIFY_SOURCE=2 -fstack-protector-strong --param=ssp-buffer-size=4 -Werror=trampolines -fPIC -mtune=generic -march=x86-64 -gdwarf-4 -fno-debug-types-section -fvar-tracking-assignments -g2 -DZEND_SIGNALS    -c /tmp/B.2acy_rzy/BUILD/php-7.2.34/ext/dom/domerrorhandler.c -o ext/dom/domerrorhandler.lo 
/bin/sh /tmp/B.2acy_rzy/BUILD/php-7.2.34/libtool --silent --preserve-dup-deps --tag=CC --mode=compile x86_64-pld-linux-gnux32-gcc  -Iext/dom/ -I/tmp/B.2acy_rzy/BUILD/php-7.2.34/ext/dom/ -DPHP_ATOM_INC -I/tmp/B.2acy_rzy/BUILD/php-7.2.34/include -I/tmp/B.2acy_rzy/BUILD/php-7.2.34/main -I/tmp/B.2acy_rzy/BUILD/php-7.2.34 -I/tmp/B.2acy_rzy/BUILD/php-7.2.34/ext/date/lib -I/usr/include/libxml2 -I/usr/include/enchant -I/usr/include/freetype2 -I/usr/include/libpng16 -I/usr/include/harfbuzz -I/usr/include/glib-2.0 -I/usr/libx32/glib-2.0/include -I/usr/include/imap -I/tmp/B.2acy_rzy/BUILD/php-7.2.34/ext/mbstring/libmbfl -I/tmp/B.2acy_rzy/BUILD/php-7.2.34/ext/mbstring/libmbfl/mbfl -I/usr/include/pspell -I/usr/include/tidy -I/usr/include/xmlrpc-epi -I/tmp/B.2acy_rzy/BUILD/php-7.2.34/TSRM -I/tmp/B.2acy_rzy/BUILD/php-7.2.34/Zend  -DDEBUG_FASTCGI -DHAVE_STRNDUP -I/usr/include/xmlrpc-epi  -I/usr/include -O2 -fwrapv -pipe -Wformat -Werror=format-security -gdwarf-4 -fno-debug-types-section -fvar-tracking-assignments -g2 -Wp,-D_FORTIFY_SOURCE=2 -fstack-protector-strong --param=ssp-buffer-size=4 -Werror=trampolines -fPIC -mtune=generic -march=x86-64 -gdwarf-4 -fno-debug-types-section -fvar-tracking-assignments -g2 -DZEND_SIGNALS    -c /tmp/B.2acy_rzy/BUILD/php-7.2.34/ext/dom/domexception.c -o ext/dom/domexception.lo 
/bin/sh /tmp/B.2acy_rzy/BUILD/php-7.2.34/libtool --silent --preserve-dup-deps --tag=CC --mode=compile x86_64-pld-linux-gnux32-gcc  -Iext/dom/ -I/tmp/B.2acy_rzy/BUILD/php-7.2.34/ext/dom/ -DPHP_ATOM_INC -I/tmp/B.2acy_rzy/BUILD/php-7.2.34/include -I/tmp/B.2acy_rzy/BUILD/php-7.2.34/main -I/tmp/B.2acy_rzy/BUILD/php-7.2.34 -I/tmp/B.2acy_rzy/BUILD/php-7.2.34/ext/date/lib -I/usr/include/libxml2 -I/usr/include/enchant -I/usr/include/freetype2 -I/usr/include/libpng16 -I/usr/include/harfbuzz -I/usr/include/glib-2.0 -I/usr/libx32/glib-2.0/include -I/usr/include/imap -I/tmp/B.2acy_rzy/BUILD/php-7.2.34/ext/mbstring/libmbfl -I/tmp/B.2acy_rzy/BUILD/php-7.2.34/ext/mbstring/libmbfl/mbfl -I/usr/include/pspell -I/usr/include/tidy -I/usr/include/xmlrpc-epi -I/tmp/B.2acy_rzy/BUILD/php-7.2.34/TSRM -I/tmp/B.2acy_rzy/BUILD/php-7.2.34/Zend  -DDEBUG_FASTCGI -DHAVE_STRNDUP -I/usr/include/xmlrpc-epi  -I/usr/include -O2 -fwrapv -pipe -Wformat -Werror=format-security -gdwarf-4 -fno-debug-types-section -fvar-tracking-assignments -g2 -Wp,-D_FORTIFY_SOURCE=2 -fstack-protector-strong --param=ssp-buffer-size=4 -Werror=trampolines -fPIC -mtune=generic -march=x86-64 -gdwarf-4 -fno-debug-types-section -fvar-tracking-assignments -g2 -DZEND_SIGNALS    -c /tmp/B.2acy_rzy/BUILD/php-7.2.34/ext/dom/namelist.c -o ext/dom/namelist.lo 
/bin/sh /tmp/B.2acy_rzy/BUILD/php-7.2.34/libtool --silent --preserve-dup-deps --tag=CC --mode=compile x86_64-pld-linux-gnux32-gcc  -Iext/dom/ -I/tmp/B.2acy_rzy/BUILD/php-7.2.34/ext/dom/ -DPHP_ATOM_INC -I/tmp/B.2acy_rzy/BUILD/php-7.2.34/include -I/tmp/B.2acy_rzy/BUILD/php-7.2.34/main -I/tmp/B.2acy_rzy/BUILD/php-7.2.34 -I/tmp/B.2acy_rzy/BUILD/php-7.2.34/ext/date/lib -I/usr/include/libxml2 -I/usr/include/enchant -I/usr/include/freetype2 -I/usr/include/libpng16 -I/usr/include/harfbuzz -I/usr/include/glib-2.0 -I/usr/libx32/glib-2.0/include -I/usr/include/imap -I/tmp/B.2acy_rzy/BUILD/php-7.2.34/ext/mbstring/libmbfl -I/tmp/B.2acy_rzy/BUILD/php-7.2.34/ext/mbstring/libmbfl/mbfl -I/usr/include/pspell -I/usr/include/tidy -I/usr/include/xmlrpc-epi -I/tmp/B.2acy_rzy/BUILD/php-7.2.34/TSRM -I/tmp/B.2acy_rzy/BUILD/php-7.2.34/Zend  -DDEBUG_FASTCGI -DHAVE_STRNDUP -I/usr/include/xmlrpc-epi  -I/usr/include -O2 -fwrapv -pipe -Wformat -Werror=format-security -gdwarf-4 -fno-debug-types-section -fvar-tracking-assignments -g2 -Wp,-D_FORTIFY_SOURCE=2 -fstack-protector-strong --param=ssp-buffer-size=4 -Werror=trampolines -fPIC -mtune=generic -march=x86-64 -gdwarf-4 -fno-debug-types-section -fvar-tracking-assignments -g2 -DZEND_SIGNALS    -c /tmp/B.2acy_rzy/BUILD/php-7.2.34/ext/dom/document.c -o ext/dom/document.lo 
/tmp/B.2acy_rzy/BUILD/php-7.2.34/ext/dom/document.c: In function 'zif_dom_document_save':
/tmp/B.2acy_rzy/BUILD/php-7.2.34/ext/dom/document.c:1590:29: error: 'xmlSaveNoEmptyTags' undeclared (first use in this function)
 1590 |                 saveempty = xmlSaveNoEmptyTags;
      |                             ^~~~~~~~~~~~~~~~~~
/tmp/B.2acy_rzy/BUILD/php-7.2.34/ext/dom/document.c:1590:29: note: each undeclared identifier is reported only once for each function it appears in
/tmp/B.2acy_rzy/BUILD/php-7.2.34/ext/dom/document.c: In function 'zif_dom_document_savexml':
/tmp/B.2acy_rzy/BUILD/php-7.2.34/ext/dom/document.c:1642:37: error: 'xmlSaveNoEmptyTags' undeclared (first use in this function)
 1642 |                         saveempty = xmlSaveNoEmptyTags;
      |                                     ^~~~~~~~~~~~~~~~~~
make: *** [Makefile:834: ext/dom/document.lo] Error 1
make: *** Waiting for unfinished jobs....
/bin/sh /tmp/B.2acy_rzy/BUILD/php-7.2.34/libtool --silent --preserve-dup-deps --tag=CC --mode=compile x86_64-pld-linux-gnux32-gcc  -Iext/dom/ -I/tmp/B.2acy_rzy/BUILD/php-7.2.34/ext/dom/ -DPHP_ATOM_INC -I/tmp/B.2acy_rzy/BUILD/php-7.2.34/include -I/tmp/B.2acy_rzy/BUILD/php-7.2.34/main -I/tmp/B.2acy_rzy/BUILD/php-7.2.34 -I/tmp/B.2acy_rzy/BUILD/php-7.2.34/ext/date/lib -I/usr/include/libxml2 -I/usr/include/enchant -I/usr/include/freetype2 -I/usr/include/libpng16 -I/usr/include/harfbuzz -I/usr/include/glib-2.0 -I/usr/libx32/glib-2.0/include -I/usr/include/imap -I/tmp/B.2acy_rzy/BUILD/php-7.2.34/ext/mbstring/libmbfl -I/tmp/B.2acy_rzy/BUILD/php-7.2.34/ext/mbstring/libmbfl/mbfl -I/usr/include/pspell -I/usr/include/tidy -I/usr/include/xmlrpc-epi -I/tmp/B.2acy_rzy/BUILD/php-7.2.34/TSRM -I/tmp/B.2acy_rzy/BUILD/php-7.2.34/Zend  -DDEBUG_FASTCGI -DHAVE_STRNDUP -I/usr/include/xmlrpc-epi  -I/usr/include -O2 -fwrapv -pipe -Wformat -Werror=format-security -gdwarf-4 -fno-debug-types-section -fvar-tracking-assignments -g2 -Wp,-D_FORTIFY_SOURCE=2 -fstack-protector-strong --param=ssp-buffer-size=4 -Werror=trampolines -fPIC -mtune=generic -march=x86-64 -gdwarf-4 -fno-debug-types-section -fvar-tracking-assignments -g2 -DZEND_SIGNALS    -c /tmp/B.2acy_rzy/BUILD/php-7.2.34/ext/dom/attr.c -o ext/dom/attr.lo 
/bin/sh /tmp/B.2acy_rzy/BUILD/php-7.2.34/libtool --silent --preserve-dup-deps --tag=CC --mode=compile x86_64-pld-linux-gnux32-gcc  -Iext/dba/ -I/tmp/B.2acy_rzy/BUILD/php-7.2.34/ext/dba/ -DPHP_ATOM_INC -I/tmp/B.2acy_rzy/BUILD/php-7.2.34/include -I/tmp/B.2acy_rzy/BUILD/php-7.2.34/main -I/tmp/B.2acy_rzy/BUILD/php-7.2.34 -I/tmp/B.2acy_rzy/BUILD/php-7.2.34/ext/date/lib -I/usr/include/libxml2 -I/usr/include/enchant -I/usr/include/freetype2 -I/usr/include/libpng16 -I/usr/include/harfbuzz -I/usr/include/glib-2.0 -I/usr/libx32/glib-2.0/include -I/usr/include/imap -I/tmp/B.2acy_rzy/BUILD/php-7.2.34/ext/mbstring/libmbfl -I/tmp/B.2acy_rzy/BUILD/php-7.2.34/ext/mbstring/libmbfl/mbfl -I/usr/include/pspell -I/usr/include/tidy -I/usr/include/xmlrpc-epi -I/tmp/B.2acy_rzy/BUILD/php-7.2.34/TSRM -I/tmp/B.2acy_rzy/BUILD/php-7.2.34/Zend  -DDEBUG_FASTCGI -DHAVE_STRNDUP -I/usr/include/xmlrpc-epi  -I/usr/include -O2 -fwrapv -pipe -Wformat -Werror=format-security -gdwarf-4 -fno-debug-types-section -fvar-tracking-assignments -g2 -Wp,-D_FORTIFY_SOURCE=2 -fstack-protector-strong --param=ssp-buffer-size=4 -Werror=trampolines -fPIC -mtune=generic -march=x86-64 -gdwarf-4 -fno-debug-types-section -fvar-tracking-assignments -g2 -DZEND_SIGNALS    -c /tmp/B.2acy_rzy/BUILD/php-7.2.34/ext/dba/libinifile/inifile.c -o ext/dba/libinifile/inifile.lo 
/bin/sh /tmp/B.2acy_rzy/BUILD/php-7.2.34/libtool --silent --preserve-dup-deps --tag=CC --mode=compile x86_64-pld-linux-gnux32-gcc  -Iext/dom/ -I/tmp/B.2acy_rzy/BUILD/php-7.2.34/ext/dom/ -DPHP_ATOM_INC -I/tmp/B.2acy_rzy/BUILD/php-7.2.34/include -I/tmp/B.2acy_rzy/BUILD/php-7.2.34/main -I/tmp/B.2acy_rzy/BUILD/php-7.2.34 -I/tmp/B.2acy_rzy/BUILD/php-7.2.34/ext/date/lib -I/usr/include/libxml2 -I/usr/include/enchant -I/usr/include/freetype2 -I/usr/include/libpng16 -I/usr/include/harfbuzz -I/usr/include/glib-2.0 -I/usr/libx32/glib-2.0/include -I/usr/include/imap -I/tmp/B.2acy_rzy/BUILD/php-7.2.34/ext/mbstring/libmbfl -I/tmp/B.2acy_rzy/BUILD/php-7.2.34/ext/mbstring/libmbfl/mbfl -I/usr/include/pspell -I/usr/include/tidy -I/usr/include/xmlrpc-epi -I/tmp/B.2acy_rzy/BUILD/php-7.2.34/TSRM -I/tmp/B.2acy_rzy/BUILD/php-7.2.34/Zend  -DDEBUG_FASTCGI -DHAVE_STRNDUP -I/usr/include/xmlrpc-epi  -I/usr/include -O2 -fwrapv -pipe -Wformat -Werror=format-security -gdwarf-4 -fno-debug-types-section -fvar-tracking-assignments -g2 -Wp,-D_FORTIFY_SOURCE=2 -fstack-protector-strong --param=ssp-buffer-size=4 -Werror=trampolines -fPIC -mtune=generic -march=x86-64 -gdwarf-4 -fno-debug-types-section -fvar-tracking-assignments -g2 -DZEND_SIGNALS    -c /tmp/B.2acy_rzy/BUILD/php-7.2.34/ext/dom/cdatasection.c -o ext/dom/cdatasection.lo 
/bin/sh /tmp/B.2acy_rzy/BUILD/php-7.2.34/libtool --silent --preserve-dup-deps --tag=CC --mode=compile x86_64-pld-linux-gnux32-gcc  -Iext/dom/ -I/tmp/B.2acy_rzy/BUILD/php-7.2.34/ext/dom/ -DPHP_ATOM_INC -I/tmp/B.2acy_rzy/BUILD/php-7.2.34/include -I/tmp/B.2acy_rzy/BUILD/php-7.2.34/main -I/tmp/B.2acy_rzy/BUILD/php-7.2.34 -I/tmp/B.2acy_rzy/BUILD/php-7.2.34/ext/date/lib -I/usr/include/libxml2 -I/usr/include/enchant -I/usr/include/freetype2 -I/usr/include/libpng16 -I/usr/include/harfbuzz -I/usr/include/glib-2.0 -I/usr/libx32/glib-2.0/include -I/usr/include/imap -I/tmp/B.2acy_rzy/BUILD/php-7.2.34/ext/mbstring/libmbfl -I/tmp/B.2acy_rzy/BUILD/php-7.2.34/ext/mbstring/libmbfl/mbfl -I/usr/include/pspell -I/usr/include/tidy -I/usr/include/xmlrpc-epi -I/tmp/B.2acy_rzy/BUILD/php-7.2.34/TSRM -I/tmp/B.2acy_rzy/BUILD/php-7.2.34/Zend  -DDEBUG_FASTCGI -DHAVE_STRNDUP -I/usr/include/xmlrpc-epi  -I/usr/include -O2 -fwrapv -pipe -Wformat -Werror=format-security -gdwarf-4 -fno-debug-types-section -fvar-tracking-assignments -g2 -Wp,-D_FORTIFY_SOURCE=2 -fstack-protector-strong --param=ssp-buffer-size=4 -Werror=trampolines -fPIC -mtune=generic -march=x86-64 -gdwarf-4 -fno-debug-types-section -fvar-tracking-assignments -g2 -DZEND_SIGNALS    -c /tmp/B.2acy_rzy/BUILD/php-7.2.34/ext/dom/domstringlist.c -o ext/dom/domstringlist.lo 
/bin/sh /tmp/B.2acy_rzy/BUILD/php-7.2.34/libtool --silent --preserve-dup-deps --tag=CC --mode=compile x86_64-pld-linux-gnux32-gcc  -Iext/dom/ -I/tmp/B.2acy_rzy/BUILD/php-7.2.34/ext/dom/ -DPHP_ATOM_INC -I/tmp/B.2acy_rzy/BUILD/php-7.2.34/include -I/tmp/B.2acy_rzy/BUILD/php-7.2.34/main -I/tmp/B.2acy_rzy/BUILD/php-7.2.34 -I/tmp/B.2acy_rzy/BUILD/php-7.2.34/ext/date/lib -I/usr/include/libxml2 -I/usr/include/enchant -I/usr/include/freetype2 -I/usr/include/libpng16 -I/usr/include/harfbuzz -I/usr/include/glib-2.0 -I/usr/libx32/glib-2.0/include -I/usr/include/imap -I/tmp/B.2acy_rzy/BUILD/php-7.2.34/ext/mbstring/libmbfl -I/tmp/B.2acy_rzy/BUILD/php-7.2.34/ext/mbstring/libmbfl/mbfl -I/usr/include/pspell -I/usr/include/tidy -I/usr/include/xmlrpc-epi -I/tmp/B.2acy_rzy/BUILD/php-7.2.34/TSRM -I/tmp/B.2acy_rzy/BUILD/php-7.2.34/Zend  -DDEBUG_FASTCGI -DHAVE_STRNDUP -I/usr/include/xmlrpc-epi  -I/usr/include -O2 -fwrapv -pipe -Wformat -Werror=format-security -gdwarf-4 -fno-debug-types-section -fvar-tracking-assignments -g2 -Wp,-D_FORTIFY_SOURCE=2 -fstack-protector-strong --param=ssp-buffer-size=4 -Werror=trampolines -fPIC -mtune=generic -march=x86-64 -gdwarf-4 -fno-debug-types-section -fvar-tracking-assignments -g2 -DZEND_SIGNALS    -c /tmp/B.2acy_rzy/BUILD/php-7.2.34/ext/dom/documentfragment.c -o ext/dom/documentfragment.lo 
/bin/sh /tmp/B.2acy_rzy/BUILD/php-7.2.34/libtool --silent --preserve-dup-deps --tag=CC --mode=compile x86_64-pld-linux-gnux32-gcc  -Iext/dba/ -I/tmp/B.2acy_rzy/BUILD/php-7.2.34/ext/dba/ -DPHP_ATOM_INC -I/tmp/B.2acy_rzy/BUILD/php-7.2.34/include -I/tmp/B.2acy_rzy/BUILD/php-7.2.34/main -I/tmp/B.2acy_rzy/BUILD/php-7.2.34 -I/tmp/B.2acy_rzy/BUILD/php-7.2.34/ext/date/lib -I/usr/include/libxml2 -I/usr/include/enchant -I/usr/include/freetype2 -I/usr/include/libpng16 -I/usr/include/harfbuzz -I/usr/include/glib-2.0 -I/usr/libx32/glib-2.0/include -I/usr/include/imap -I/tmp/B.2acy_rzy/BUILD/php-7.2.34/ext/mbstring/libmbfl -I/tmp/B.2acy_rzy/BUILD/php-7.2.34/ext/mbstring/libmbfl/mbfl -I/usr/include/pspell -I/usr/include/tidy -I/usr/include/xmlrpc-epi -I/tmp/B.2acy_rzy/BUILD/php-7.2.34/TSRM -I/tmp/B.2acy_rzy/BUILD/php-7.2.34/Zend  -DDEBUG_FASTCGI -DHAVE_STRNDUP -I/usr/include/xmlrpc-epi  -I/usr/include -O2 -fwrapv -pipe -Wformat -Werror=format-security -gdwarf-4 -fno-debug-types-section -fvar-tracking-assignments -g2 -Wp,-D_FORTIFY_SOURCE=2 -fstack-protector-strong --param=ssp-buffer-size=4 -Werror=trampolines -fPIC -mtune=generic -march=x86-64 -gdwarf-4 -fno-debug-types-section -fvar-tracking-assignments -g2 -DZEND_SIGNALS    -c /tmp/B.2acy_rzy/BUILD/php-7.2.34/ext/dba/dba.c -o ext/dba/dba.lo 
/bin/sh /tmp/B.2acy_rzy/BUILD/php-7.2.34/libtool --silent --preserve-dup-deps --tag=CC --mode=compile x86_64-pld-linux-gnux32-gcc  -Iext/dom/ -I/tmp/B.2acy_rzy/BUILD/php-7.2.34/ext/dom/ -DPHP_ATOM_INC -I/tmp/B.2acy_rzy/BUILD/php-7.2.34/include -I/tmp/B.2acy_rzy/BUILD/php-7.2.34/main -I/tmp/B.2acy_rzy/BUILD/php-7.2.34 -I/tmp/B.2acy_rzy/BUILD/php-7.2.34/ext/date/lib -I/usr/include/libxml2 -I/usr/include/enchant -I/usr/include/freetype2 -I/usr/include/libpng16 -I/usr/include/harfbuzz -I/usr/include/glib-2.0 -I/usr/libx32/glib-2.0/include -I/usr/include/imap -I/tmp/B.2acy_rzy/BUILD/php-7.2.34/ext/mbstring/libmbfl -I/tmp/B.2acy_rzy/BUILD/php-7.2.34/ext/mbstring/libmbfl/mbfl -I/usr/include/pspell -I/usr/include/tidy -I/usr/include/xmlrpc-epi -I/tmp/B.2acy_rzy/BUILD/php-7.2.34/TSRM -I/tmp/B.2acy_rzy/BUILD/php-7.2.34/Zend  -DDEBUG_FASTCGI -DHAVE_STRNDUP -I/usr/include/xmlrpc-epi  -I/usr/include -O2 -fwrapv -pipe -Wformat -Werror=format-security -gdwarf-4 -fno-debug-types-section -fvar-tracking-assignments -g2 -Wp,-D_FORTIFY_SOURCE=2 -fstack-protector-strong --param=ssp-buffer-size=4 -Werror=trampolines -fPIC -mtune=generic -march=x86-64 -gdwarf-4 -fno-debug-types-section -fvar-tracking-assignments -g2 -DZEND_SIGNALS    -c /tmp/B.2acy_rzy/BUILD/php-7.2.34/ext/dom/string_extend.c -o ext/dom/string_extend.lo 
/bin/sh /tmp/B.2acy_rzy/BUILD/php-7.2.34/libtool --silent --preserve-dup-deps --tag=CC --mode=compile x86_64-pld-linux-gnux32-gcc  -Iext/dom/ -I/tmp/B.2acy_rzy/BUILD/php-7.2.34/ext/dom/ -DPHP_ATOM_INC -I/tmp/B.2acy_rzy/BUILD/php-7.2.34/include -I/tmp/B.2acy_rzy/BUILD/php-7.2.34/main -I/tmp/B.2acy_rzy/BUILD/php-7.2.34 -I/tmp/B.2acy_rzy/BUILD/php-7.2.34/ext/date/lib -I/usr/include/libxml2 -I/usr/include/enchant -I/usr/include/freetype2 -I/usr/include/libpng16 -I/usr/include/harfbuzz -I/usr/include/glib-2.0 -I/usr/libx32/glib-2.0/include -I/usr/include/imap -I/tmp/B.2acy_rzy/BUILD/php-7.2.34/ext/mbstring/libmbfl -I/tmp/B.2acy_rzy/BUILD/php-7.2.34/ext/mbstring/libmbfl/mbfl -I/usr/include/pspell -I/usr/include/tidy -I/usr/include/xmlrpc-epi -I/tmp/B.2acy_rzy/BUILD/php-7.2.34/TSRM -I/tmp/B.2acy_rzy/BUILD/php-7.2.34/Zend  -DDEBUG_FASTCGI -DHAVE_STRNDUP -I/usr/include/xmlrpc-epi  -I/usr/include -O2 -fwrapv -pipe -Wformat -Werror=format-security -gdwarf-4 -fno-debug-types-section -fvar-tracking-assignments -g2 -Wp,-D_FORTIFY_SOURCE=2 -fstack-protector-strong --param=ssp-buffer-size=4 -Werror=trampolines -fPIC -mtune=generic -march=x86-64 -gdwarf-4 -fno-debug-types-section -fvar-tracking-assignments -g2 -DZEND_SIGNALS    -c /tmp/B.2acy_rzy/BUILD/php-7.2.34/ext/dom/processinginstruction.c -o ext/dom/processinginstruction.lo 
/bin/sh /tmp/B.2acy_rzy/BUILD/php-7.2.34/libtool --silent --preserve-dup-deps --tag=CC --mode=compile x86_64-pld-linux-gnux32-gcc  -Iext/dom/ -I/tmp/B.2acy_rzy/BUILD/php-7.2.34/ext/dom/ -DPHP_ATOM_INC -I/tmp/B.2acy_rzy/BUILD/php-7.2.34/include -I/tmp/B.2acy_rzy/BUILD/php-7.2.34/main -I/tmp/B.2acy_rzy/BUILD/php-7.2.34 -I/tmp/B.2acy_rzy/BUILD/php-7.2.34/ext/date/lib -I/usr/include/libxml2 -I/usr/include/enchant -I/usr/include/freetype2 -I/usr/include/libpng16 -I/usr/include/harfbuzz -I/usr/include/glib-2.0 -I/usr/libx32/glib-2.0/include -I/usr/include/imap -I/tmp/B.2acy_rzy/BUILD/php-7.2.34/ext/mbstring/libmbfl -I/tmp/B.2acy_rzy/BUILD/php-7.2.34/ext/mbstring/libmbfl/mbfl -I/usr/include/pspell -I/usr/include/tidy -I/usr/include/xmlrpc-epi -I/tmp/B.2acy_rzy/BUILD/php-7.2.34/TSRM -I/tmp/B.2acy_rzy/BUILD/php-7.2.34/Zend  -DDEBUG_FASTCGI -DHAVE_STRNDUP -I/usr/include/xmlrpc-epi  -I/usr/include -O2 -fwrapv -pipe -Wformat -Werror=format-security -gdwarf-4 -fno-debug-types-section -fvar-tracking-assignments -g2 -Wp,-D_FORTIFY_SOURCE=2 -fstack-protector-strong --param=ssp-buffer-size=4 -Werror=trampolines -fPIC -mtune=generic -march=x86-64 -gdwarf-4 -fno-debug-types-section -fvar-tracking-assignments -g2 -DZEND_SIGNALS    -c /tmp/B.2acy_rzy/BUILD/php-7.2.34/ext/dom/comment.c -o ext/dom/comment.lo 
/bin/sh /tmp/B.2acy_rzy/BUILD/php-7.2.34/libtool --silent --preserve-dup-deps --tag=CC --mode=compile x86_64-pld-linux-gnux32-gcc -DZEND_ENABLE_STATIC_TSRMLS_CACHE=1 -Iext/spl/ -I/tmp/B.2acy_rzy/BUILD/php-7.2.34/ext/spl/ -DPHP_ATOM_INC -I/tmp/B.2acy_rzy/BUILD/php-7.2.34/include -I/tmp/B.2acy_rzy/BUILD/php-7.2.34/main -I/tmp/B.2acy_rzy/BUILD/php-7.2.34 -I/tmp/B.2acy_rzy/BUILD/php-7.2.34/ext/date/lib -I/usr/include/libxml2 -I/usr/include/enchant -I/usr/include/freetype2 -I/usr/include/libpng16 -I/usr/include/harfbuzz -I/usr/include/glib-2.0 -I/usr/libx32/glib-2.0/include -I/usr/include/imap -I/tmp/B.2acy_rzy/BUILD/php-7.2.34/ext/mbstring/libmbfl -I/tmp/B.2acy_rzy/BUILD/php-7.2.34/ext/mbstring/libmbfl/mbfl -I/usr/include/pspell -I/usr/include/tidy -I/usr/include/xmlrpc-epi -I/tmp/B.2acy_rzy/BUILD/php-7.2.34/TSRM -I/tmp/B.2acy_rzy/BUILD/php-7.2.34/Zend  -DDEBUG_FASTCGI -DHAVE_STRNDUP -I/usr/include/xmlrpc-epi  -I/usr/include -O2 -fwrapv -pipe -Wformat -Werror=format-security -gdwarf-4 -fno-debug-types-section -fvar-tracking-assignments -g2 -Wp,-D_FORTIFY_SOURCE=2 -fstack-protector-strong --param=ssp-buffer-size=4 -Werror=trampolines -fPIC -mtune=generic -march=x86-64 -gdwarf-4 -fno-debug-types-section -fvar-tracking-assignments -g2 -DZEND_SIGNALS    -c /tmp/B.2acy_rzy/BUILD/php-7.2.34/ext/spl/spl_iterators.c -o ext/spl/spl_iterators.lo 
/bin/sh /tmp/B.2acy_rzy/BUILD/php-7.2.34/libtool --silent --preserve-dup-deps --tag=CC --mode=compile x86_64-pld-linux-gnux32-gcc  -Iext/dom/ -I/tmp/B.2acy_rzy/BUILD/php-7.2.34/ext/dom/ -DPHP_ATOM_INC -I/tmp/B.2acy_rzy/BUILD/php-7.2.34/include -I/tmp/B.2acy_rzy/BUILD/php-7.2.34/main -I/tmp/B.2acy_rzy/BUILD/php-7.2.34 -I/tmp/B.2acy_rzy/BUILD/php-7.2.34/ext/date/lib -I/usr/include/libxml2 -I/usr/include/enchant -I/usr/include/freetype2 -I/usr/include/libpng16 -I/usr/include/harfbuzz -I/usr/include/glib-2.0 -I/usr/libx32/glib-2.0/include -I/usr/include/imap -I/tmp/B.2acy_rzy/BUILD/php-7.2.34/ext/mbstring/libmbfl -I/tmp/B.2acy_rzy/BUILD/php-7.2.34/ext/mbstring/libmbfl/mbfl -I/usr/include/pspell -I/usr/include/tidy -I/usr/include/xmlrpc-epi -I/tmp/B.2acy_rzy/BUILD/php-7.2.34/TSRM -I/tmp/B.2acy_rzy/BUILD/php-7.2.34/Zend  -DDEBUG_FASTCGI -DHAVE_STRNDUP -I/usr/include/xmlrpc-epi  -I/usr/include -O2 -fwrapv -pipe -Wformat -Werror=format-security -gdwarf-4 -fno-debug-types-section -fvar-tracking-assignments -g2 -Wp,-D_FORTIFY_SOURCE=2 -fstack-protector-strong --param=ssp-buffer-size=4 -Werror=trampolines -fPIC -mtune=generic -march=x86-64 -gdwarf-4 -fno-debug-types-section -fvar-tracking-assignments -g2 -DZEND_SIGNALS    -c /tmp/B.2acy_rzy/BUILD/php-7.2.34/ext/dom/domconfiguration.c -o ext/dom/domconfiguration.lo 
/bin/sh /tmp/B.2acy_rzy/BUILD/php-7.2.34/libtool --silent --preserve-dup-deps --tag=CC --mode=compile x86_64-pld-linux-gnux32-gcc  -Iext/dom/ -I/tmp/B.2acy_rzy/BUILD/php-7.2.34/ext/dom/ -DPHP_ATOM_INC -I/tmp/B.2acy_rzy/BUILD/php-7.2.34/include -I/tmp/B.2acy_rzy/BUILD/php-7.2.34/main -I/tmp/B.2acy_rzy/BUILD/php-7.2.34 -I/tmp/B.2acy_rzy/BUILD/php-7.2.34/ext/date/lib -I/usr/include/libxml2 -I/usr/include/enchant -I/usr/include/freetype2 -I/usr/include/libpng16 -I/usr/include/harfbuzz -I/usr/include/glib-2.0 -I/usr/libx32/glib-2.0/include -I/usr/include/imap -I/tmp/B.2acy_rzy/BUILD/php-7.2.34/ext/mbstring/libmbfl -I/tmp/B.2acy_rzy/BUILD/php-7.2.34/ext/mbstring/libmbfl/mbfl -I/usr/include/pspell -I/usr/include/tidy -I/usr/include/xmlrpc-epi -I/tmp/B.2acy_rzy/BUILD/php-7.2.34/TSRM -I/tmp/B.2acy_rzy/BUILD/php-7.2.34/Zend  -DDEBUG_FASTCGI -DHAVE_STRNDUP -I/usr/include/xmlrpc-epi  -I/usr/include -O2 -fwrapv -pipe -Wformat -Werror=format-security -gdwarf-4 -fno-debug-types-section -fvar-tracking-assignments -g2 -Wp,-D_FORTIFY_SOURCE=2 -fstack-protector-strong --param=ssp-buffer-size=4 -Werror=trampolines -fPIC -mtune=generic -march=x86-64 -gdwarf-4 -fno-debug-types-section -fvar-tracking-assignments -g2 -DZEND_SIGNALS    -c /tmp/B.2acy_rzy/BUILD/php-7.2.34/ext/dom/domimplementation.c -o ext/dom/domimplementation.lo 
/bin/sh /tmp/B.2acy_rzy/BUILD/php-7.2.34/libtool --silent --preserve-dup-deps --tag=CC --mode=compile x86_64-pld-linux-gnux32-gcc  -Iext/dom/ -I/tmp/B.2acy_rzy/BUILD/php-7.2.34/ext/dom/ -DPHP_ATOM_INC -I/tmp/B.2acy_rzy/BUILD/php-7.2.34/include -I/tmp/B.2acy_rzy/BUILD/php-7.2.34/main -I/tmp/B.2acy_rzy/BUILD/php-7.2.34 -I/tmp/B.2acy_rzy/BUILD/php-7.2.34/ext/date/lib -I/usr/include/libxml2 -I/usr/include/enchant -I/usr/include/freetype2 -I/usr/include/libpng16 -I/usr/include/harfbuzz -I/usr/include/glib-2.0 -I/usr/libx32/glib-2.0/include -I/usr/include/imap -I/tmp/B.2acy_rzy/BUILD/php-7.2.34/ext/mbstring/libmbfl -I/tmp/B.2acy_rzy/BUILD/php-7.2.34/ext/mbstring/libmbfl/mbfl -I/usr/include/pspell -I/usr/include/tidy -I/usr/include/xmlrpc-epi -I/tmp/B.2acy_rzy/BUILD/php-7.2.34/TSRM -I/tmp/B.2acy_rzy/BUILD/php-7.2.34/Zend  -DDEBUG_FASTCGI -DHAVE_STRNDUP -I/usr/include/xmlrpc-epi  -I/usr/include -O2 -fwrapv -pipe -Wformat -Werror=format-security -gdwarf-4 -fno-debug-types-section -fvar-tracking-assignments -g2 -Wp,-D_FORTIFY_SOURCE=2 -fstack-protector-strong --param=ssp-buffer-size=4 -Werror=trampolines -fPIC -mtune=generic -march=x86-64 -gdwarf-4 -fno-debug-types-section -fvar-tracking-assignments -g2 -DZEND_SIGNALS    -c /tmp/B.2acy_rzy/BUILD/php-7.2.34/ext/dom/documenttype.c -o ext/dom/documenttype.lo 
/bin/sh /tmp/B.2acy_rzy/BUILD/php-7.2.34/libtool --silent --preserve-dup-deps --tag=CC --mode=compile x86_64-pld-linux-gnux32-gcc  -Iext/dom/ -I/tmp/B.2acy_rzy/BUILD/php-7.2.34/ext/dom/ -DPHP_ATOM_INC -I/tmp/B.2acy_rzy/BUILD/php-7.2.34/include -I/tmp/B.2acy_rzy/BUILD/php-7.2.34/main -I/tmp/B.2acy_rzy/BUILD/php-7.2.34 -I/tmp/B.2acy_rzy/BUILD/php-7.2.34/ext/date/lib -I/usr/include/libxml2 -I/usr/include/enchant -I/usr/include/freetype2 -I/usr/include/libpng16 -I/usr/include/harfbuzz -I/usr/include/glib-2.0 -I/usr/libx32/glib-2.0/include -I/usr/include/imap -I/tmp/B.2acy_rzy/BUILD/php-7.2.34/ext/mbstring/libmbfl -I/tmp/B.2acy_rzy/BUILD/php-7.2.34/ext/mbstring/libmbfl/mbfl -I/usr/include/pspell -I/usr/include/tidy -I/usr/include/xmlrpc-epi -I/tmp/B.2acy_rzy/BUILD/php-7.2.34/TSRM -I/tmp/B.2acy_rzy/BUILD/php-7.2.34/Zend  -DDEBUG_FASTCGI -DHAVE_STRNDUP -I/usr/include/xmlrpc-epi  -I/usr/include -O2 -fwrapv -pipe -Wformat -Werror=format-security -gdwarf-4 -fno-debug-types-section -fvar-tracking-assignments -g2 -Wp,-D_FORTIFY_SOURCE=2 -fstack-protector-strong --param=ssp-buffer-size=4 -Werror=trampolines -fPIC -mtune=generic -march=x86-64 -gdwarf-4 -fno-debug-types-section -fvar-tracking-assignments -g2 -DZEND_SIGNALS    -c /tmp/B.2acy_rzy/BUILD/php-7.2.34/ext/dom/domimplementationlist.c -o ext/dom/domimplementationlist.lo 
/bin/sh /tmp/B.2acy_rzy/BUILD/php-7.2.34/libtool --silent --preserve-dup-deps --tag=CC --mode=compile x86_64-pld-linux-gnux32-gcc  -Iext/dom/ -I/tmp/B.2acy_rzy/BUILD/php-7.2.34/ext/dom/ -DPHP_ATOM_INC -I/tmp/B.2acy_rzy/BUILD/php-7.2.34/include -I/tmp/B.2acy_rzy/BUILD/php-7.2.34/main -I/tmp/B.2acy_rzy/BUILD/php-7.2.34 -I/tmp/B.2acy_rzy/BUILD/php-7.2.34/ext/date/lib -I/usr/include/libxml2 -I/usr/include/enchant -I/usr/include/freetype2 -I/usr/include/libpng16 -I/usr/include/harfbuzz -I/usr/include/glib-2.0 -I/usr/libx32/glib-2.0/include -I/usr/include/imap -I/tmp/B.2acy_rzy/BUILD/php-7.2.34/ext/mbstring/libmbfl -I/tmp/B.2acy_rzy/BUILD/php-7.2.34/ext/mbstring/libmbfl/mbfl -I/usr/include/pspell -I/usr/include/tidy -I/usr/include/xmlrpc-epi -I/tmp/B.2acy_rzy/BUILD/php-7.2.34/TSRM -I/tmp/B.2acy_rzy/BUILD/php-7.2.34/Zend  -DDEBUG_FASTCGI -DHAVE_STRNDUP -I/usr/include/xmlrpc-epi  -I/usr/include -O2 -fwrapv -pipe -Wformat -Werror=format-security -gdwarf-4 -fno-debug-types-section -fvar-tracking-assignments -g2 -Wp,-D_FORTIFY_SOURCE=2 -fstack-protector-strong --param=ssp-buffer-size=4 -Werror=trampolines -fPIC -mtune=generic -march=x86-64 -gdwarf-4 -fno-debug-types-section -fvar-tracking-assignments -g2 -DZEND_SIGNALS    -c /tmp/B.2acy_rzy/BUILD/php-7.2.34/ext/dom/domimplementationsource.c -o ext/dom/domimplementationsource.lo 
/bin/sh /tmp/B.2acy_rzy/BUILD/php-7.2.34/libtool --silent --preserve-dup-deps --tag=CC --mode=compile x86_64-pld-linux-gnux32-gcc  -Iext/dom/ -I/tmp/B.2acy_rzy/BUILD/php-7.2.34/ext/dom/ -DPHP_ATOM_INC -I/tmp/B.2acy_rzy/BUILD/php-7.2.34/include -I/tmp/B.2acy_rzy/BUILD/php-7.2.34/main -I/tmp/B.2acy_rzy/BUILD/php-7.2.34 -I/tmp/B.2acy_rzy/BUILD/php-7.2.34/ext/date/lib -I/usr/include/libxml2 -I/usr/include/enchant -I/usr/include/freetype2 -I/usr/include/libpng16 -I/usr/include/harfbuzz -I/usr/include/glib-2.0 -I/usr/libx32/glib-2.0/include -I/usr/include/imap -I/tmp/B.2acy_rzy/BUILD/php-7.2.34/ext/mbstring/libmbfl -I/tmp/B.2acy_rzy/BUILD/php-7.2.34/ext/mbstring/libmbfl/mbfl -I/usr/include/pspell -I/usr/include/tidy -I/usr/include/xmlrpc-epi -I/tmp/B.2acy_rzy/BUILD/php-7.2.34/TSRM -I/tmp/B.2acy_rzy/BUILD/php-7.2.34/Zend  -DDEBUG_FASTCGI -DHAVE_STRNDUP -I/usr/include/xmlrpc-epi  -I/usr/include -O2 -fwrapv -pipe -Wformat -Werror=format-security -gdwarf-4 -fno-debug-types-section -fvar-tracking-assignments -g2 -Wp,-D_FORTIFY_SOURCE=2 -fstack-protector-strong --param=ssp-buffer-size=4 -Werror=trampolines -fPIC -mtune=generic -march=x86-64 -gdwarf-4 -fno-debug-types-section -fvar-tracking-assignments -g2 -DZEND_SIGNALS    -c /tmp/B.2acy_rzy/BUILD/php-7.2.34/ext/dom/entity.c -o ext/dom/entity.lo 
/bin/sh /tmp/B.2acy_rzy/BUILD/php-7.2.34/libtool --silent --preserve-dup-deps --tag=CC --mode=compile x86_64-pld-linux-gnux32-gcc  -Iext/dom/ -I/tmp/B.2acy_rzy/BUILD/php-7.2.34/ext/dom/ -DPHP_ATOM_INC -I/tmp/B.2acy_rzy/BUILD/php-7.2.34/include -I/tmp/B.2acy_rzy/BUILD/php-7.2.34/main -I/tmp/B.2acy_rzy/BUILD/php-7.2.34 -I/tmp/B.2acy_rzy/BUILD/php-7.2.34/ext/date/lib -I/usr/include/libxml2 -I/usr/include/enchant -I/usr/include/freetype2 -I/usr/include/libpng16 -I/usr/include/harfbuzz -I/usr/include/glib-2.0 -I/usr/libx32/glib-2.0/include -I/usr/include/imap -I/tmp/B.2acy_rzy/BUILD/php-7.2.34/ext/mbstring/libmbfl -I/tmp/B.2acy_rzy/BUILD/php-7.2.34/ext/mbstring/libmbfl/mbfl -I/usr/include/pspell -I/usr/include/tidy -I/usr/include/xmlrpc-epi -I/tmp/B.2acy_rzy/BUILD/php-7.2.34/TSRM -I/tmp/B.2acy_rzy/BUILD/php-7.2.34/Zend  -DDEBUG_FASTCGI -DHAVE_STRNDUP -I/usr/include/xmlrpc-epi  -I/usr/include -O2 -fwrapv -pipe -Wformat -Werror=format-security -gdwarf-4 -fno-debug-types-section -fvar-tracking-assignments -g2 -Wp,-D_FORTIFY_SOURCE=2 -fstack-protector-strong --param=ssp-buffer-size=4 -Werror=trampolines -fPIC -mtune=generic -march=x86-64 -gdwarf-4 -fno-debug-types-section -fvar-tracking-assignments -g2 -DZEND_SIGNALS    -c /tmp/B.2acy_rzy/BUILD/php-7.2.34/ext/dom/entityreference.c -o ext/dom/entityreference.lo 
/bin/sh /tmp/B.2acy_rzy/BUILD/php-7.2.34/libtool --silent --preserve-dup-deps --tag=CC --mode=compile x86_64-pld-linux-gnux32-gcc  -Iext/dom/ -I/tmp/B.2acy_rzy/BUILD/php-7.2.34/ext/dom/ -DPHP_ATOM_INC -I/tmp/B.2acy_rzy/BUILD/php-7.2.34/include -I/tmp/B.2acy_rzy/BUILD/php-7.2.34/main -I/tmp/B.2acy_rzy/BUILD/php-7.2.34 -I/tmp/B.2acy_rzy/BUILD/php-7.2.34/ext/date/lib -I/usr/include/libxml2 -I/usr/include/enchant -I/usr/include/freetype2 -I/usr/include/libpng16 -I/usr/include/harfbuzz -I/usr/include/glib-2.0 -I/usr/libx32/glib-2.0/include -I/usr/include/imap -I/tmp/B.2acy_rzy/BUILD/php-7.2.34/ext/mbstring/libmbfl -I/tmp/B.2acy_rzy/BUILD/php-7.2.34/ext/mbstring/libmbfl/mbfl -I/usr/include/pspell -I/usr/include/tidy -I/usr/include/xmlrpc-epi -I/tmp/B.2acy_rzy/BUILD/php-7.2.34/TSRM -I/tmp/B.2acy_rzy/BUILD/php-7.2.34/Zend  -DDEBUG_FASTCGI -DHAVE_STRNDUP -I/usr/include/xmlrpc-epi  -I/usr/include -O2 -fwrapv -pipe -Wformat -Werror=format-security -gdwarf-4 -fno-debug-types-section -fvar-tracking-assignments -g2 -Wp,-D_FORTIFY_SOURCE=2 -fstack-protector-strong --param=ssp-buffer-size=4 -Werror=trampolines -fPIC -mtune=generic -march=x86-64 -gdwarf-4 -fno-debug-types-section -fvar-tracking-assignments -g2 -DZEND_SIGNALS    -c /tmp/B.2acy_rzy/BUILD/php-7.2.34/ext/dom/nodelist.c -o ext/dom/nodelist.lo 
/bin/sh /tmp/B.2acy_rzy/BUILD/php-7.2.34/libtool --silent --preserve-dup-deps --tag=CC --mode=compile x86_64-pld-linux-gnux32-gcc  -Iext/dom/ -I/tmp/B.2acy_rzy/BUILD/php-7.2.34/ext/dom/ -DPHP_ATOM_INC -I/tmp/B.2acy_rzy/BUILD/php-7.2.34/include -I/tmp/B.2acy_rzy/BUILD/php-7.2.34/main -I/tmp/B.2acy_rzy/BUILD/php-7.2.34 -I/tmp/B.2acy_rzy/BUILD/php-7.2.34/ext/date/lib -I/usr/include/libxml2 -I/usr/include/enchant -I/usr/include/freetype2 -I/usr/include/libpng16 -I/usr/include/harfbuzz -I/usr/include/glib-2.0 -I/usr/libx32/glib-2.0/include -I/usr/include/imap -I/tmp/B.2acy_rzy/BUILD/php-7.2.34/ext/mbstring/libmbfl -I/tmp/B.2acy_rzy/BUILD/php-7.2.34/ext/mbstring/libmbfl/mbfl -I/usr/include/pspell -I/usr/include/tidy -I/usr/include/xmlrpc-epi -I/tmp/B.2acy_rzy/BUILD/php-7.2.34/TSRM -I/tmp/B.2acy_rzy/BUILD/php-7.2.34/Zend  -DDEBUG_FASTCGI -DHAVE_STRNDUP -I/usr/include/xmlrpc-epi  -I/usr/include -O2 -fwrapv -pipe -Wformat -Werror=format-security -gdwarf-4 -fno-debug-types-section -fvar-tracking-assignments -g2 -Wp,-D_FORTIFY_SOURCE=2 -fstack-protector-strong --param=ssp-buffer-size=4 -Werror=trampolines -fPIC -mtune=generic -march=x86-64 -gdwarf-4 -fno-debug-types-section -fvar-tracking-assignments -g2 -DZEND_SIGNALS    -c /tmp/B.2acy_rzy/BUILD/php-7.2.34/ext/dom/characterdata.c -o ext/dom/characterdata.lo 
/bin/sh /tmp/B.2acy_rzy/BUILD/php-7.2.34/libtool --silent --preserve-dup-deps --tag=CC --mode=compile x86_64-pld-linux-gnux32-gcc -DZEND_ENABLE_STATIC_TSRMLS_CACHE=1 -Iext/pcre/ -I/tmp/B.2acy_rzy/BUILD/php-7.2.34/ext/pcre/ -DPHP_ATOM_INC -I/tmp/B.2acy_rzy/BUILD/php-7.2.34/include -I/tmp/B.2acy_rzy/BUILD/php-7.2.34/main -I/tmp/B.2acy_rzy/BUILD/php-7.2.34 -I/tmp/B.2acy_rzy/BUILD/php-7.2.34/ext/date/lib -I/usr/include/libxml2 -I/usr/include/enchant -I/usr/include/freetype2 -I/usr/include/libpng16 -I/usr/include/harfbuzz -I/usr/include/glib-2.0 -I/usr/libx32/glib-2.0/include -I/usr/include/imap -I/tmp/B.2acy_rzy/BUILD/php-7.2.34/ext/mbstring/libmbfl -I/tmp/B.2acy_rzy/BUILD/php-7.2.34/ext/mbstring/libmbfl/mbfl -I/usr/include/pspell -I/usr/include/tidy -I/usr/include/xmlrpc-epi -I/tmp/B.2acy_rzy/BUILD/php-7.2.34/TSRM -I/tmp/B.2acy_rzy/BUILD/php-7.2.34/Zend  -DDEBUG_FASTCGI -DHAVE_STRNDUP -I/usr/include/xmlrpc-epi  -I/usr/include -O2 -fwrapv -pipe -Wformat -Werror=format-security -gdwarf-4 -fno-debug-types-section -fvar-tracking-assignments -g2 -Wp,-D_FORTIFY_SOURCE=2 -fstack-protector-strong --param=ssp-buffer-size=4 -Werror=trampolines -fPIC -mtune=generic -march=x86-64 -gdwarf-4 -fno-debug-types-section -fvar-tracking-assignments -g2 -DZEND_SIGNALS    -c /tmp/B.2acy_rzy/BUILD/php-7.2.34/ext/pcre/php_pcre.c -o ext/pcre/php_pcre.lo 
/bin/sh /tmp/B.2acy_rzy/BUILD/php-7.2.34/libtool --silent --preserve-dup-deps --tag=CC --mode=compile x86_64-pld-linux-gnux32-gcc  -Iext/dom/ -I/tmp/B.2acy_rzy/BUILD/php-7.2.34/ext/dom/ -DPHP_ATOM_INC -I/tmp/B.2acy_rzy/BUILD/php-7.2.34/include -I/tmp/B.2acy_rzy/BUILD/php-7.2.34/main -I/tmp/B.2acy_rzy/BUILD/php-7.2.34 -I/tmp/B.2acy_rzy/BUILD/php-7.2.34/ext/date/lib -I/usr/include/libxml2 -I/usr/include/enchant -I/usr/include/freetype2 -I/usr/include/libpng16 -I/usr/include/harfbuzz -I/usr/include/glib-2.0 -I/usr/libx32/glib-2.0/include -I/usr/include/imap -I/tmp/B.2acy_rzy/BUILD/php-7.2.34/ext/mbstring/libmbfl -I/tmp/B.2acy_rzy/BUILD/php-7.2.34/ext/mbstring/libmbfl/mbfl -I/usr/include/pspell -I/usr/include/tidy -I/usr/include/xmlrpc-epi -I/tmp/B.2acy_rzy/BUILD/php-7.2.34/TSRM -I/tmp/B.2acy_rzy/BUILD/php-7.2.34/Zend  -DDEBUG_FASTCGI -DHAVE_STRNDUP -I/usr/include/xmlrpc-epi  -I/usr/include -O2 -fwrapv -pipe -Wformat -Werror=format-security -gdwarf-4 -fno-debug-types-section -fvar-tracking-assignments -g2 -Wp,-D_FORTIFY_SOURCE=2 -fstack-protector-strong --param=ssp-buffer-size=4 -Werror=trampolines -fPIC -mtune=generic -march=x86-64 -gdwarf-4 -fno-debug-types-section -fvar-tracking-assignments -g2 -DZEND_SIGNALS    -c /tmp/B.2acy_rzy/BUILD/php-7.2.34/ext/dom/text.c -o ext/dom/text.lo 
/bin/sh /tmp/B.2acy_rzy/BUILD/php-7.2.34/libtool --silent --preserve-dup-deps --tag=CC --mode=compile x86_64-pld-linux-gnux32-gcc  -Iext/dom/ -I/tmp/B.2acy_rzy/BUILD/php-7.2.34/ext/dom/ -DPHP_ATOM_INC -I/tmp/B.2acy_rzy/BUILD/php-7.2.34/include -I/tmp/B.2acy_rzy/BUILD/php-7.2.34/main -I/tmp/B.2acy_rzy/BUILD/php-7.2.34 -I/tmp/B.2acy_rzy/BUILD/php-7.2.34/ext/date/lib -I/usr/include/libxml2 -I/usr/include/enchant -I/usr/include/freetype2 -I/usr/include/libpng16 -I/usr/include/harfbuzz -I/usr/include/glib-2.0 -I/usr/libx32/glib-2.0/include -I/usr/include/imap -I/tmp/B.2acy_rzy/BUILD/php-7.2.34/ext/mbstring/libmbfl -I/tmp/B.2acy_rzy/BUILD/php-7.2.34/ext/mbstring/libmbfl/mbfl -I/usr/include/pspell -I/usr/include/tidy -I/usr/include/xmlrpc-epi -I/tmp/B.2acy_rzy/BUILD/php-7.2.34/TSRM -I/tmp/B.2acy_rzy/BUILD/php-7.2.34/Zend  -DDEBUG_FASTCGI -DHAVE_STRNDUP -I/usr/include/xmlrpc-epi  -I/usr/include -O2 -fwrapv -pipe -Wformat -Werror=format-security -gdwarf-4 -fno-debug-types-section -fvar-tracking-assignments -g2 -Wp,-D_FORTIFY_SOURCE=2 -fstack-protector-strong --param=ssp-buffer-size=4 -Werror=trampolines -fPIC -mtune=generic -march=x86-64 -gdwarf-4 -fno-debug-types-section -fvar-tracking-assignments -g2 -DZEND_SIGNALS    -c /tmp/B.2acy_rzy/BUILD/php-7.2.34/ext/dom/element.c -o ext/dom/element.lo 
/bin/sh /tmp/B.2acy_rzy/BUILD/php-7.2.34/libtool --silent --preserve-dup-deps --tag=CC --mode=compile x86_64-pld-linux-gnux32-gcc  -Iext/dom/ -I/tmp/B.2acy_rzy/BUILD/php-7.2.34/ext/dom/ -DPHP_ATOM_INC -I/tmp/B.2acy_rzy/BUILD/php-7.2.34/include -I/tmp/B.2acy_rzy/BUILD/php-7.2.34/main -I/tmp/B.2acy_rzy/BUILD/php-7.2.34 -I/tmp/B.2acy_rzy/BUILD/php-7.2.34/ext/date/lib -I/usr/include/libxml2 -I/usr/include/enchant -I/usr/include/freetype2 -I/usr/include/libpng16 -I/usr/include/harfbuzz -I/usr/include/glib-2.0 -I/usr/libx32/glib-2.0/include -I/usr/include/imap -I/tmp/B.2acy_rzy/BUILD/php-7.2.34/ext/mbstring/libmbfl -I/tmp/B.2acy_rzy/BUILD/php-7.2.34/ext/mbstring/libmbfl/mbfl -I/usr/include/pspell -I/usr/include/tidy -I/usr/include/xmlrpc-epi -I/tmp/B.2acy_rzy/BUILD/php-7.2.34/TSRM -I/tmp/B.2acy_rzy/BUILD/php-7.2.34/Zend  -DDEBUG_FASTCGI -DHAVE_STRNDUP -I/usr/include/xmlrpc-epi  -I/usr/include -O2 -fwrapv -pipe -Wformat -Werror=format-security -gdwarf-4 -fno-debug-types-section -fvar-tracking-assignments -g2 -Wp,-D_FORTIFY_SOURCE=2 -fstack-protector-strong --param=ssp-buffer-size=4 -Werror=trampolines -fPIC -mtune=generic -march=x86-64 -gdwarf-4 -fno-debug-types-section -fvar-tracking-assignments -g2 -DZEND_SIGNALS    -c /tmp/B.2acy_rzy/BUILD/php-7.2.34/ext/dom/php_dom.c -o ext/dom/php_dom.lo 
/bin/sh /tmp/B.2acy_rzy/BUILD/php-7.2.34/libtool --silent --preserve-dup-deps --tag=CC --mode=compile x86_64-pld-linux-gnux32-gcc -DZEND_ENABLE_STATIC_TSRMLS_CACHE=1 -Iext/spl/ -I/tmp/B.2acy_rzy/BUILD/php-7.2.34/ext/spl/ -DPHP_ATOM_INC -I/tmp/B.2acy_rzy/BUILD/php-7.2.34/include -I/tmp/B.2acy_rzy/BUILD/php-7.2.34/main -I/tmp/B.2acy_rzy/BUILD/php-7.2.34 -I/tmp/B.2acy_rzy/BUILD/php-7.2.34/ext/date/lib -I/usr/include/libxml2 -I/usr/include/enchant -I/usr/include/freetype2 -I/usr/include/libpng16 -I/usr/include/harfbuzz -I/usr/include/glib-2.0 -I/usr/libx32/glib-2.0/include -I/usr/include/imap -I/tmp/B.2acy_rzy/BUILD/php-7.2.34/ext/mbstring/libmbfl -I/tmp/B.2acy_rzy/BUILD/php-7.2.34/ext/mbstring/libmbfl/mbfl -I/usr/include/pspell -I/usr/include/tidy -I/usr/include/xmlrpc-epi -I/tmp/B.2acy_rzy/BUILD/php-7.2.34/TSRM -I/tmp/B.2acy_rzy/BUILD/php-7.2.34/Zend  -DDEBUG_FASTCGI -DHAVE_STRNDUP -I/usr/include/xmlrpc-epi  -I/usr/include -O2 -fwrapv -pipe -Wformat -Werror=format-security -gdwarf-4 -fno-debug-types-section -fvar-tracking-assignments -g2 -Wp,-D_FORTIFY_SOURCE=2 -fstack-protector-strong --param=ssp-buffer-size=4 -Werror=trampolines -fPIC -mtune=generic -march=x86-64 -gdwarf-4 -fno-debug-types-section -fvar-tracking-assignments -g2 -DZEND_SIGNALS    -c /tmp/B.2acy_rzy/BUILD/php-7.2.34/ext/spl/spl_directory.c -o ext/spl/spl_directory.lo 
/bin/sh /tmp/B.2acy_rzy/BUILD/php-7.2.34/libtool --silent --preserve-dup-deps --tag=CC --mode=compile x86_64-pld-linux-gnux32-gcc  -Iext/dom/ -I/tmp/B.2acy_rzy/BUILD/php-7.2.34/ext/dom/ -DPHP_ATOM_INC -I/tmp/B.2acy_rzy/BUILD/php-7.2.34/include -I/tmp/B.2acy_rzy/BUILD/php-7.2.34/main -I/tmp/B.2acy_rzy/BUILD/php-7.2.34 -I/tmp/B.2acy_rzy/BUILD/php-7.2.34/ext/date/lib -I/usr/include/libxml2 -I/usr/include/enchant -I/usr/include/freetype2 -I/usr/include/libpng16 -I/usr/include/harfbuzz -I/usr/include/glib-2.0 -I/usr/libx32/glib-2.0/include -I/usr/include/imap -I/tmp/B.2acy_rzy/BUILD/php-7.2.34/ext/mbstring/libmbfl -I/tmp/B.2acy_rzy/BUILD/php-7.2.34/ext/mbstring/libmbfl/mbfl -I/usr/include/pspell -I/usr/include/tidy -I/usr/include/xmlrpc-epi -I/tmp/B.2acy_rzy/BUILD/php-7.2.34/TSRM -I/tmp/B.2acy_rzy/BUILD/php-7.2.34/Zend  -DDEBUG_FASTCGI -DHAVE_STRNDUP -I/usr/include/xmlrpc-epi  -I/usr/include -O2 -fwrapv -pipe -Wformat -Werror=format-security -gdwarf-4 -fno-debug-types-section -fvar-tracking-assignments -g2 -Wp,-D_FORTIFY_SOURCE=2 -fstack-protector-strong --param=ssp-buffer-size=4 -Werror=trampolines -fPIC -mtune=generic -march=x86-64 -gdwarf-4 -fno-debug-types-section -fvar-tracking-assignments -g2 -DZEND_SIGNALS    -c /tmp/B.2acy_rzy/BUILD/php-7.2.34/ext/dom/node.c -o ext/dom/node.lo 
/bin/sh /tmp/B.2acy_rzy/BUILD/php-7.2.34/libtool --silent --preserve-dup-deps --tag=CC --mode=compile x86_64-pld-linux-gnux32-gcc  -Iext/curl/ -I/tmp/B.2acy_rzy/BUILD/php-7.2.34/ext/curl/ -DPHP_ATOM_INC -I/tmp/B.2acy_rzy/BUILD/php-7.2.34/include -I/tmp/B.2acy_rzy/BUILD/php-7.2.34/main -I/tmp/B.2acy_rzy/BUILD/php-7.2.34 -I/tmp/B.2acy_rzy/BUILD/php-7.2.34/ext/date/lib -I/usr/include/libxml2 -I/usr/include/enchant -I/usr/include/freetype2 -I/usr/include/libpng16 -I/usr/include/harfbuzz -I/usr/include/glib-2.0 -I/usr/libx32/glib-2.0/include -I/usr/include/imap -I/tmp/B.2acy_rzy/BUILD/php-7.2.34/ext/mbstring/libmbfl -I/tmp/B.2acy_rzy/BUILD/php-7.2.34/ext/mbstring/libmbfl/mbfl -I/usr/include/pspell -I/usr/include/tidy -I/usr/include/xmlrpc-epi -I/tmp/B.2acy_rzy/BUILD/php-7.2.34/TSRM -I/tmp/B.2acy_rzy/BUILD/php-7.2.34/Zend  -DDEBUG_FASTCGI -DHAVE_STRNDUP -I/usr/include/xmlrpc-epi  -I/usr/include -O2 -fwrapv -pipe -Wformat -Werror=format-security -gdwarf-4 -fno-debug-types-section -fvar-tracking-assignments -g2 -Wp,-D_FORTIFY_SOURCE=2 -fstack-protector-strong --param=ssp-buffer-size=4 -Werror=trampolines -fPIC -mtune=generic -march=x86-64 -gdwarf-4 -fno-debug-types-section -fvar-tracking-assignments -g2 -DZEND_SIGNALS    -c /tmp/B.2acy_rzy/BUILD/php-7.2.34/ext/curl/interface.c -o ext/curl/interface.lo 
/tmp/B.2acy_rzy/BUILD/php-7.2.34/ext/curl/interface.c: In function 'php_curl_option_url':
/tmp/B.2acy_rzy/BUILD/php-7.2.34/ext/curl/interface.c:202:17: warning: 'CURLOPT_PROTOCOLS' is deprecated: since 7.85.0. Use CURLOPT_PROTOCOLS_STR [-Wdeprecated-declarations]
  202 |                 curl_easy_setopt(ch->cp, CURLOPT_PROTOCOLS, CURLPROTO_ALL & ~CURLPROTO_FILE);
      |                 ^~~~~~~~~~~~~~~~
In file included from /tmp/B.2acy_rzy/BUILD/php-7.2.34/ext/curl/interface.c:39:
/usr/include/curl/curl.h:1753:3: note: declared here
 1753 |   CURLOPTDEPRECATED(CURLOPT_PROTOCOLS, CURLOPTTYPE_LONG, 181,
      |   ^~~~~~~~~~~~~~~~~
/tmp/B.2acy_rzy/BUILD/php-7.2.34/ext/curl/interface.c: In function 'zm_startup_curl':
/tmp/B.2acy_rzy/BUILD/php-7.2.34/ext/curl/interface.c:687:9: warning: 'CURLOPT_DNS_USE_GLOBAL_CACHE' is deprecated: since 7.11.1. Use CURLOPT_SHARE [-Wdeprecated-declarations]
  687 |         REGISTER_CURL_CONSTANT(CURLOPT_DNS_USE_GLOBAL_CACHE);
      |         ^~~~~~~~~~~~~~~~~~~~~~
/usr/include/curl/curl.h:1428:3: note: declared here
 1428 |   CURLOPTDEPRECATED(CURLOPT_DNS_USE_GLOBAL_CACHE, CURLOPTTYPE_LONG, 91,
      |   ^~~~~~~~~~~~~~~~~
/tmp/B.2acy_rzy/BUILD/php-7.2.34/ext/curl/interface.c:688:9: warning: 'CURLOPT_EGDSOCKET' is deprecated: since 7.84.0. Serves no purpose anymore [-Wdeprecated-declarations]
  688 |         REGISTER_CURL_CONSTANT(CURLOPT_EGDSOCKET);
      |         ^~~~~~~~~~~~~~~~~~~~~~
/usr/include/curl/curl.h:1372:3: note: declared here
 1372 |   CURLOPTDEPRECATED(CURLOPT_EGDSOCKET, CURLOPTTYPE_STRINGPOINT, 77,
      |   ^~~~~~~~~~~~~~~~~
/tmp/B.2acy_rzy/BUILD/php-7.2.34/ext/curl/interface.c:726:9: warning: 'CURLOPT_PROGRESSFUNCTION' is deprecated: since 7.32.0. Use CURLOPT_XFERINFOFUNCTION [-Wdeprecated-declarations]
  726 |         REGISTER_CURL_CONSTANT(CURLOPT_PROGRESSFUNCTION);
      |         ^~~~~~~~~~~~~~~~~~~~~~
/usr/include/curl/curl.h:1299:3: note: declared here
 1299 |   CURLOPTDEPRECATED(CURLOPT_PROGRESSFUNCTION, CURLOPTTYPE_FUNCTIONPOINT, 56,
      |   ^~~~~~~~~~~~~~~~~
/tmp/B.2acy_rzy/BUILD/php-7.2.34/ext/curl/interface.c:731:9: warning: 'CURLOPT_PUT' is deprecated: since 7.12.1. Use CURLOPT_UPLOAD [-Wdeprecated-declarations]
  731 |         REGISTER_CURL_CONSTANT(CURLOPT_PUT);
      |         ^~~~~~~~~~~~~~~~~~~~~~
/usr/include/curl/curl.h:1290:3: note: declared here
 1290 |   CURLOPTDEPRECATED(CURLOPT_PUT, CURLOPTTYPE_LONG, 54,
      |   ^~~~~~~~~~~~~~~~~
/tmp/B.2acy_rzy/BUILD/php-7.2.34/ext/curl/interface.c:733:9: warning: 'CURLOPT_RANDOM_FILE' is deprecated: since 7.84.0. Serves no purpose anymore [-Wdeprecated-declarations]
  733 |         REGISTER_CURL_CONSTANT(CURLOPT_RANDOM_FILE);
      |         ^~~~~~~~~~~~~~~~~~~~~~
/usr/include/curl/curl.h:1368:3: note: declared here
 1368 |   CURLOPTDEPRECATED(CURLOPT_RANDOM_FILE, CURLOPTTYPE_STRINGPOINT, 76,
      |   ^~~~~~~~~~~~~~~~~
/tmp/B.2acy_rzy/BUILD/php-7.2.34/ext/curl/interface.c:841:9: warning: 'CURLINFO_CONTENT_LENGTH_DOWNLOAD' is deprecated: since 7.55.0. Use CURLINFO_CONTENT_LENGTH_DOWNLOAD_T [-Wdeprecated-declarations]
  841 |         REGISTER_CURL_CONSTANT(CURLINFO_CONTENT_LENGTH_DOWNLOAD);
      |         ^~~~~~~~~~~~~~~~~~~~~~
/usr/include/curl/curl.h:2883:3: note: declared here
 2883 |   CURLINFO_CONTENT_LENGTH_DOWNLOAD
      |   ^~~~~~~~~~~~~~~~~~~~~~~~~~~~~~~~
/tmp/B.2acy_rzy/BUILD/php-7.2.34/ext/curl/interface.c:842:9: warning: 'CURLINFO_CONTENT_LENGTH_UPLOAD' is deprecated: since 7.55.0. Use CURLINFO_CONTENT_LENGTH_UPLOAD_T [-Wdeprecated-declarations]
  842 |         REGISTER_CURL_CONSTANT(CURLINFO_CONTENT_LENGTH_UPLOAD);
      |         ^~~~~~~~~~~~~~~~~~~~~~
/usr/include/curl/curl.h:2888:3: note: declared here
 2888 |   CURLINFO_CONTENT_LENGTH_UPLOAD
      |   ^~~~~~~~~~~~~~~~~~~~~~~~~~~~~~
/tmp/B.2acy_rzy/BUILD/php-7.2.34/ext/curl/interface.c:856:9: warning: 'CURLINFO_SIZE_DOWNLOAD' is deprecated: since 7.55.0. Use CURLINFO_SIZE_DOWNLOAD_T [-Wdeprecated-declarations]
  856 |         REGISTER_CURL_CONSTANT(CURLINFO_SIZE_DOWNLOAD);
      |         ^~~~~~~~~~~~~~~~~~~~~~
/usr/include/curl/curl.h:2866:3: note: declared here
 2866 |   CURLINFO_SIZE_DOWNLOAD
      |   ^~~~~~~~~~~~~~~~~~~~~~
/tmp/B.2acy_rzy/BUILD/php-7.2.34/ext/curl/interface.c:857:9: warning: 'CURLINFO_SIZE_UPLOAD' is deprecated: since 7.55.0. Use CURLINFO_SIZE_UPLOAD_T [-Wdeprecated-declarations]
  857 |         REGISTER_CURL_CONSTANT(CURLINFO_SIZE_UPLOAD);
      |         ^~~~~~~~~~~~~~~~~~~~~~
/usr/include/curl/curl.h:2863:3: note: declared here
 2863 |   CURLINFO_SIZE_UPLOAD CURL_DEPRECATED(7.55.0, "Use CURLINFO_SIZE_UPLOAD_T")
      |   ^~~~~~~~~~~~~~~~~~~~
/tmp/B.2acy_rzy/BUILD/php-7.2.34/ext/curl/interface.c:858:9: warning: 'CURLINFO_SPEED_DOWNLOAD' is deprecated: since 7.55.0. Use CURLINFO_SPEED_DOWNLOAD_T [-Wdeprecated-declarations]
  858 |         REGISTER_CURL_CONSTANT(CURLINFO_SPEED_DOWNLOAD);
      |         ^~~~~~~~~~~~~~~~~~~~~~
/usr/include/curl/curl.h:2870:3: note: declared here
 2870 |   CURLINFO_SPEED_DOWNLOAD
      |   ^~~~~~~~~~~~~~~~~~~~~~~
/tmp/B.2acy_rzy/BUILD/php-7.2.34/ext/curl/interface.c:859:9: warning: 'CURLINFO_SPEED_UPLOAD' is deprecated: since 7.55.0. Use CURLINFO_SPEED_UPLOAD_T [-Wdeprecated-declarations]
  859 |         REGISTER_CURL_CONSTANT(CURLINFO_SPEED_UPLOAD);
      |         ^~~~~~~~~~~~~~~~~~~~~~
/usr/include/curl/curl.h:2874:3: note: declared here
 2874 |   CURLINFO_SPEED_UPLOAD
      |   ^~~~~~~~~~~~~~~~~~~~~
/tmp/B.2acy_rzy/BUILD/php-7.2.34/ext/curl/interface.c:1131:9: warning: 'CURLOPT_PROTOCOLS' is deprecated: since 7.85.0. Use CURLOPT_PROTOCOLS_STR [-Wdeprecated-declarations]
 1131 |         REGISTER_CURL_CONSTANT(CURLOPT_PROTOCOLS);
      |         ^~~~~~~~~~~~~~~~~~~~~~
/usr/include/curl/curl.h:1753:3: note: declared here
 1753 |   CURLOPTDEPRECATED(CURLOPT_PROTOCOLS, CURLOPTTYPE_LONG, 181,
      |   ^~~~~~~~~~~~~~~~~
/tmp/B.2acy_rzy/BUILD/php-7.2.34/ext/curl/interface.c:1132:9: warning: 'CURLOPT_REDIR_PROTOCOLS' is deprecated: since 7.85.0. Use CURLOPT_REDIR_PROTOCOLS_STR [-Wdeprecated-declarations]
 1132 |         REGISTER_CURL_CONSTANT(CURLOPT_REDIR_PROTOCOLS);
      |         ^~~~~~~~~~~~~~~~~~~~~~
/usr/include/curl/curl.h:1759:3: note: declared here
 1759 |   CURLOPTDEPRECATED(CURLOPT_REDIR_PROTOCOLS, CURLOPTTYPE_LONG, 182,
      |   ^~~~~~~~~~~~~~~~~
/tmp/B.2acy_rzy/BUILD/php-7.2.34/ext/curl/interface.c:1134:9: warning: 'CURLOPT_SOCKS5_GSSAPI_SERVICE' is deprecated: since 7.49.0. Use CURLOPT_PROXY_SERVICE_NAME [-Wdeprecated-declarations]
 1134 |         REGISTER_CURL_CONSTANT(CURLOPT_SOCKS5_GSSAPI_SERVICE);
      |         ^~~~~~~~~~~~~~~~~~~~~~
/usr/include/curl/curl.h:1742:3: note: declared here
 1742 |   CURLOPTDEPRECATED(CURLOPT_SOCKS5_GSSAPI_SERVICE,
      |   ^~~~~~~~~~~~~~~~~
/tmp/B.2acy_rzy/BUILD/php-7.2.34/ext/curl/interface.c:1296:9: warning: 'CURLOPT_SSL_ENABLE_NPN' is deprecated: since 7.86.0. Has no function [-Wdeprecated-declarations]
 1296 |         REGISTER_CURL_CONSTANT(CURLOPT_SSL_ENABLE_NPN);
      |         ^~~~~~~~~~~~~~~~~~~~~~
/usr/include/curl/curl.h:1905:3: note: declared here
 1905 |   CURLOPTDEPRECATED(CURLOPT_SSL_ENABLE_NPN, CURLOPTTYPE_LONG, 225,
      |   ^~~~~~~~~~~~~~~~~
/tmp/B.2acy_rzy/BUILD/php-7.2.34/ext/curl/interface.c: In function 'curl_free_post':
/tmp/B.2acy_rzy/BUILD/php-7.2.34/ext/curl/interface.c:1815:9: warning: 'curl_formfree' is deprecated: since 7.56.0. Use curl_mime_free() [-Wdeprecated-declarations]
 1815 |         curl_formfree((struct HttpPost *)*post);
      |         ^~~~~~~~~~~~~
/usr/include/curl/curl.h:2621:1: note: declared here
 2621 | curl_formfree(struct curl_httppost *form);
      | ^~~~~~~~~~~~~
/tmp/B.2acy_rzy/BUILD/php-7.2.34/ext/curl/interface.c: In function '_php_curl_set_default_options':
/tmp/B.2acy_rzy/BUILD/php-7.2.34/ext/curl/interface.c:1951:9: warning: 'CURLOPT_DNS_USE_GLOBAL_CACHE' is deprecated: since 7.11.1. Use CURLOPT_SHARE [-Wdeprecated-declarations]
 1951 |         curl_easy_setopt(ch->cp, CURLOPT_DNS_USE_GLOBAL_CACHE, 1);
      |         ^~~~~~~~~~~~~~~~
/usr/include/curl/curl.h:1428:3: note: declared here
 1428 |   CURLOPTDEPRECATED(CURLOPT_DNS_USE_GLOBAL_CACHE, CURLOPTTYPE_LONG, 91,
      |   ^~~~~~~~~~~~~~~~~
/tmp/B.2acy_rzy/BUILD/php-7.2.34/ext/curl/interface.c: In function '_php_curl_setopt':
/tmp/B.2acy_rzy/BUILD/php-7.2.34/ext/curl/interface.c:2142:17: warning: 'CURLOPT_DNS_USE_GLOBAL_CACHE' is deprecated: since 7.11.1. Use CURLOPT_SHARE [-Wdeprecated-declarations]
 2142 |                 case CURLOPT_DNS_USE_GLOBAL_CACHE:
      |                 ^~~~
/usr/include/curl/curl.h:1428:3: note: declared here
 1428 |   CURLOPTDEPRECATED(CURLOPT_DNS_USE_GLOBAL_CACHE, CURLOPTTYPE_LONG, 91,
      |   ^~~~~~~~~~~~~~~~~
/tmp/B.2acy_rzy/BUILD/php-7.2.34/ext/curl/interface.c:2166:17: warning: 'CURLOPT_PUT' is deprecated: since 7.12.1. Use CURLOPT_UPLOAD [-Wdeprecated-declarations]
 2166 |                 case CURLOPT_PUT:
      |                 ^~~~
/usr/include/curl/curl.h:1290:3: note: declared here
 1290 |   CURLOPTDEPRECATED(CURLOPT_PUT, CURLOPTTYPE_LONG, 54,
      |   ^~~~~~~~~~~~~~~~~
/tmp/B.2acy_rzy/BUILD/php-7.2.34/ext/curl/interface.c:2248:17: warning: 'CURLOPT_PROTOCOLS' is deprecated: since 7.85.0. Use CURLOPT_PROTOCOLS_STR [-Wdeprecated-declarations]
 2248 |                 case CURLOPT_PROTOCOLS:
      |                 ^~~~
/usr/include/curl/curl.h:1753:3: note: declared here
 1753 |   CURLOPTDEPRECATED(CURLOPT_PROTOCOLS, CURLOPTTYPE_LONG, 181,
      |   ^~~~~~~~~~~~~~~~~
/tmp/B.2acy_rzy/BUILD/php-7.2.34/ext/curl/interface.c:2249:17: warning: 'CURLOPT_REDIR_PROTOCOLS' is deprecated: since 7.85.0. Use CURLOPT_REDIR_PROTOCOLS_STR [-Wdeprecated-declarations]
 2249 |                 case CURLOPT_REDIR_PROTOCOLS:
      |                 ^~~~
/usr/include/curl/curl.h:1759:3: note: declared here
 1759 |   CURLOPTDEPRECATED(CURLOPT_REDIR_PROTOCOLS, CURLOPTTYPE_LONG, 182,
      |   ^~~~~~~~~~~~~~~~~
/tmp/B.2acy_rzy/BUILD/php-7.2.34/ext/curl/interface.c:2283:17: warning: 'CURLOPT_SSL_ENABLE_NPN' is deprecated: since 7.86.0. Has no function [-Wdeprecated-declarations]
 2283 |                 case CURLOPT_SSL_ENABLE_NPN:
      |                 ^~~~
/usr/include/curl/curl.h:1905:3: note: declared here
 1905 |   CURLOPTDEPRECATED(CURLOPT_SSL_ENABLE_NPN, CURLOPTTYPE_LONG, 225,
      |   ^~~~~~~~~~~~~~~~~
/tmp/B.2acy_rzy/BUILD/php-7.2.34/ext/curl/interface.c:2312:25: warning: 'CURLOPT_PROTOCOLS' is deprecated: since 7.85.0. Use CURLOPT_PROTOCOLS_STR [-Wdeprecated-declarations]
 2312 |                         if ((option == CURLOPT_PROTOCOLS || option == CURLOPT_REDIR_PROTOCOLS) &&
      |                         ^~
/usr/include/curl/curl.h:1753:3: note: declared here
 1753 |   CURLOPTDEPRECATED(CURLOPT_PROTOCOLS, CURLOPTTYPE_LONG, 181,
      |   ^~~~~~~~~~~~~~~~~
/tmp/B.2acy_rzy/BUILD/php-7.2.34/ext/curl/interface.c:2312:25: warning: 'CURLOPT_REDIR_PROTOCOLS' is deprecated: since 7.85.0. Use CURLOPT_REDIR_PROTOCOLS_STR [-Wdeprecated-declarations]
 2312 |                         if ((option == CURLOPT_PROTOCOLS || option == CURLOPT_REDIR_PROTOCOLS) &&
      |                         ^~
/usr/include/curl/curl.h:1759:3: note: declared here
 1759 |   CURLOPTDEPRECATED(CURLOPT_REDIR_PROTOCOLS, CURLOPTTYPE_LONG, 182,
      |   ^~~~~~~~~~~~~~~~~
/tmp/B.2acy_rzy/BUILD/php-7.2.34/ext/curl/interface.c:2337:17: warning: 'CURLOPT_EGDSOCKET' is deprecated: since 7.84.0. Serves no purpose anymore [-Wdeprecated-declarations]
 2337 |                 case CURLOPT_EGDSOCKET:
      |                 ^~~~
/usr/include/curl/curl.h:1372:3: note: declared here
 1372 |   CURLOPTDEPRECATED(CURLOPT_EGDSOCKET, CURLOPTTYPE_STRINGPOINT, 77,
      |   ^~~~~~~~~~~~~~~~~
/tmp/B.2acy_rzy/BUILD/php-7.2.34/ext/curl/interface.c:2368:17: warning: 'CURLOPT_SOCKS5_GSSAPI_SERVICE' is deprecated: since 7.49.0. Use CURLOPT_PROXY_SERVICE_NAME [-Wdeprecated-declarations]
 2368 |                 case CURLOPT_SOCKS5_GSSAPI_SERVICE:
      |                 ^~~~
/usr/include/curl/curl.h:1742:3: note: declared here
 1742 |   CURLOPTDEPRECATED(CURLOPT_SOCKS5_GSSAPI_SERVICE,
      |   ^~~~~~~~~~~~~~~~~
/tmp/B.2acy_rzy/BUILD/php-7.2.34/ext/curl/interface.c:2732:57: warning: 'curl_formadd' is deprecated: since 7.56.0. Use curl_mime_init() [-Wdeprecated-declarations]
 2732 |                                                         form_error = curl_formadd(&first, &last,
      |                                                         ^~~~~~~~~~
/usr/include/curl/curl.h:2585:1: note: declared here
 2585 | curl_formadd(struct curl_httppost **httppost,
      | ^~~~~~~~~~~~
/tmp/B.2acy_rzy/BUILD/php-7.2.34/ext/curl/interface.c:2733:89: warning: 'CURLFORM_COPYNAME' is deprecated: since 7.56.0. Use curl_mime_name() [-Wdeprecated-declarations]
 2733 |                                                                                         CURLFORM_COPYNAME, ZSTR_VAL(string_key),
      |                                                                                         ^~~~~~~~~~~~~~~~~
/usr/include/curl/curl.h:2510:3: note: declared here
 2510 |   CURLFORM_COPYNAME        CURL_DEPRECATED(7.56.0, "Use curl_mime_name()"),
      |   ^~~~~~~~~~~~~~~~~
/tmp/B.2acy_rzy/BUILD/php-7.2.34/ext/curl/interface.c:2734:89: warning: 'CURLFORM_NAMELENGTH' is deprecated: since 7.56.0.  [-Wdeprecated-declarations]
 2734 |                                                                                         CURLFORM_NAMELENGTH, ZSTR_LEN(string_key),
      |                                                                                         ^~~~~~~~~~~~~~~~~~~
/usr/include/curl/curl.h:2512:3: note: declared here
 2512 |   CURLFORM_NAMELENGTH      CURL_DEPRECATED(7.56.0, ""),
      |   ^~~~~~~~~~~~~~~~~~~
/tmp/B.2acy_rzy/BUILD/php-7.2.34/ext/curl/interface.c:2735:89: warning: 'CURLFORM_FILENAME' is deprecated: since 7.56.0. Use curl_mime_filename() [-Wdeprecated-declarations]
 2735 |                                                                                         CURLFORM_FILENAME, filename ? filename : ZSTR_VAL(postval),
      |                                                                                         ^~~~~~~~~~~~~~~~~
/usr/include/curl/curl.h:2527:3: note: declared here
 2527 |   CURLFORM_FILENAME        CURL_DEPRECATED(7.56.0, "Use curl_mime_filename()"),
      |   ^~~~~~~~~~~~~~~~~
/tmp/B.2acy_rzy/BUILD/php-7.2.34/ext/curl/interface.c:2736:89: warning: 'CURLFORM_CONTENTTYPE' is deprecated: since 7.56.0. Use curl_mime_type() [-Wdeprecated-declarations]
 2736 |                                                                                         CURLFORM_CONTENTTYPE, type ? type : "application/octet-stream",
      |                                                                                         ^~~~~~~~~~~~~~~~~~~~
/usr/include/curl/curl.h:2525:3: note: declared here
 2525 |   CURLFORM_CONTENTTYPE     CURL_DEPRECATED(7.56.0, "Use curl_mime_type()"),
      |   ^~~~~~~~~~~~~~~~~~~~
/tmp/B.2acy_rzy/BUILD/php-7.2.34/ext/curl/interface.c:2737:89: warning: 'CURLFORM_FILE' is deprecated: since 7.56.0. Use curl_mime_filedata() [-Wdeprecated-declarations]
 2737 |                                                                                         CURLFORM_FILE, ZSTR_VAL(postval),
      |                                                                                         ^~~~~~~~~~~~~
/usr/include/curl/curl.h:2519:3: note: declared here
 2519 |   CURLFORM_FILE            CURL_DEPRECATED(7.56.0, "Use curl_mime_filedata()"),
      |   ^~~~~~~~~~~~~
/tmp/B.2acy_rzy/BUILD/php-7.2.34/ext/curl/interface.c:2739:57: warning: 'CURL_FORMADD_OK' is deprecated: since 7.56.0.  [-Wdeprecated-declarations]
 2739 |                                                         if (form_error != CURL_FORMADD_OK) {
      |                                                         ^~
/usr/include/curl/curl.h:2561:3: note: declared here
 2561 |   CURL_FORMADD_OK             CURL_DEPRECATED(7.56.0, ""), /* 1st, no error */
      |   ^~~~~~~~~~~~~~~
/tmp/B.2acy_rzy/BUILD/php-7.2.34/ext/curl/interface.c:2754:41: warning: 'curl_formadd' is deprecated: since 7.56.0. Use curl_mime_init() [-Wdeprecated-declarations]
 2754 |                                         form_error = curl_formadd(&first, &last,
      |                                         ^~~~~~~~~~
/usr/include/curl/curl.h:2585:1: note: declared here
 2585 | curl_formadd(struct curl_httppost **httppost,
      | ^~~~~~~~~~~~
/tmp/B.2acy_rzy/BUILD/php-7.2.34/ext/curl/interface.c:2755:82: warning: 'CURLFORM_COPYNAME' is deprecated: since 7.56.0. Use curl_mime_name() [-Wdeprecated-declarations]
 2755 |                                                                                  CURLFORM_COPYNAME, ZSTR_VAL(string_key),
      |                                                                                  ^~~~~~~~~~~~~~~~~
/usr/include/curl/curl.h:2510:3: note: declared here
 2510 |   CURLFORM_COPYNAME        CURL_DEPRECATED(7.56.0, "Use curl_mime_name()"),
      |   ^~~~~~~~~~~~~~~~~
/tmp/B.2acy_rzy/BUILD/php-7.2.34/ext/curl/interface.c:2756:82: warning: 'CURLFORM_NAMELENGTH' is deprecated: since 7.56.0.  [-Wdeprecated-declarations]
 2756 |                                                                                  CURLFORM_NAMELENGTH, ZSTR_LEN(string_key),
      |                                                                                  ^~~~~~~~~~~~~~~~~~~
/usr/include/curl/curl.h:2512:3: note: declared here
 2512 |   CURLFORM_NAMELENGTH      CURL_DEPRECATED(7.56.0, ""),
      |   ^~~~~~~~~~~~~~~~~~~
/tmp/B.2acy_rzy/BUILD/php-7.2.34/ext/curl/interface.c:2757:82: warning: 'CURLFORM_COPYCONTENTS' is deprecated: since 7.56.0. Use curl_mime_data() [-Wdeprecated-declarations]
 2757 |                                                                                  CURLFORM_COPYCONTENTS, ZSTR_VAL(postval),
      |                                                                                  ^~~~~~~~~~~~~~~~~~~~~
/usr/include/curl/curl.h:2513:3: note: declared here
 2513 |   CURLFORM_COPYCONTENTS    CURL_DEPRECATED(7.56.0, "Use curl_mime_data()"),
      |   ^~~~~~~~~~~~~~~~~~~~~
/tmp/B.2acy_rzy/BUILD/php-7.2.34/ext/curl/interface.c:2758:82: warning: 'CURLFORM_CONTENTSLENGTH' is deprecated: since 7.56.0. Use curl_mime_data() [-Wdeprecated-declarations]
 2758 |                                                                                  CURLFORM_CONTENTSLENGTH, ZSTR_LEN(postval),
      |                                                                                  ^~~~~~~~~~~~~~~~~~~~~~~
/usr/include/curl/curl.h:2515:3: note: declared here
 2515 |   CURLFORM_CONTENTSLENGTH  CURL_DEPRECATED(7.56.0, "Use curl_mime_data()"),
      |   ^~~~~~~~~~~~~~~~~~~~~~~
/tmp/B.2acy_rzy/BUILD/php-7.2.34/ext/curl/interface.c:2761:41: warning: 'CURL_FORMADD_OK' is deprecated: since 7.56.0.  [-Wdeprecated-declarations]
 2761 |                                         if (form_error != CURL_FORMADD_OK) {
      |                                         ^~
/usr/include/curl/curl.h:2561:3: note: declared here
 2561 |   CURL_FORMADD_OK             CURL_DEPRECATED(7.56.0, ""), /* 1st, no error */
      |   ^~~~~~~~~~~~~~~
/tmp/B.2acy_rzy/BUILD/php-7.2.34/ext/curl/interface.c:2778:33: warning: 'CURLOPT_HTTPPOST' is deprecated: since 7.56.0. Use CURLOPT_MIMEPOST [-Wdeprecated-declarations]
 2778 |                                 error = curl_easy_setopt(ch->cp, CURLOPT_HTTPPOST, first);
      |                                 ^~~~~
/usr/include/curl/curl.h:1199:3: note: declared here
 1199 |   CURLOPTDEPRECATED(CURLOPT_HTTPPOST, CURLOPTTYPE_OBJECTPOINT, 24,
      |   ^~~~~~~~~~~~~~~~~
/tmp/B.2acy_rzy/BUILD/php-7.2.34/ext/curl/interface.c:2800:17: warning: 'CURLOPT_PROGRESSFUNCTION' is deprecated: since 7.32.0. Use CURLOPT_XFERINFOFUNCTION [-Wdeprecated-declarations]
 2800 |                 case CURLOPT_PROGRESSFUNCTION:
      |                 ^~~~
/usr/include/curl/curl.h:1299:3: note: declared here
 1299 |   CURLOPTDEPRECATED(CURLOPT_PROGRESSFUNCTION, CURLOPTTYPE_FUNCTIONPOINT, 56,
      |   ^~~~~~~~~~~~~~~~~
/tmp/B.2acy_rzy/BUILD/php-7.2.34/ext/curl/interface.c:2801:25: warning: 'CURLOPT_PROGRESSFUNCTION' is deprecated: since 7.32.0. Use CURLOPT_XFERINFOFUNCTION [-Wdeprecated-declarations]
 2801 |                         curl_easy_setopt(ch->cp, CURLOPT_PROGRESSFUNCTION,      curl_progress);
      |                         ^~~~~~~~~~~~~~~~
/usr/include/curl/curl.h:1299:3: note: declared here
 1299 |   CURLOPTDEPRECATED(CURLOPT_PROGRESSFUNCTION, CURLOPTTYPE_FUNCTIONPOINT, 56,
      |   ^~~~~~~~~~~~~~~~~
/tmp/B.2acy_rzy/BUILD/php-7.2.34/ext/curl/interface.c:2868:17: warning: 'CURLOPT_RANDOM_FILE' is deprecated: since 7.84.0. Serves no purpose anymore [-Wdeprecated-declarations]
 2868 |                 case CURLOPT_RANDOM_FILE:
      |                 ^~~~
/usr/include/curl/curl.h:1368:3: note: declared here
 1368 |   CURLOPTDEPRECATED(CURLOPT_RANDOM_FILE, CURLOPTTYPE_STRINGPOINT, 76,
      |   ^~~~~~~~~~~~~~~~~
/tmp/B.2acy_rzy/BUILD/php-7.2.34/ext/curl/interface.c: In function 'zif_curl_getinfo':
/tmp/B.2acy_rzy/BUILD/php-7.2.34/ext/curl/interface.c:3157:17: warning: 'CURLINFO_SIZE_UPLOAD' is deprecated: since 7.55.0. Use CURLINFO_SIZE_UPLOAD_T [-Wdeprecated-declarations]
 3157 |                 if (curl_easy_getinfo(ch->cp, CURLINFO_SIZE_UPLOAD, &d_code) == CURLE_OK) {
      |                 ^~
/usr/include/curl/curl.h:2863:3: note: declared here
 2863 |   CURLINFO_SIZE_UPLOAD CURL_DEPRECATED(7.55.0, "Use CURLINFO_SIZE_UPLOAD_T")
      |   ^~~~~~~~~~~~~~~~~~~~
/tmp/B.2acy_rzy/BUILD/php-7.2.34/ext/curl/interface.c:3160:17: warning: 'CURLINFO_SIZE_DOWNLOAD' is deprecated: since 7.55.0. Use CURLINFO_SIZE_DOWNLOAD_T [-Wdeprecated-declarations]
 3160 |                 if (curl_easy_getinfo(ch->cp, CURLINFO_SIZE_DOWNLOAD, &d_code) == CURLE_OK) {
      |                 ^~
/usr/include/curl/curl.h:2866:3: note: declared here
 2866 |   CURLINFO_SIZE_DOWNLOAD
      |   ^~~~~~~~~~~~~~~~~~~~~~
/tmp/B.2acy_rzy/BUILD/php-7.2.34/ext/curl/interface.c:3163:17: warning: 'CURLINFO_SPEED_DOWNLOAD' is deprecated: since 7.55.0. Use CURLINFO_SPEED_DOWNLOAD_T [-Wdeprecated-declarations]
 3163 |                 if (curl_easy_getinfo(ch->cp, CURLINFO_SPEED_DOWNLOAD, &d_code) == CURLE_OK) {
      |                 ^~
/usr/include/curl/curl.h:2870:3: note: declared here
 2870 |   CURLINFO_SPEED_DOWNLOAD
      |   ^~~~~~~~~~~~~~~~~~~~~~~
/tmp/B.2acy_rzy/BUILD/php-7.2.34/ext/curl/interface.c:3166:17: warning: 'CURLINFO_SPEED_UPLOAD' is deprecated: since 7.55.0. Use CURLINFO_SPEED_UPLOAD_T [-Wdeprecated-declarations]
 3166 |                 if (curl_easy_getinfo(ch->cp, CURLINFO_SPEED_UPLOAD, &d_code) == CURLE_OK) {
      |                 ^~
/usr/include/curl/curl.h:2874:3: note: declared here
 2874 |   CURLINFO_SPEED_UPLOAD
      |   ^~~~~~~~~~~~~~~~~~~~~
/tmp/B.2acy_rzy/BUILD/php-7.2.34/ext/curl/interface.c:3169:17: warning: 'CURLINFO_CONTENT_LENGTH_DOWNLOAD' is deprecated: since 7.55.0. Use CURLINFO_CONTENT_LENGTH_DOWNLOAD_T [-Wdeprecated-declarations]
 3169 |                 if (curl_easy_getinfo(ch->cp, CURLINFO_CONTENT_LENGTH_DOWNLOAD, &d_code) == CURLE_OK) {
      |                 ^~
/usr/include/curl/curl.h:2883:3: note: declared here
 2883 |   CURLINFO_CONTENT_LENGTH_DOWNLOAD
      |   ^~~~~~~~~~~~~~~~~~~~~~~~~~~~~~~~
/tmp/B.2acy_rzy/BUILD/php-7.2.34/ext/curl/interface.c:3172:17: warning: 'CURLINFO_CONTENT_LENGTH_UPLOAD' is deprecated: since 7.55.0. Use CURLINFO_CONTENT_LENGTH_UPLOAD_T [-Wdeprecated-declarations]
 3172 |                 if (curl_easy_getinfo(ch->cp, CURLINFO_CONTENT_LENGTH_UPLOAD, &d_code) == CURLE_OK) {
      |                 ^~
/usr/include/curl/curl.h:2888:3: note: declared here
 2888 |   CURLINFO_CONTENT_LENGTH_UPLOAD
      |   ^~~~~~~~~~~~~~~~~~~~~~~~~~~~~~
/bin/sh /tmp/B.2acy_rzy/BUILD/php-7.2.34/libtool --silent --preserve-dup-deps --tag=CC --mode=compile x86_64-pld-linux-gnux32-gcc  -Iext/openssl/ -I/tmp/B.2acy_rzy/BUILD/php-7.2.34/ext/openssl/ -DPHP_ATOM_INC -I/tmp/B.2acy_rzy/BUILD/php-7.2.34/include -I/tmp/B.2acy_rzy/BUILD/php-7.2.34/main -I/tmp/B.2acy_rzy/BUILD/php-7.2.34 -I/tmp/B.2acy_rzy/BUILD/php-7.2.34/ext/date/lib -I/usr/include/libxml2 -I/usr/include/enchant -I/usr/include/freetype2 -I/usr/include/libpng16 -I/usr/include/harfbuzz -I/usr/include/glib-2.0 -I/usr/libx32/glib-2.0/include -I/usr/include/imap -I/tmp/B.2acy_rzy/BUILD/php-7.2.34/ext/mbstring/libmbfl -I/tmp/B.2acy_rzy/BUILD/php-7.2.34/ext/mbstring/libmbfl/mbfl -I/usr/include/pspell -I/usr/include/tidy -I/usr/include/xmlrpc-epi -I/tmp/B.2acy_rzy/BUILD/php-7.2.34/TSRM -I/tmp/B.2acy_rzy/BUILD/php-7.2.34/Zend  -DDEBUG_FASTCGI -DHAVE_STRNDUP -I/usr/include/xmlrpc-epi  -I/usr/include -O2 -fwrapv -pipe -Wformat -Werror=format-security -gdwarf-4 -fno-debug-types-section -fvar-tracking-assignments -g2 -Wp,-D_FORTIFY_SOURCE=2 -fstack-protector-strong --param=ssp-buffer-size=4 -Werror=trampolines -fPIC -mtune=generic -march=x86-64 -gdwarf-4 -fno-debug-types-section -fvar-tracking-assignments -g2 -DZEND_SIGNALS    -c /tmp/B.2acy_rzy/BUILD/php-7.2.34/ext/openssl/openssl.c -o ext/openssl/openssl.lo 
/tmp/B.2acy_rzy/BUILD/php-7.2.34/ext/openssl/openssl.c: In function 'php_openssl_generate_private_key':
/tmp/B.2acy_rzy/BUILD/php-7.2.34/ext/openssl/openssl.c:3939:49: warning: 'RSA_new' is deprecated: Since OpenSSL 3.0 [-Wdeprecated-declarations]
 3939 |                                                 rsaparam = RSA_new();
      |                                                 ^~~~~~~~
In file included from /tmp/B.2acy_rzy/BUILD/php-7.2.34/ext/openssl/openssl.c:47:
/usr/include/openssl/rsa.h:207:28: note: declared here
  207 | OSSL_DEPRECATEDIN_3_0 RSA *RSA_new(void);
      |                            ^~~~~~~
/tmp/B.2acy_rzy/BUILD/php-7.2.34/ext/openssl/openssl.c:3941:49: warning: 'RSA_generate_key_ex' is deprecated: Since OpenSSL 3.0 [-Wdeprecated-declarations]
 3941 |                                                 if (rsaparam == NULL || !RSA_generate_key_ex(rsaparam, req->priv_key_bits, bne, NULL)) {
      |                                                 ^~
/usr/include/openssl/rsa.h:266:27: note: declared here
  266 | OSSL_DEPRECATEDIN_3_0 int RSA_generate_key_ex(RSA *rsa, int bits, BIGNUM *e,
      |                           ^~~~~~~~~~~~~~~~~~~
/tmp/B.2acy_rzy/BUILD/php-7.2.34/ext/openssl/openssl.c:3947:41: warning: 'EVP_PKEY_assign' is deprecated: Since OpenSSL 3.0 [-Wdeprecated-declarations]
 3947 |                                         if (rsaparam && EVP_PKEY_assign_RSA(req->priv_key, rsaparam)) {
      |                                         ^~
In file included from /tmp/B.2acy_rzy/BUILD/php-7.2.34/ext/openssl/openssl.c:45:
/usr/include/openssl/evp.h:1333:5: note: declared here
 1333 | int EVP_PKEY_assign(EVP_PKEY *pkey, int type, void *key);
      |     ^~~~~~~~~~~~~~~
/tmp/B.2acy_rzy/BUILD/php-7.2.34/ext/openssl/openssl.c:3958:41: warning: 'DSA_new' is deprecated: Since OpenSSL 3.0 [-Wdeprecated-declarations]
 3958 |                                         DSA *dsaparam = DSA_new();
      |                                         ^~~
In file included from /tmp/B.2acy_rzy/BUILD/php-7.2.34/ext/openssl/openssl.c:48:
/usr/include/openssl/dsa.h:130:28: note: declared here
  130 | OSSL_DEPRECATEDIN_3_0 DSA *DSA_new(void);
      |                            ^~~~~~~
/tmp/B.2acy_rzy/BUILD/php-7.2.34/ext/openssl/openssl.c:3959:41: warning: 'DSA_generate_parameters_ex' is deprecated: Since OpenSSL 3.0 [-Wdeprecated-declarations]
 3959 |                                         if (dsaparam && DSA_generate_parameters_ex(dsaparam, req->priv_key_bits, NULL, 0, NULL, NULL, NULL)) {
      |                                         ^~
/usr/include/openssl/dsa.h:172:27: note: declared here
  172 | OSSL_DEPRECATEDIN_3_0 int DSA_generate_parameters_ex(DSA *dsa, int bits,
      |                           ^~~~~~~~~~~~~~~~~~~~~~~~~~
/tmp/B.2acy_rzy/BUILD/php-7.2.34/ext/openssl/openssl.c:3960:49: warning: 'DSA_set_method' is deprecated: Since OpenSSL 3.0 [-Wdeprecated-declarations]
 3960 |                                                 DSA_set_method(dsaparam, DSA_get_default_method());
      |                                                 ^~~~~~~~~~~~~~
/usr/include/openssl/dsa.h:127:27: note: declared here
  127 | OSSL_DEPRECATEDIN_3_0 int DSA_set_method(DSA *dsa, const DSA_METHOD *);
      |                           ^~~~~~~~~~~~~~
/tmp/B.2acy_rzy/BUILD/php-7.2.34/ext/openssl/openssl.c:3960:49: warning: 'DSA_get_default_method' is deprecated: Since OpenSSL 3.0 [-Wdeprecated-declarations]
 3960 |                                                 DSA_set_method(dsaparam, DSA_get_default_method());
      |                                                 ^~~~~~~~~~~~~~
/usr/include/openssl/dsa.h:126:41: note: declared here
  126 | OSSL_DEPRECATEDIN_3_0 const DSA_METHOD *DSA_get_default_method(void);
      |                                         ^~~~~~~~~~~~~~~~~~~~~~
/tmp/B.2acy_rzy/BUILD/php-7.2.34/ext/openssl/openssl.c:3961:49: warning: 'DSA_generate_key' is deprecated: Since OpenSSL 3.0 [-Wdeprecated-declarations]
 3961 |                                                 if (DSA_generate_key(dsaparam)) {
      |                                                 ^~
/usr/include/openssl/dsa.h:179:27: note: declared here
  179 | OSSL_DEPRECATEDIN_3_0 int DSA_generate_key(DSA *a);
      |                           ^~~~~~~~~~~~~~~~
/tmp/B.2acy_rzy/BUILD/php-7.2.34/ext/openssl/openssl.c:3962:57: warning: 'EVP_PKEY_assign' is deprecated: Since OpenSSL 3.0 [-Wdeprecated-declarations]
 3962 |                                                         if (EVP_PKEY_assign_DSA(req->priv_key, dsaparam)) {
      |                                                         ^~
/usr/include/openssl/evp.h:1333:5: note: declared here
 1333 | int EVP_PKEY_assign(EVP_PKEY *pkey, int type, void *key);
      |     ^~~~~~~~~~~~~~~
/tmp/B.2acy_rzy/BUILD/php-7.2.34/ext/openssl/openssl.c:3969:57: warning: 'DSA_free' is deprecated: Since OpenSSL 3.0 [-Wdeprecated-declarations]
 3969 |                                                         DSA_free(dsaparam);
      |                                                         ^~~~~~~~
/usr/include/openssl/dsa.h:132:28: note: declared here
  132 | OSSL_DEPRECATEDIN_3_0 void DSA_free(DSA *r);
      |                            ^~~~~~~~
/tmp/B.2acy_rzy/BUILD/php-7.2.34/ext/openssl/openssl.c:3982:41: warning: 'DH_new' is deprecated: Since OpenSSL 3.0 [-Wdeprecated-declarations]
 3982 |                                         DH *dhparam = DH_new();
      |                                         ^~
In file included from /usr/include/openssl/dsa.h:31:
/usr/include/openssl/dh.h:206:27: note: declared here
  206 | OSSL_DEPRECATEDIN_3_0 DH *DH_new(void);
      |                           ^~~~~~
/tmp/B.2acy_rzy/BUILD/php-7.2.34/ext/openssl/openssl.c:3983:41: warning: 'DH_generate_parameters_ex' is deprecated: Since OpenSSL 3.0 [-Wdeprecated-declarations]
 3983 |                                         if (dhparam && DH_generate_parameters_ex(dhparam, req->priv_key_bits, 2, NULL)) {
      |                                         ^~
/usr/include/openssl/dh.h:219:27: note: declared here
  219 | OSSL_DEPRECATEDIN_3_0 int DH_generate_parameters_ex(DH *dh, int prime_len,
      |                           ^~~~~~~~~~~~~~~~~~~~~~~~~
/tmp/B.2acy_rzy/BUILD/php-7.2.34/ext/openssl/openssl.c:3984:49: warning: 'DH_set_method' is deprecated: Since OpenSSL 3.0 [-Wdeprecated-declarations]
 3984 |                                                 DH_set_method(dhparam, DH_get_default_method());
      |                                                 ^~~~~~~~~~~~~
/usr/include/openssl/dh.h:203:27: note: declared here
  203 | OSSL_DEPRECATEDIN_3_0 int DH_set_method(DH *dh, const DH_METHOD *meth);
      |                           ^~~~~~~~~~~~~
/tmp/B.2acy_rzy/BUILD/php-7.2.34/ext/openssl/openssl.c:3984:49: warning: 'DH_get_default_method' is deprecated: Since OpenSSL 3.0 [-Wdeprecated-declarations]
 3984 |                                                 DH_set_method(dhparam, DH_get_default_method());
      |                                                 ^~~~~~~~~~~~~
/usr/include/openssl/dh.h:202:40: note: declared here
  202 | OSSL_DEPRECATEDIN_3_0 const DH_METHOD *DH_get_default_method(void);
      |                                        ^~~~~~~~~~~~~~~~~~~~~
/tmp/B.2acy_rzy/BUILD/php-7.2.34/ext/openssl/openssl.c:3985:49: warning: 'DH_check' is deprecated: Since OpenSSL 3.0 [-Wdeprecated-declarations]
 3985 |                                                 if (DH_check(dhparam, &codes) && codes == 0 && DH_generate_key(dhparam)) {
      |                                                 ^~
/usr/include/openssl/dh.h:227:27: note: declared here
  227 | OSSL_DEPRECATEDIN_3_0 int DH_check(const DH *dh, int *codes);
      |                           ^~~~~~~~
/tmp/B.2acy_rzy/BUILD/php-7.2.34/ext/openssl/openssl.c:3985:49: warning: 'DH_generate_key' is deprecated: Since OpenSSL 3.0 [-Wdeprecated-declarations]
 3985 |                                                 if (DH_check(dhparam, &codes) && codes == 0 && DH_generate_key(dhparam)) {
      |                                                 ^~
/usr/include/openssl/dh.h:230:27: note: declared here
  230 | OSSL_DEPRECATEDIN_3_0 int DH_generate_key(DH *dh);
      |                           ^~~~~~~~~~~~~~~
/tmp/B.2acy_rzy/BUILD/php-7.2.34/ext/openssl/openssl.c:3986:57: warning: 'EVP_PKEY_assign' is deprecated: Since OpenSSL 3.0 [-Wdeprecated-declarations]
 3986 |                                                         if (EVP_PKEY_assign_DH(req->priv_key, dhparam)) {
      |                                                         ^~
/usr/include/openssl/evp.h:1333:5: note: declared here
 1333 | int EVP_PKEY_assign(EVP_PKEY *pkey, int type, void *key);
      |     ^~~~~~~~~~~~~~~
/tmp/B.2acy_rzy/BUILD/php-7.2.34/ext/openssl/openssl.c:3993:57: warning: 'DH_free' is deprecated: Since OpenSSL 3.0 [-Wdeprecated-declarations]
 3993 |                                                         DH_free(dhparam);
      |                                                         ^~~~~~~
/usr/include/openssl/dh.h:207:28: note: declared here
  207 | OSSL_DEPRECATEDIN_3_0 void DH_free(DH *dh);
      |                            ^~~~~~~
/tmp/B.2acy_rzy/BUILD/php-7.2.34/ext/openssl/openssl.c:4009:41: warning: 'EC_KEY_new_by_curve_name' is deprecated: Since OpenSSL 3.0 [-Wdeprecated-declarations]
 4009 |                                         eckey = EC_KEY_new_by_curve_name(req->curve_name);
      |                                         ^~~~~
In file included from /usr/include/openssl/x509.h:33,
                 from /tmp/B.2acy_rzy/BUILD/php-7.2.34/ext/openssl/openssl.c:50:
/usr/include/openssl/ec.h:1001:31: note: declared here
 1001 | OSSL_DEPRECATEDIN_3_0 EC_KEY *EC_KEY_new_by_curve_name(int nid);
      |                               ^~~~~~~~~~~~~~~~~~~~~~~~
/tmp/B.2acy_rzy/BUILD/php-7.2.34/ext/openssl/openssl.c:4011:49: warning: 'EC_KEY_set_asn1_flag' is deprecated: Since OpenSSL 3.0 [-Wdeprecated-declarations]
 4011 |                                                 EC_KEY_set_asn1_flag(eckey, OPENSSL_EC_NAMED_CURVE);
      |                                                 ^~~~~~~~~~~~~~~~~~~~
/usr/include/openssl/ec.h:1090:28: note: declared here
 1090 | OSSL_DEPRECATEDIN_3_0 void EC_KEY_set_asn1_flag(EC_KEY *eckey, int asn1_flag);
      |                            ^~~~~~~~~~~~~~~~~~~~
/tmp/B.2acy_rzy/BUILD/php-7.2.34/ext/openssl/openssl.c:4012:49: warning: 'EC_KEY_generate_key' is deprecated: Since OpenSSL 3.0 [-Wdeprecated-declarations]
 4012 |                                                 if (EC_KEY_generate_key(eckey) &&
      |                                                 ^~
/usr/include/openssl/ec.h:1104:27: note: declared here
 1104 | OSSL_DEPRECATEDIN_3_0 int EC_KEY_generate_key(EC_KEY *key);
      |                           ^~~~~~~~~~~~~~~~~~~
/tmp/B.2acy_rzy/BUILD/php-7.2.34/ext/openssl/openssl.c:4013:57: warning: 'EVP_PKEY_assign' is deprecated: Since OpenSSL 3.0 [-Wdeprecated-declarations]
 4013 |                                                         EVP_PKEY_assign_EC_KEY(req->priv_key, eckey)) {
      |                                                         ^~~~~~~~~~~~~~~~~~~~~~
/usr/include/openssl/evp.h:1333:5: note: declared here
 1333 | int EVP_PKEY_assign(EVP_PKEY *pkey, int type, void *key);
      |     ^~~~~~~~~~~~~~~
/tmp/B.2acy_rzy/BUILD/php-7.2.34/ext/openssl/openssl.c:4016:57: warning: 'EC_KEY_free' is deprecated: Since OpenSSL 3.0 [-Wdeprecated-declarations]
 4016 |                                                         EC_KEY_free(eckey);
      |                                                         ^~~~~~~~~~~
/usr/include/openssl/ec.h:1006:28: note: declared here
 1006 | OSSL_DEPRECATEDIN_3_0 void EC_KEY_free(EC_KEY *key);
      |                            ^~~~~~~~~~~
/tmp/B.2acy_rzy/BUILD/php-7.2.34/ext/openssl/openssl.c: In function 'php_openssl_is_private_key':
/tmp/B.2acy_rzy/BUILD/php-7.2.34/ext/openssl/openssl.c:4051:33: warning: 'EVP_PKEY_get0_RSA' is deprecated: Since OpenSSL 3.0 [-Wdeprecated-declarations]
 4051 |                                 RSA *rsa = EVP_PKEY_get0_RSA(pkey);
      |                                 ^~~
/usr/include/openssl/evp.h:1351:22: note: declared here
 1351 | const struct rsa_st *EVP_PKEY_get0_RSA(const EVP_PKEY *pkey);
      |                      ^~~~~~~~~~~~~~~~~
/tmp/B.2acy_rzy/BUILD/php-7.2.34/ext/openssl/openssl.c:4051:44: warning: initialization discards 'const' qualifier from pointer target type [-Wdiscarded-qualifiers]
 4051 |                                 RSA *rsa = EVP_PKEY_get0_RSA(pkey);
      |                                            ^~~~~~~~~~~~~~~~~
/tmp/B.2acy_rzy/BUILD/php-7.2.34/ext/openssl/openssl.c:4055:41: warning: 'RSA_get0_factors' is deprecated: Since OpenSSL 3.0 [-Wdeprecated-declarations]
 4055 |                                         RSA_get0_factors(rsa, &p, &q);
      |                                         ^~~~~~~~~~~~~~~~
/usr/include/openssl/rsa.h:226:28: note: declared here
  226 | OSSL_DEPRECATEDIN_3_0 void RSA_get0_factors(const RSA *r,
      |                            ^~~~~~~~~~~~~~~~
/tmp/B.2acy_rzy/BUILD/php-7.2.34/ext/openssl/openssl.c:4068:33: warning: 'EVP_PKEY_get0_DSA' is deprecated: Since OpenSSL 3.0 [-Wdeprecated-declarations]
 4068 |                                 DSA *dsa = EVP_PKEY_get0_DSA(pkey);
      |                                 ^~~
/usr/include/openssl/evp.h:1360:22: note: declared here
 1360 | const struct dsa_st *EVP_PKEY_get0_DSA(const EVP_PKEY *pkey);
      |                      ^~~~~~~~~~~~~~~~~
/tmp/B.2acy_rzy/BUILD/php-7.2.34/ext/openssl/openssl.c:4068:44: warning: initialization discards 'const' qualifier from pointer target type [-Wdiscarded-qualifiers]
 4068 |                                 DSA *dsa = EVP_PKEY_get0_DSA(pkey);
      |                                            ^~~~~~~~~~~~~~~~~
/tmp/B.2acy_rzy/BUILD/php-7.2.34/ext/openssl/openssl.c:4072:41: warning: 'DSA_get0_pqg' is deprecated: Since OpenSSL 3.0 [-Wdeprecated-declarations]
 4072 |                                         DSA_get0_pqg(dsa, &p, &q, &g);
      |                                         ^~~~~~~~~~~~
/usr/include/openssl/dsa.h:206:28: note: declared here
  206 | OSSL_DEPRECATEDIN_3_0 void DSA_get0_pqg(const DSA *d, const BIGNUM **p,
      |                            ^~~~~~~~~~~~
/tmp/B.2acy_rzy/BUILD/php-7.2.34/ext/openssl/openssl.c:4077:41: warning: 'DSA_get0_key' is deprecated: Since OpenSSL 3.0 [-Wdeprecated-declarations]
 4077 |                                         DSA_get0_key(dsa, &pub_key, &priv_key);
      |                                         ^~~~~~~~~~~~
/usr/include/openssl/dsa.h:209:28: note: declared here
  209 | OSSL_DEPRECATEDIN_3_0 void DSA_get0_key(const DSA *d, const BIGNUM **pub_key,
      |                            ^~~~~~~~~~~~
/tmp/B.2acy_rzy/BUILD/php-7.2.34/ext/openssl/openssl.c:4086:33: warning: 'EVP_PKEY_get0_DH' is deprecated: Since OpenSSL 3.0 [-Wdeprecated-declarations]
 4086 |                                 DH *dh = EVP_PKEY_get0_DH(pkey);
      |                                 ^~
/usr/include/openssl/evp.h:1368:43: note: declared here
 1368 | OSSL_DEPRECATEDIN_3_0 const struct dh_st *EVP_PKEY_get0_DH(const EVP_PKEY *pkey);
      |                                           ^~~~~~~~~~~~~~~~
/tmp/B.2acy_rzy/BUILD/php-7.2.34/ext/openssl/openssl.c:4086:42: warning: initialization discards 'const' qualifier from pointer target type [-Wdiscarded-qualifiers]
 4086 |                                 DH *dh = EVP_PKEY_get0_DH(pkey);
      |                                          ^~~~~~~~~~~~~~~~
/tmp/B.2acy_rzy/BUILD/php-7.2.34/ext/openssl/openssl.c:4090:41: warning: 'DH_get0_pqg' is deprecated: Since OpenSSL 3.0 [-Wdeprecated-declarations]
 4090 |                                         DH_get0_pqg(dh, &p, &q, &g);
      |                                         ^~~~~~~~~~~
/usr/include/openssl/dh.h:260:28: note: declared here
  260 | OSSL_DEPRECATEDIN_3_0 void DH_get0_pqg(const DH *dh, const BIGNUM **p,
      |                            ^~~~~~~~~~~
/tmp/B.2acy_rzy/BUILD/php-7.2.34/ext/openssl/openssl.c:4095:41: warning: 'DH_get0_key' is deprecated: Since OpenSSL 3.0 [-Wdeprecated-declarations]
 4095 |                                         DH_get0_key(dh, &pub_key, &priv_key);
      |                                         ^~~~~~~~~~~
/usr/include/openssl/dh.h:263:28: note: declared here
  263 | OSSL_DEPRECATEDIN_3_0 void DH_get0_key(const DH *dh, const BIGNUM **pub_key,
      |                            ^~~~~~~~~~~
/tmp/B.2acy_rzy/BUILD/php-7.2.34/ext/openssl/openssl.c:4105:33: warning: 'EVP_PKEY_get0_EC_KEY' is deprecated: Since OpenSSL 3.0 [-Wdeprecated-declarations]
 4105 |                                 EC_KEY *ec = EVP_PKEY_get0_EC_KEY(pkey);
      |                                 ^~~~~~
/usr/include/openssl/evp.h:1377:25: note: declared here
 1377 | const struct ec_key_st *EVP_PKEY_get0_EC_KEY(const EVP_PKEY *pkey);
      |                         ^~~~~~~~~~~~~~~~~~~~
/tmp/B.2acy_rzy/BUILD/php-7.2.34/ext/openssl/openssl.c:4105:46: warning: initialization discards 'const' qualifier from pointer target type [-Wdiscarded-qualifiers]
 4105 |                                 EC_KEY *ec = EVP_PKEY_get0_EC_KEY(pkey);
      |                                              ^~~~~~~~~~~~~~~~~~~~
/tmp/B.2acy_rzy/BUILD/php-7.2.34/ext/openssl/openssl.c:4106:33: warning: 'EC_KEY_get0_private_key' is deprecated: Since OpenSSL 3.0 [-Wdeprecated-declarations]
 4106 |                                 if (ec != NULL && NULL == EC_KEY_get0_private_key(ec)) {
      |                                 ^~
/usr/include/openssl/ec.h:1051:37: note: declared here
 1051 | OSSL_DEPRECATEDIN_3_0 const BIGNUM *EC_KEY_get0_private_key(const EC_KEY *key);
      |                                     ^~~~~~~~~~~~~~~~~~~~~~~
/tmp/B.2acy_rzy/BUILD/php-7.2.34/ext/openssl/openssl.c: In function 'php_openssl_pkey_init_and_assign_rsa':
/tmp/B.2acy_rzy/BUILD/php-7.2.34/ext/openssl/openssl.c:4152:9: warning: 'RSA_set0_key' is deprecated: Since OpenSSL 3.0 [-Wdeprecated-declarations]
 4152 |         if (!n || !d || !RSA_set0_key(rsa, n, e, d)) {
      |         ^~
/usr/include/openssl/rsa.h:213:27: note: declared here
  213 | OSSL_DEPRECATEDIN_3_0 int RSA_set0_key(RSA *r, BIGNUM *n, BIGNUM *e, BIGNUM *d);
      |                           ^~~~~~~~~~~~
/tmp/B.2acy_rzy/BUILD/php-7.2.34/ext/openssl/openssl.c:4158:9: warning: 'RSA_set0_factors' is deprecated: Since OpenSSL 3.0 [-Wdeprecated-declarations]
 4158 |         if ((p || q) && !RSA_set0_factors(rsa, p, q)) {
      |         ^~
/usr/include/openssl/rsa.h:214:27: note: declared here
  214 | OSSL_DEPRECATEDIN_3_0 int RSA_set0_factors(RSA *r, BIGNUM *p, BIGNUM *q);
      |                           ^~~~~~~~~~~~~~~~
/tmp/B.2acy_rzy/BUILD/php-7.2.34/ext/openssl/openssl.c:4165:9: warning: 'RSA_set0_crt_params' is deprecated: Since OpenSSL 3.0 [-Wdeprecated-declarations]
 4165 |         if ((dmp1 || dmq1 || iqmp) && !RSA_set0_crt_params(rsa, dmp1, dmq1, iqmp)) {
      |         ^~
/usr/include/openssl/rsa.h:215:27: note: declared here
  215 | OSSL_DEPRECATEDIN_3_0 int RSA_set0_crt_params(RSA *r,
      |                           ^~~~~~~~~~~~~~~~~~~
/tmp/B.2acy_rzy/BUILD/php-7.2.34/ext/openssl/openssl.c:4169:9: warning: 'EVP_PKEY_assign' is deprecated: Since OpenSSL 3.0 [-Wdeprecated-declarations]
 4169 |         if (!EVP_PKEY_assign_RSA(pkey, rsa)) {
      |         ^~
/usr/include/openssl/evp.h:1333:5: note: declared here
 1333 | int EVP_PKEY_assign(EVP_PKEY *pkey, int type, void *key);
      |     ^~~~~~~~~~~~~~~
/tmp/B.2acy_rzy/BUILD/php-7.2.34/ext/openssl/openssl.c: In function 'php_openssl_pkey_init_dsa':
/tmp/B.2acy_rzy/BUILD/php-7.2.34/ext/openssl/openssl.c:4186:9: warning: 'DSA_set0_pqg' is deprecated: Since OpenSSL 3.0 [-Wdeprecated-declarations]
 4186 |         if (!p || !q || !g || !DSA_set0_pqg(dsa, p, q, g)) {
      |         ^~
/usr/include/openssl/dsa.h:208:27: note: declared here
  208 | OSSL_DEPRECATEDIN_3_0 int DSA_set0_pqg(DSA *d, BIGNUM *p, BIGNUM *q, BIGNUM *g);
      |                           ^~~~~~~~~~~~
/tmp/B.2acy_rzy/BUILD/php-7.2.34/ext/openssl/openssl.c:4193:17: warning: 'DSA_set0_key' is deprecated: Since OpenSSL 3.0 [-Wdeprecated-declarations]
 4193 |                 return DSA_set0_key(dsa, pub_key, priv_key);
      |                 ^~~~~~
/usr/include/openssl/dsa.h:211:27: note: declared here
  211 | OSSL_DEPRECATEDIN_3_0 int DSA_set0_key(DSA *d, BIGNUM *pub_key,
      |                           ^~~~~~~~~~~~
/tmp/B.2acy_rzy/BUILD/php-7.2.34/ext/openssl/openssl.c:4198:9: warning: 'DSA_generate_key' is deprecated: Since OpenSSL 3.0 [-Wdeprecated-declarations]
 4198 |         if (!DSA_generate_key(dsa)) {
      |         ^~
/usr/include/openssl/dsa.h:179:27: note: declared here
  179 | OSSL_DEPRECATEDIN_3_0 int DSA_generate_key(DSA *a);
      |                           ^~~~~~~~~~~~~~~~
/tmp/B.2acy_rzy/BUILD/php-7.2.34/ext/openssl/openssl.c:4205:9: warning: 'DSA_get0_key' is deprecated: Since OpenSSL 3.0 [-Wdeprecated-declarations]
 4205 |         DSA_get0_key(dsa, &pub_key_const, &priv_key_const);
      |         ^~~~~~~~~~~~
/usr/include/openssl/dsa.h:209:28: note: declared here
  209 | OSSL_DEPRECATEDIN_3_0 void DSA_get0_key(const DSA *d, const BIGNUM **pub_key,
      |                            ^~~~~~~~~~~~
/tmp/B.2acy_rzy/BUILD/php-7.2.34/ext/openssl/openssl.c: In function 'php_openssl_pkey_init_dh':
/tmp/B.2acy_rzy/BUILD/php-7.2.34/ext/openssl/openssl.c:4263:9: warning: 'DH_set0_pqg' is deprecated: Since OpenSSL 3.0 [-Wdeprecated-declarations]
 4263 |         if (!p || !g || !DH_set0_pqg(dh, p, q, g)) {
      |         ^~
/usr/include/openssl/dh.h:262:27: note: declared here
  262 | OSSL_DEPRECATEDIN_3_0 int DH_set0_pqg(DH *dh, BIGNUM *p, BIGNUM *q, BIGNUM *g);
      |                           ^~~~~~~~~~~
/tmp/B.2acy_rzy/BUILD/php-7.2.34/ext/openssl/openssl.c:4270:17: warning: 'DH_set0_key' is deprecated: Since OpenSSL 3.0 [-Wdeprecated-declarations]
 4270 |                 return DH_set0_key(dh, pub_key, priv_key);
      |                 ^~~~~~
/usr/include/openssl/dh.h:265:27: note: declared here
  265 | OSSL_DEPRECATEDIN_3_0 int DH_set0_key(DH *dh, BIGNUM *pub_key, BIGNUM *priv_key);
      |                           ^~~~~~~~~~~
/tmp/B.2acy_rzy/BUILD/php-7.2.34/ext/openssl/openssl.c:4277:17: warning: 'DH_set0_key' is deprecated: Since OpenSSL 3.0 [-Wdeprecated-declarations]
 4277 |                 return DH_set0_key(dh, pub_key, priv_key);
      |                 ^~~~~~
/usr/include/openssl/dh.h:265:27: note: declared here
  265 | OSSL_DEPRECATEDIN_3_0 int DH_set0_key(DH *dh, BIGNUM *pub_key, BIGNUM *priv_key);
      |                           ^~~~~~~~~~~
/tmp/B.2acy_rzy/BUILD/php-7.2.34/ext/openssl/openssl.c:4282:9: warning: 'DH_generate_key' is deprecated: Since OpenSSL 3.0 [-Wdeprecated-declarations]
 4282 |         if (!DH_generate_key(dh)) {
      |         ^~
/usr/include/openssl/dh.h:230:27: note: declared here
  230 | OSSL_DEPRECATEDIN_3_0 int DH_generate_key(DH *dh);
      |                           ^~~~~~~~~~~~~~~
/tmp/B.2acy_rzy/BUILD/php-7.2.34/ext/openssl/openssl.c: In function 'zif_openssl_pkey_new':
/tmp/B.2acy_rzy/BUILD/php-7.2.34/ext/openssl/openssl.c:4311:33: warning: 'RSA_new' is deprecated: Since OpenSSL 3.0 [-Wdeprecated-declarations]
 4311 |                                 RSA *rsa = RSA_new();
      |                                 ^~~
/usr/include/openssl/rsa.h:207:28: note: declared here
  207 | OSSL_DEPRECATEDIN_3_0 RSA *RSA_new(void);
      |                            ^~~~~~~
/tmp/B.2acy_rzy/BUILD/php-7.2.34/ext/openssl/openssl.c:4316:41: warning: 'RSA_free' is deprecated: Since OpenSSL 3.0 [-Wdeprecated-declarations]
 4316 |                                         RSA_free(rsa);
      |                                         ^~~~~~~~
/usr/include/openssl/rsa.h:299:28: note: declared here
  299 | OSSL_DEPRECATEDIN_3_0 void RSA_free(RSA *r);
      |                            ^~~~~~~~
/tmp/B.2acy_rzy/BUILD/php-7.2.34/ext/openssl/openssl.c:4329:33: warning: 'DSA_new' is deprecated: Since OpenSSL 3.0 [-Wdeprecated-declarations]
 4329 |                                 DSA *dsa = DSA_new();
      |                                 ^~~
/usr/include/openssl/dsa.h:130:28: note: declared here
  130 | OSSL_DEPRECATEDIN_3_0 DSA *DSA_new(void);
      |                            ^~~~~~~
/tmp/B.2acy_rzy/BUILD/php-7.2.34/ext/openssl/openssl.c:4332:49: warning: 'EVP_PKEY_assign' is deprecated: Since OpenSSL 3.0 [-Wdeprecated-declarations]
 4332 |                                                 if (EVP_PKEY_assign_DSA(pkey, dsa)) {
      |                                                 ^~
/usr/include/openssl/evp.h:1333:5: note: declared here
 1333 | int EVP_PKEY_assign(EVP_PKEY *pkey, int type, void *key);
      |     ^~~~~~~~~~~~~~~
/tmp/B.2acy_rzy/BUILD/php-7.2.34/ext/openssl/openssl.c:4338:41: warning: 'DSA_free' is deprecated: Since OpenSSL 3.0 [-Wdeprecated-declarations]
 4338 |                                         DSA_free(dsa);
      |                                         ^~~~~~~~
/usr/include/openssl/dsa.h:132:28: note: declared here
  132 | OSSL_DEPRECATEDIN_3_0 void DSA_free(DSA *r);
      |                            ^~~~~~~~
/tmp/B.2acy_rzy/BUILD/php-7.2.34/ext/openssl/openssl.c:4351:33: warning: 'DH_new' is deprecated: Since OpenSSL 3.0 [-Wdeprecated-declarations]
 4351 |                                 DH *dh = DH_new();
      |                                 ^~
/usr/include/openssl/dh.h:206:27: note: declared here
  206 | OSSL_DEPRECATEDIN_3_0 DH *DH_new(void);
      |                           ^~~~~~
/tmp/B.2acy_rzy/BUILD/php-7.2.34/ext/openssl/openssl.c:4354:49: warning: 'EVP_PKEY_assign' is deprecated: Since OpenSSL 3.0 [-Wdeprecated-declarations]
 4354 |                                                 if (EVP_PKEY_assign_DH(pkey, dh)) {
      |                                                 ^~
/usr/include/openssl/evp.h:1333:5: note: declared here
 1333 | int EVP_PKEY_assign(EVP_PKEY *pkey, int type, void *key);
      |     ^~~~~~~~~~~~~~~
/tmp/B.2acy_rzy/BUILD/php-7.2.34/ext/openssl/openssl.c:4361:41: warning: 'DH_free' is deprecated: Since OpenSSL 3.0 [-Wdeprecated-declarations]
 4361 |                                         DH_free(dh);
      |                                         ^~~~~~~
/usr/include/openssl/dh.h:207:28: note: declared here
  207 | OSSL_DEPRECATEDIN_3_0 void DH_free(DH *dh);
      |                            ^~~~~~~
/tmp/B.2acy_rzy/BUILD/php-7.2.34/ext/openssl/openssl.c:4379:33: warning: 'EC_KEY_new' is deprecated: Since OpenSSL 3.0 [-Wdeprecated-declarations]
 4379 |                                 eckey = EC_KEY_new();
      |                                 ^~~~~
/usr/include/openssl/ec.h:971:31: note: declared here
  971 | OSSL_DEPRECATEDIN_3_0 EC_KEY *EC_KEY_new(void);
      |                               ^~~~~~~~~~
/tmp/B.2acy_rzy/BUILD/php-7.2.34/ext/openssl/openssl.c:4397:57: warning: 'EC_KEY_set_group' is deprecated: Since OpenSSL 3.0 [-Wdeprecated-declarations]
 4397 |                                                         if (!EC_KEY_set_group(eckey, group)) {
      |                                                         ^~
/usr/include/openssl/ec.h:1045:27: note: declared here
 1045 | OSSL_DEPRECATEDIN_3_0 int EC_KEY_set_group(EC_KEY *key, const EC_GROUP *group);
      |                           ^~~~~~~~~~~~~~~~
/tmp/B.2acy_rzy/BUILD/php-7.2.34/ext/openssl/openssl.c:4413:49: warning: 'EC_KEY_set_private_key' is deprecated: Since OpenSSL 3.0 [-Wdeprecated-declarations]
 4413 |                                                 if (!EC_KEY_set_private_key(eckey, d)) {
      |                                                 ^~
/usr/include/openssl/ec.h:1059:27: note: declared here
 1059 | OSSL_DEPRECATEDIN_3_0 int EC_KEY_set_private_key(EC_KEY *key, const BIGNUM *prv);
      |                           ^~~~~~~~~~~~~~~~~~~~~~
/tmp/B.2acy_rzy/BUILD/php-7.2.34/ext/openssl/openssl.c:4435:49: warning: 'EC_POINT_set_affine_coordinates_GFp' is deprecated: Since OpenSSL 3.0 [-Wdeprecated-declarations]
 4435 |                                                 if (!EC_POINT_set_affine_coordinates_GFp(
      |                                                 ^~
/usr/include/openssl/ec.h:649:27: note: declared here
  649 | OSSL_DEPRECATEDIN_3_0 int EC_POINT_set_affine_coordinates_GFp
      |                           ^~~~~~~~~~~~~~~~~~~~~~~~~~~~~~~~~~~
/tmp/B.2acy_rzy/BUILD/php-7.2.34/ext/openssl/openssl.c:4444:49: warning: 'EC_KEY_set_public_key' is deprecated: Since OpenSSL 3.0 [-Wdeprecated-declarations]
 4444 |                                                 if (!EC_KEY_set_public_key(eckey, pnt)) {
      |                                                 ^~
/usr/include/openssl/ec.h:1073:27: note: declared here
 1073 | OSSL_DEPRECATEDIN_3_0 int EC_KEY_set_public_key(EC_KEY *key, const EC_POINT *pub);
      |                           ^~~~~~~~~~~~~~~~~~~~~
/tmp/B.2acy_rzy/BUILD/php-7.2.34/ext/openssl/openssl.c:4452:41: warning: 'EC_KEY_check_key' is deprecated: Since OpenSSL 3.0 [-Wdeprecated-declarations]
 4452 |                                         if (!EC_KEY_check_key(eckey)) {
      |                                         ^~
/usr/include/openssl/ec.h:1110:27: note: declared here
 1110 | OSSL_DEPRECATEDIN_3_0 int EC_KEY_check_key(const EC_KEY *key);
      |                           ^~~~~~~~~~~~~~~~
/tmp/B.2acy_rzy/BUILD/php-7.2.34/ext/openssl/openssl.c:4454:49: warning: 'EC_KEY_generate_key' is deprecated: Since OpenSSL 3.0 [-Wdeprecated-declarations]
 4454 |                                                 EC_KEY_generate_key(eckey);
      |                                                 ^~~~~~~~~~~~~~~~~~~
/usr/include/openssl/ec.h:1104:27: note: declared here
 1104 | OSSL_DEPRECATEDIN_3_0 int EC_KEY_generate_key(EC_KEY *key);
      |                           ^~~~~~~~~~~~~~~~~~~
/tmp/B.2acy_rzy/BUILD/php-7.2.34/ext/openssl/openssl.c:4457:41: warning: 'EC_KEY_check_key' is deprecated: Since OpenSSL 3.0 [-Wdeprecated-declarations]
 4457 |                                         if (EC_KEY_check_key(eckey) && EVP_PKEY_assign_EC_KEY(pkey, eckey)) {
      |                                         ^~
/usr/include/openssl/ec.h:1110:27: note: declared here
 1110 | OSSL_DEPRECATEDIN_3_0 int EC_KEY_check_key(const EC_KEY *key);
      |                           ^~~~~~~~~~~~~~~~
/tmp/B.2acy_rzy/BUILD/php-7.2.34/ext/openssl/openssl.c:4457:41: warning: 'EVP_PKEY_assign' is deprecated: Since OpenSSL 3.0 [-Wdeprecated-declarations]
 4457 |                                         if (EC_KEY_check_key(eckey) && EVP_PKEY_assign_EC_KEY(pkey, eckey)) {
      |                                         ^~
/usr/include/openssl/evp.h:1333:5: note: declared here
 1333 | int EVP_PKEY_assign(EVP_PKEY *pkey, int type, void *key);
      |     ^~~~~~~~~~~~~~~
/tmp/B.2acy_rzy/BUILD/php-7.2.34/ext/openssl/openssl.c:4480:33: warning: 'EC_KEY_free' is deprecated: Since OpenSSL 3.0 [-Wdeprecated-declarations]
 4480 |                                 EC_KEY_free(eckey);
      |                                 ^~~~~~~~~~~
/usr/include/openssl/ec.h:1006:28: note: declared here
 1006 | OSSL_DEPRECATEDIN_3_0 void EC_KEY_free(EC_KEY *key);
      |                            ^~~~~~~~~~~
/tmp/B.2acy_rzy/BUILD/php-7.2.34/ext/openssl/openssl.c: In function 'zif_openssl_pkey_export_to_file':
/tmp/B.2acy_rzy/BUILD/php-7.2.34/ext/openssl/openssl.c:4559:33: warning: 'PEM_write_bio_ECPrivateKey' is deprecated: Since OpenSSL 3.0 [-Wdeprecated-declarations]
 4559 |                                 pem_write = PEM_write_bio_ECPrivateKey(
      |                                 ^~~~~~~~~
In file included from /tmp/B.2acy_rzy/BUILD/php-7.2.34/ext/openssl/openssl.c:53:
/usr/include/openssl/pem.h:465:1: note: declared here
  465 | DECLARE_PEM_rw_cb_attr(OSSL_DEPRECATEDIN_3_0, ECPrivateKey, EC_KEY)
      | ^~~~~~~~~~~~~~~~~~~~~~
/tmp/B.2acy_rzy/BUILD/php-7.2.34/ext/openssl/openssl.c:4560:49: warning: 'EVP_PKEY_get0_EC_KEY' is deprecated: Since OpenSSL 3.0 [-Wdeprecated-declarations]
 4560 |                                                 bio_out, EVP_PKEY_get0_EC_KEY(key), cipher,
      |                                                 ^~~~~~~
/usr/include/openssl/evp.h:1377:25: note: declared here
 1377 | const struct ec_key_st *EVP_PKEY_get0_EC_KEY(const EVP_PKEY *pkey);
      |                         ^~~~~~~~~~~~~~~~~~~~
/tmp/B.2acy_rzy/BUILD/php-7.2.34/ext/openssl/openssl.c: In function 'zif_openssl_pkey_export':
/tmp/B.2acy_rzy/BUILD/php-7.2.34/ext/openssl/openssl.c:4636:33: warning: 'PEM_write_bio_ECPrivateKey' is deprecated: Since OpenSSL 3.0 [-Wdeprecated-declarations]
 4636 |                                 pem_write = PEM_write_bio_ECPrivateKey(
      |                                 ^~~~~~~~~
/usr/include/openssl/pem.h:465:1: note: declared here
  465 | DECLARE_PEM_rw_cb_attr(OSSL_DEPRECATEDIN_3_0, ECPrivateKey, EC_KEY)
      | ^~~~~~~~~~~~~~~~~~~~~~
/tmp/B.2acy_rzy/BUILD/php-7.2.34/ext/openssl/openssl.c:4637:49: warning: 'EVP_PKEY_get0_EC_KEY' is deprecated: Since OpenSSL 3.0 [-Wdeprecated-declarations]
 4637 |                                                 bio_out, EVP_PKEY_get0_EC_KEY(key), cipher,
      |                                                 ^~~~~~~
/usr/include/openssl/evp.h:1377:25: note: declared here
 1377 | const struct ec_key_st *EVP_PKEY_get0_EC_KEY(const EVP_PKEY *pkey);
      |                         ^~~~~~~~~~~~~~~~~~~~
/tmp/B.2acy_rzy/BUILD/php-7.2.34/ext/openssl/openssl.c: In function 'zif_openssl_pkey_get_details':
/tmp/B.2acy_rzy/BUILD/php-7.2.34/ext/openssl/openssl.c:4772:33: warning: 'EVP_PKEY_get0_RSA' is deprecated: Since OpenSSL 3.0 [-Wdeprecated-declarations]
 4772 |                                 RSA *rsa = EVP_PKEY_get0_RSA(pkey);
      |                                 ^~~
/usr/include/openssl/evp.h:1351:22: note: declared here
 1351 | const struct rsa_st *EVP_PKEY_get0_RSA(const EVP_PKEY *pkey);
      |                      ^~~~~~~~~~~~~~~~~
/tmp/B.2acy_rzy/BUILD/php-7.2.34/ext/openssl/openssl.c:4772:44: warning: initialization discards 'const' qualifier from pointer target type [-Wdiscarded-qualifiers]
 4772 |                                 RSA *rsa = EVP_PKEY_get0_RSA(pkey);
      |                                            ^~~~~~~~~~~~~~~~~
/tmp/B.2acy_rzy/BUILD/php-7.2.34/ext/openssl/openssl.c:4779:41: warning: 'RSA_get0_key' is deprecated: Since OpenSSL 3.0 [-Wdeprecated-declarations]
 4779 |                                         RSA_get0_key(rsa, &n, &e, &d);
      |                                         ^~~~~~~~~~~~
/usr/include/openssl/rsa.h:223:28: note: declared here
  223 | OSSL_DEPRECATEDIN_3_0 void RSA_get0_key(const RSA *r,
      |                            ^~~~~~~~~~~~
/tmp/B.2acy_rzy/BUILD/php-7.2.34/ext/openssl/openssl.c:4780:41: warning: 'RSA_get0_factors' is deprecated: Since OpenSSL 3.0 [-Wdeprecated-declarations]
 4780 |                                         RSA_get0_factors(rsa, &p, &q);
      |                                         ^~~~~~~~~~~~~~~~
/usr/include/openssl/rsa.h:226:28: note: declared here
  226 | OSSL_DEPRECATEDIN_3_0 void RSA_get0_factors(const RSA *r,
      |                            ^~~~~~~~~~~~~~~~
/tmp/B.2acy_rzy/BUILD/php-7.2.34/ext/openssl/openssl.c:4781:41: warning: 'RSA_get0_crt_params' is deprecated: Since OpenSSL 3.0 [-Wdeprecated-declarations]
 4781 |                                         RSA_get0_crt_params(rsa, &dmp1, &dmq1, &iqmp);
      |                                         ^~~~~~~~~~~~~~~~~~~
/usr/include/openssl/rsa.h:231:28: note: declared here
  231 | OSSL_DEPRECATEDIN_3_0 void RSA_get0_crt_params(const RSA *r,
      |                            ^~~~~~~~~~~~~~~~~~~
/tmp/B.2acy_rzy/BUILD/php-7.2.34/ext/openssl/openssl.c:4801:33: warning: 'EVP_PKEY_get0_DSA' is deprecated: Since OpenSSL 3.0 [-Wdeprecated-declarations]
 4801 |                                 DSA *dsa = EVP_PKEY_get0_DSA(pkey);
      |                                 ^~~
/usr/include/openssl/evp.h:1360:22: note: declared here
 1360 | const struct dsa_st *EVP_PKEY_get0_DSA(const EVP_PKEY *pkey);
      |                      ^~~~~~~~~~~~~~~~~
/tmp/B.2acy_rzy/BUILD/php-7.2.34/ext/openssl/openssl.c:4801:44: warning: initialization discards 'const' qualifier from pointer target type [-Wdiscarded-qualifiers]
 4801 |                                 DSA *dsa = EVP_PKEY_get0_DSA(pkey);
      |                                            ^~~~~~~~~~~~~~~~~
/tmp/B.2acy_rzy/BUILD/php-7.2.34/ext/openssl/openssl.c:4808:41: warning: 'DSA_get0_pqg' is deprecated: Since OpenSSL 3.0 [-Wdeprecated-declarations]
 4808 |                                         DSA_get0_pqg(dsa, &p, &q, &g);
      |                                         ^~~~~~~~~~~~
/usr/include/openssl/dsa.h:206:28: note: declared here
  206 | OSSL_DEPRECATEDIN_3_0 void DSA_get0_pqg(const DSA *d, const BIGNUM **p,
      |                            ^~~~~~~~~~~~
/tmp/B.2acy_rzy/BUILD/php-7.2.34/ext/openssl/openssl.c:4809:41: warning: 'DSA_get0_key' is deprecated: Since OpenSSL 3.0 [-Wdeprecated-declarations]
 4809 |                                         DSA_get0_key(dsa, &pub_key, &priv_key);
      |                                         ^~~~~~~~~~~~
/usr/include/openssl/dsa.h:209:28: note: declared here
  209 | OSSL_DEPRECATEDIN_3_0 void DSA_get0_key(const DSA *d, const BIGNUM **pub_key,
      |                            ^~~~~~~~~~~~
/tmp/B.2acy_rzy/BUILD/php-7.2.34/ext/openssl/openssl.c:4823:33: warning: 'EVP_PKEY_get0_DH' is deprecated: Since OpenSSL 3.0 [-Wdeprecated-declarations]
 4823 |                                 DH *dh = EVP_PKEY_get0_DH(pkey);
      |                                 ^~
/usr/include/openssl/evp.h:1368:43: note: declared here
 1368 | OSSL_DEPRECATEDIN_3_0 const struct dh_st *EVP_PKEY_get0_DH(const EVP_PKEY *pkey);
      |                                           ^~~~~~~~~~~~~~~~
/tmp/B.2acy_rzy/BUILD/php-7.2.34/ext/openssl/openssl.c:4823:42: warning: initialization discards 'const' qualifier from pointer target type [-Wdiscarded-qualifiers]
 4823 |                                 DH *dh = EVP_PKEY_get0_DH(pkey);
      |                                          ^~~~~~~~~~~~~~~~
/tmp/B.2acy_rzy/BUILD/php-7.2.34/ext/openssl/openssl.c:4830:41: warning: 'DH_get0_pqg' is deprecated: Since OpenSSL 3.0 [-Wdeprecated-declarations]
 4830 |                                         DH_get0_pqg(dh, &p, &q, &g);
      |                                         ^~~~~~~~~~~
/usr/include/openssl/dh.h:260:28: note: declared here
  260 | OSSL_DEPRECATEDIN_3_0 void DH_get0_pqg(const DH *dh, const BIGNUM **p,
      |                            ^~~~~~~~~~~
/tmp/B.2acy_rzy/BUILD/php-7.2.34/ext/openssl/openssl.c:4831:41: warning: 'DH_get0_key' is deprecated: Since OpenSSL 3.0 [-Wdeprecated-declarations]
 4831 |                                         DH_get0_key(dh, &pub_key, &priv_key);
      |                                         ^~~~~~~~~~~
/usr/include/openssl/dh.h:263:28: note: declared here
  263 | OSSL_DEPRECATEDIN_3_0 void DH_get0_key(const DH *dh, const BIGNUM **pub_key,
      |                            ^~~~~~~~~~~
/tmp/B.2acy_rzy/BUILD/php-7.2.34/ext/openssl/openssl.c:4845:25: warning: 'EVP_PKEY_get0_EC_KEY' is deprecated: Since OpenSSL 3.0 [-Wdeprecated-declarations]
 4845 |                         if (EVP_PKEY_get0_EC_KEY(pkey) != NULL) {
      |                         ^~
/usr/include/openssl/evp.h:1377:25: note: declared here
 1377 | const struct ec_key_st *EVP_PKEY_get0_EC_KEY(const EVP_PKEY *pkey);
      |                         ^~~~~~~~~~~~~~~~~~~~
/tmp/B.2acy_rzy/BUILD/php-7.2.34/ext/openssl/openssl.c:4854:33: warning: 'EVP_PKEY_get0_EC_KEY' is deprecated: Since OpenSSL 3.0 [-Wdeprecated-declarations]
 4854 |                                 const EC_KEY *ec_key = EVP_PKEY_get0_EC_KEY(pkey);
      |                                 ^~~~~
/usr/include/openssl/evp.h:1377:25: note: declared here
 1377 | const struct ec_key_st *EVP_PKEY_get0_EC_KEY(const EVP_PKEY *pkey);
      |                         ^~~~~~~~~~~~~~~~~~~~
/tmp/B.2acy_rzy/BUILD/php-7.2.34/ext/openssl/openssl.c:4859:33: warning: 'EC_KEY_get0_group' is deprecated: Since OpenSSL 3.0 [-Wdeprecated-declarations]
 4859 |                                 ec_group = EC_KEY_get0_group(ec_key);
      |                                 ^~~~~~~~
/usr/include/openssl/ec.h:1037:39: note: declared here
 1037 | OSSL_DEPRECATEDIN_3_0 const EC_GROUP *EC_KEY_get0_group(const EC_KEY *key);
      |                                       ^~~~~~~~~~~~~~~~~
/tmp/B.2acy_rzy/BUILD/php-7.2.34/ext/openssl/openssl.c:4881:33: warning: 'EC_KEY_get0_public_key' is deprecated: Since OpenSSL 3.0 [-Wdeprecated-declarations]
 4881 |                                 pub = EC_KEY_get0_public_key(ec_key);
      |                                 ^~~
/usr/include/openssl/ec.h:1065:39: note: declared here
 1065 | OSSL_DEPRECATEDIN_3_0 const EC_POINT *EC_KEY_get0_public_key(const EC_KEY *key);
      |                                       ^~~~~~~~~~~~~~~~~~~~~~
/tmp/B.2acy_rzy/BUILD/php-7.2.34/ext/openssl/openssl.c:4883:33: warning: 'EC_POINT_get_affine_coordinates_GFp' is deprecated: Since OpenSSL 3.0 [-Wdeprecated-declarations]
 4883 |                                 if (EC_POINT_get_affine_coordinates_GFp(ec_group, pub, x, y, NULL)) {
      |                                 ^~
/usr/include/openssl/ec.h:662:27: note: declared here
  662 | OSSL_DEPRECATEDIN_3_0 int EC_POINT_get_affine_coordinates_GFp
      |                           ^~~~~~~~~~~~~~~~~~~~~~~~~~~~~~~~~~~
/tmp/B.2acy_rzy/BUILD/php-7.2.34/ext/openssl/openssl.c:4890:33: warning: 'EC_KEY_get0_private_key' is deprecated: Since OpenSSL 3.0 [-Wdeprecated-declarations]
 4890 |                                 if ((d = EC_KEY_get0_private_key(EVP_PKEY_get0_EC_KEY(pkey))) != NULL) {
      |                                 ^~
/usr/include/openssl/ec.h:1051:37: note: declared here
 1051 | OSSL_DEPRECATEDIN_3_0 const BIGNUM *EC_KEY_get0_private_key(const EC_KEY *key);
      |                                     ^~~~~~~~~~~~~~~~~~~~~~~
/tmp/B.2acy_rzy/BUILD/php-7.2.34/ext/openssl/openssl.c:4890:33: warning: 'EVP_PKEY_get0_EC_KEY' is deprecated: Since OpenSSL 3.0 [-Wdeprecated-declarations]
 4890 |                                 if ((d = EC_KEY_get0_private_key(EVP_PKEY_get0_EC_KEY(pkey))) != NULL) {
      |                                 ^~
/usr/include/openssl/evp.h:1377:25: note: declared here
 1377 | const struct ec_key_st *EVP_PKEY_get0_EC_KEY(const EVP_PKEY *pkey);
      |                         ^~~~~~~~~~~~~~~~~~~~
/tmp/B.2acy_rzy/BUILD/php-7.2.34/ext/openssl/openssl.c: In function 'zif_openssl_dh_compute_key':
/tmp/B.2acy_rzy/BUILD/php-7.2.34/ext/openssl/openssl.c:4933:9: warning: 'EVP_PKEY_get0_DH' is deprecated: Since OpenSSL 3.0 [-Wdeprecated-declarations]
 4933 |         dh = EVP_PKEY_get0_DH(pkey);
      |         ^~
/usr/include/openssl/evp.h:1368:43: note: declared here
 1368 | OSSL_DEPRECATEDIN_3_0 const struct dh_st *EVP_PKEY_get0_DH(const EVP_PKEY *pkey);
      |                                           ^~~~~~~~~~~~~~~~
/tmp/B.2acy_rzy/BUILD/php-7.2.34/ext/openssl/openssl.c:4933:12: warning: assignment discards 'const' qualifier from pointer target type [-Wdiscarded-qualifiers]
 4933 |         dh = EVP_PKEY_get0_DH(pkey);
      |            ^
/tmp/B.2acy_rzy/BUILD/php-7.2.34/ext/openssl/openssl.c:4941:9: warning: 'DH_size' is deprecated: Since OpenSSL 3.0 [-Wdeprecated-declarations]
 4941 |         data = zend_string_alloc(DH_size(dh), 0);
      |         ^~~~
/usr/include/openssl/dh.h:210:27: note: declared here
  210 | OSSL_DEPRECATEDIN_3_0 int DH_size(const DH *dh);
      |                           ^~~~~~~
/tmp/B.2acy_rzy/BUILD/php-7.2.34/ext/openssl/openssl.c:4942:9: warning: 'DH_compute_key' is deprecated: Since OpenSSL 3.0 [-Wdeprecated-declarations]
 4942 |         len = DH_compute_key((unsigned char*)ZSTR_VAL(data), pub, dh);
      |         ^~~
/usr/include/openssl/dh.h:231:27: note: declared here
  231 | OSSL_DEPRECATEDIN_3_0 int DH_compute_key(unsigned char *key,
      |                           ^~~~~~~~~~~~~~
/tmp/B.2acy_rzy/BUILD/php-7.2.34/ext/openssl/openssl.c: In function 'zif_openssl_private_encrypt':
/tmp/B.2acy_rzy/BUILD/php-7.2.34/ext/openssl/openssl.c:5632:25: warning: 'RSA_private_encrypt' is deprecated: Since OpenSSL 3.0 [-Wdeprecated-declarations]
 5632 |                         successful = (RSA_private_encrypt((int)data_len,
      |                         ^~~~~~~~~~
/usr/include/openssl/rsa.h:291:5: note: declared here
  291 | int RSA_private_encrypt(int flen, const unsigned char *from, unsigned char *to,
      |     ^~~~~~~~~~~~~~~~~~~
/tmp/B.2acy_rzy/BUILD/php-7.2.34/ext/openssl/openssl.c:5635:49: warning: 'EVP_PKEY_get0_RSA' is deprecated: Since OpenSSL 3.0 [-Wdeprecated-declarations]
 5635 |                                                 EVP_PKEY_get0_RSA(pkey),
      |                                                 ^~~~~~~~~~~~~~~~~
/usr/include/openssl/evp.h:1351:22: note: declared here
 1351 | const struct rsa_st *EVP_PKEY_get0_RSA(const EVP_PKEY *pkey);
      |                      ^~~~~~~~~~~~~~~~~
/tmp/B.2acy_rzy/BUILD/php-7.2.34/ext/openssl/openssl.c:5635:49: warning: passing argument 4 of 'RSA_private_encrypt' discards 'const' qualifier from pointer target type [-Wdiscarded-qualifiers]
 5635 |                                                 EVP_PKEY_get0_RSA(pkey),
      |                                                 ^~~~~~~~~~~~~~~~~~~~~~~
/usr/include/openssl/rsa.h:292:30: note: expected 'RSA *' {aka 'struct rsa_st *'} but argument is of type 'const struct rsa_st *'
  292 |                         RSA *rsa, int padding);
      |                         ~~~~~^~~
/tmp/B.2acy_rzy/BUILD/php-7.2.34/ext/openssl/openssl.c: In function 'zif_openssl_private_decrypt':
/tmp/B.2acy_rzy/BUILD/php-7.2.34/ext/openssl/openssl.c:5694:25: warning: 'RSA_private_decrypt' is deprecated: Since OpenSSL 3.0 [-Wdeprecated-declarations]
 5694 |                         cryptedlen = RSA_private_decrypt((int)data_len,
      |                         ^~~~~~~~~~
/usr/include/openssl/rsa.h:297:5: note: declared here
  297 | int RSA_private_decrypt(int flen, const unsigned char *from, unsigned char *to,
      |     ^~~~~~~~~~~~~~~~~~~
/tmp/B.2acy_rzy/BUILD/php-7.2.34/ext/openssl/openssl.c:5697:41: warning: 'EVP_PKEY_get0_RSA' is deprecated: Since OpenSSL 3.0 [-Wdeprecated-declarations]
 5697 |                                         EVP_PKEY_get0_RSA(pkey),
      |                                         ^~~~~~~~~~~~~~~~~
/usr/include/openssl/evp.h:1351:22: note: declared here
 1351 | const struct rsa_st *EVP_PKEY_get0_RSA(const EVP_PKEY *pkey);
      |                      ^~~~~~~~~~~~~~~~~
/tmp/B.2acy_rzy/BUILD/php-7.2.34/ext/openssl/openssl.c:5697:41: warning: passing argument 4 of 'RSA_private_decrypt' discards 'const' qualifier from pointer target type [-Wdiscarded-qualifiers]
 5697 |                                         EVP_PKEY_get0_RSA(pkey),
      |                                         ^~~~~~~~~~~~~~~~~~~~~~~
/usr/include/openssl/rsa.h:298:30: note: expected 'RSA *' {aka 'struct rsa_st *'} but argument is of type 'const struct rsa_st *'
  298 |                         RSA *rsa, int padding);
      |                         ~~~~~^~~
/tmp/B.2acy_rzy/BUILD/php-7.2.34/ext/openssl/openssl.c: In function 'zif_openssl_public_encrypt':
/tmp/B.2acy_rzy/BUILD/php-7.2.34/ext/openssl/openssl.c:5762:25: warning: 'RSA_public_encrypt' is deprecated: Since OpenSSL 3.0 [-Wdeprecated-declarations]
 5762 |                         successful = (RSA_public_encrypt((int)data_len,
      |                         ^~~~~~~~~~
/usr/include/openssl/rsa.h:288:5: note: declared here
  288 | int RSA_public_encrypt(int flen, const unsigned char *from, unsigned char *to,
      |     ^~~~~~~~~~~~~~~~~~
/tmp/B.2acy_rzy/BUILD/php-7.2.34/ext/openssl/openssl.c:5765:49: warning: 'EVP_PKEY_get0_RSA' is deprecated: Since OpenSSL 3.0 [-Wdeprecated-declarations]
 5765 |                                                 EVP_PKEY_get0_RSA(pkey),
      |                                                 ^~~~~~~~~~~~~~~~~
/usr/include/openssl/evp.h:1351:22: note: declared here
 1351 | const struct rsa_st *EVP_PKEY_get0_RSA(const EVP_PKEY *pkey);
      |                      ^~~~~~~~~~~~~~~~~
/tmp/B.2acy_rzy/BUILD/php-7.2.34/ext/openssl/openssl.c:5765:49: warning: passing argument 4 of 'RSA_public_encrypt' discards 'const' qualifier from pointer target type [-Wdiscarded-qualifiers]
 5765 |                                                 EVP_PKEY_get0_RSA(pkey),
      |                                                 ^~~~~~~~~~~~~~~~~~~~~~~
/usr/include/openssl/rsa.h:289:29: note: expected 'RSA *' {aka 'struct rsa_st *'} but argument is of type 'const struct rsa_st *'
  289 |                        RSA *rsa, int padding);
      |                        ~~~~~^~~
/tmp/B.2acy_rzy/BUILD/php-7.2.34/ext/openssl/openssl.c: In function 'zif_openssl_public_decrypt':
/tmp/B.2acy_rzy/BUILD/php-7.2.34/ext/openssl/openssl.c:5825:25: warning: 'RSA_public_decrypt' is deprecated: Since OpenSSL 3.0 [-Wdeprecated-declarations]
 5825 |                         cryptedlen = RSA_public_decrypt((int)data_len,
      |                         ^~~~~~~~~~
/usr/include/openssl/rsa.h:294:5: note: declared here
  294 | int RSA_public_decrypt(int flen, const unsigned char *from, unsigned char *to,
      |     ^~~~~~~~~~~~~~~~~~
/tmp/B.2acy_rzy/BUILD/php-7.2.34/ext/openssl/openssl.c:5828:41: warning: 'EVP_PKEY_get0_RSA' is deprecated: Since OpenSSL 3.0 [-Wdeprecated-declarations]
 5828 |                                         EVP_PKEY_get0_RSA(pkey),
      |                                         ^~~~~~~~~~~~~~~~~
/usr/include/openssl/evp.h:1351:22: note: declared here
 1351 | const struct rsa_st *EVP_PKEY_get0_RSA(const EVP_PKEY *pkey);
      |                      ^~~~~~~~~~~~~~~~~
/tmp/B.2acy_rzy/BUILD/php-7.2.34/ext/openssl/openssl.c:5828:41: warning: passing argument 4 of 'RSA_public_decrypt' discards 'const' qualifier from pointer target type [-Wdiscarded-qualifiers]
 5828 |                                         EVP_PKEY_get0_RSA(pkey),
      |                                         ^~~~~~~~~~~~~~~~~~~~~~~
/usr/include/openssl/rsa.h:295:29: note: expected 'RSA *' {aka 'struct rsa_st *'} but argument is of type 'const struct rsa_st *'
  295 |                        RSA *rsa, int padding);
      |                        ~~~~~^~~
error: Bad exit status from /tmp/B.2acy_rzy/BUILD/tmp/rpm-tmp.qLE5Tq (%build)

RPM build warnings:
    line 402: It's not recommended to have unversioned Obsoletes: Obsoletes:	phpfi
    line 602: It's not recommended to have unversioned Obsoletes: Obsoletes:	php-pecl-domxml
    line 640: It's not recommended to have unversioned Obsoletes: Obsoletes:	php-devel
    line 870: It's not recommended to have unversioned Obsoletes: Obsoletes:	php-mime_magic
    Macro expanded in comment on line 1855: %{name}-session = %{epoch}:%{version}-%{release}

    %changelog not in descending chronological order

RPM build errors:
    Bad exit status from /tmp/B.2acy_rzy/BUILD/tmp/rpm-tmp.qLE5Tq (%build)
ended at: Sun Nov 26 14:36:54 2023, done in 0:04:28.266196
error: No files produced.
+ chmod -R u+rwX /tmp/B.2acy_rzy/BUILD
+ rm -rf /tmp/B.2acy_rzy/tmp /tmp/B.2acy_rzy/BUILD
+ rm -rf /tmp/B.2acy_rzy
Begin-PLD-Builder-Info
Build-Time: user:388.06s sys:130.11s real:289.21s (faults io:202 non-io:23059382)

End-PLD-Builder-Info
[Back to list of logs] [View rpm -qa of builder]