FailedOk

th/SRPMS[OK]
th/x32[OK]
th/i686[OK]
th/x86_64[OK]

ac/SRPMS[OK]
ac/i386[OK]
ac/i586[OK]
ac/i686[OK]
ac/alpha[OK]
ac/amd64[OK]
ac/athlon[OK]
ac/ppc[OK]
ac/sparc[OK]
ac/sparc64[OK]

Advanced Search
main()
Powered by PLD Linux
(c) 2002-2024 PLD Team
$Revision: 1.37 $
Powered by Leppe'.
Your IP: 44.210.77.73

php-pecl-libsodium 9cd01e80-a4c5-45ac-930e-05e1740826c6

Status:Failed
Source URL:https://buildlogs.pld-linux.org/pld/th/x32/FAIL/php-pecl-libsodium,9cd01e80-a4c5-45ac-930e-05e1740826c6.bz2
text/plain URL:View!
full text:View!
rpm -qa of builder:View!
Date:2023/11/27 23:26:33
Runtime:0:00:08.690053

Toc:

  • error 1
  • rpm: error: Failed build dependencies:
  • error 2
  • rpm: error: Failed build dependencies:
  • error 3
  • rpm: error: Failed build dependencies:
  • prep
  • Executing(%prep): /bin/sh -e /tmp/B.g_uirnud/BUILD/tmp/rpm-tmp.zYQDaD
  • build
  • Executing(%build): /bin/sh -e /tmp/B.g_uirnud/BUILD/tmp/rpm-tmp.DOdQZd
  • error 4
  • error: Bad exit status from /tmp/B.g_uirnud/BUILD/tmp/rpm-tmp.DOdQZd (%build)
  • error 5
  • RPM build errors:
  • error 6
  • error: No files produced.

Content:

checking if we should skip the build
started at: Mon Nov 27 23:26:08 2023
killing old processes on a builder
sending signal 9 to pid -1
cleaning up /tmp
fetching https://srcbuilder.pld-linux.org/th//srpms/9cd01e80-a4c5-45ac-930e-05e1740826c6/php71-pecl-libsodium-1.0.7-1.src.rpm
fetched 180111 bytes, 590.9 K/s
installing srpm: php71-pecl-libsodium-1.0.7-1.src.rpm
+ install -d /tmp/B.g_uirnud/BUILD /tmp/B.g_uirnud/RPMS
+ LC_ALL=en_US.UTF-8
+ rpm -qp --changelog php71-pecl-libsodium-1.0.7-1.src.rpm
* Mon Nov 27 2023 PLD Linux Team <feedback@pld-linux.org>
- For complete changelog see: http://git.pld-linux.org/?p=packages/php-pecl-libsodium.git;a=log;h=master
* Mon Nov 27 2023 Jan Rękorajski <baggins@pld-linux.org> 7dd3219
- tests need pcre * Tue Dec 26 2017 Jakub Bogusz <qboosh@pld-linux.org> abeee5f
- updated to 1.0.7, pl * Mon Dec 12 2016 Elan Ruusamäe <glen@delfi.ee> ce01d2b
- up to 1.0.6 * Fri Jan 29 2016 Elan Ruusamäe <glen@delfi.ee> 2fdbfb1
- hack to make tests pass on php 5.5 * Thu Jan 28 2016 Elan Ruusamäe <glen@delfi.ee> 6c5be91
- add upstream link * Thu Jan 28 2016 Elan Ruusamäe <glen@delfi.ee> f3d673b
- add patch to pass tests on php5.3 * Thu Jan 28 2016 Elan Ruusamäe <glen@delfi.ee> 9ce6e03
- new, version 1.0.2 + rpm -Uhv --nodeps --define '_topdir /tmp/B.g_uirnud' --define '_specdir %{_topdir}' --define '_sourcedir %{_specdir}' --define '_rpmdir %{_topdir}/RPMS' --define '_builddir %{_topdir}/BUILD' --define 'php_suffix 71' php71-pecl-libsodium-1.0.7-1.src.rpm Updating / installing... php71-pecl-libsodium-1.0.7-1 ######################################## + rm -f php71-pecl-libsodium-1.0.7-1.src.rpm + install -m 700 -d /tmp/B.g_uirnud/BUILD/tmp + TMPDIR=/tmp/B.g_uirnud/BUILD/tmp + exec nice -n 0 rpmbuild -bp --short-circuit --nodeps --define '_topdir /tmp/B.g_uirnud' --define '_specdir %{_topdir}' --define '_sourcedir %{_specdir}' --define '_rpmdir %{_topdir}/RPMS' --define '_builddir %{_topdir}/BUILD' --target x32-pld-linux --define 'php_suffix 71' --define 'prep exit 0' /tmp/B.g_uirnud/php-pecl-libsodium.spec sh: php-config: inaccessible or not found Building target platforms: x32-pld-linux Building for target x32-pld-linux checking BuildConflict-ing packages rpm: sh: php-config: inaccessible or not found rpm: error: Failed build dependencies: rpm: php71-cli is needed by php71-pecl-libsodium-1.0.7-1.x32 rpm: php71-devel >= 4:5.3 is needed by php71-pecl-libsodium-1.0.7-1.x32 rpm: php71-json is needed by php71-pecl-libsodium-1.0.7-1.x32 rpm: php71-pcre is needed by php71-pecl-libsodium-1.0.7-1.x32 rpm: Building target platforms: x32-pld-linux rpm: Building for target x32-pld-linux no BuildConflicts found checking BR rpm: sh: php-config: inaccessible or not found rpm: error: Failed build dependencies: rpm: php71-cli is needed by php71-pecl-libsodium-1.0.7-1.x32 rpm: php71-devel >= 4:5.3 is needed by php71-pecl-libsodium-1.0.7-1.x32 rpm: php71-json is needed by php71-pecl-libsodium-1.0.7-1.x32 rpm: php71-pcre is needed by php71-pecl-libsodium-1.0.7-1.x32 rpm: Building target platforms: x32-pld-linux rpm: Building for target x32-pld-linux updating poldek cache... ready is up to date th is up to date th is up to date th-ready is up to date th-ready is up to date th-test is up to date th-test is up to date checking conflicting packages in BRed packages poldek: Loading [pndir]ready... poldek: Loading [pndir]th-test... poldek: Loading [pndir]th-test... poldek: Loading [pndir]th-ready... poldek: Loading [pndir]th-ready... poldek: Loading [pndir]th... poldek: Loading [pndir]th... poldek: 31571 packages read poldek: Removed 2895 duplicate packages from available set poldek: Processing dependencies... poldek: php71-pcre-7.1.33-15.x32 marks php71-common-7.1.33-15.x32 (cap php71-common = 4:7.1.33-15) poldek: There are 5 packages to install (1 marked by dependencies): poldek: A php71-cli-7.1.33-15.x32 php71-common-7.1.33-15.x32 poldek: A php71-devel-7.1.33-15.x32 php71-json-7.1.33-15.x32 poldek: A php71-pcre-7.1.33-15.x32 poldek: This operation will use 8.1MB of disk space. poldek: Need to get 1.7MB of archives (1.7MB to download). poldek: poldek: Retrieving [1/5] th::php71-common-7.1.33-15.x32.rpm........................................done poldek: Retrieving [2/5] th::php71-cli-7.1.33-15.x32.rpm...........................................done poldek: Retrieving [3/5] th::php71-devel-7.1.33-15.x32.rpm.........................................done poldek: Retrieving [4/5] th::php71-json-7.1.33-15.x32.rpm..........................................done poldek: Retrieving [5/5] th::php71-pcre-7.1.33-15.x32.rpm..........................................done poldek: php71-common-7.1.33-15.x32.rpm: digests OK poldek: php71-cli-7.1.33-15.x32.rpm: digests OK poldek: php71-devel-7.1.33-15.x32.rpm: digests OK poldek: php71-json-7.1.33-15.x32.rpm: digests OK poldek: php71-pcre-7.1.33-15.x32.rpm: digests OK poldek: Executing pm-command.sh --upgrade -vh --test --root / --define _check_dirname_deps 0... poldek: warning: /root/.cache/poldek/ftp_ftp1.pld-linux.org.dists.th.PLD.x32.RPMS/php71-common-7.1.33-15.x32.rpm: Header V4 DSA/SHA1 Signature, key ID e4f1bc2d: NOKEY poldek: Verifying... ######################################## poldek: Preparing... ######################################## no conflicts found checking BR rpm: sh: php-config: inaccessible or not found rpm: error: Failed build dependencies: rpm: php71-cli is needed by php71-pecl-libsodium-1.0.7-1.x32 rpm: php71-devel >= 4:5.3 is needed by php71-pecl-libsodium-1.0.7-1.x32 rpm: php71-json is needed by php71-pecl-libsodium-1.0.7-1.x32 rpm: php71-pcre is needed by php71-pecl-libsodium-1.0.7-1.x32 rpm: Building target platforms: x32-pld-linux rpm: Building for target x32-pld-linux installing BR: php71\-cli php71\-devel php71\-json php71\-pcre + poldek --noask --caplookup -Q -v '--ignore=hhvm-*' '--ignore=php4-*' '--ignore=php52-*' '--ignore=php53-*' '--ignore=php54-*' '--ignore=php55-*' '--ignore=php56-*' '--ignore=php70-*' '--ignore=php72-*' '--ignore=php73-*' '--ignore=php74-*' '--ignore=php80-*' '--ignore=php81-*' '--ignore=php82-*' --upgrade php71-cli php71-devel php71-json php71-pcre Loading [pndir]ready... Loading [pndir]th-test... Loading [pndir]th-test... Loading [pndir]th-ready... Loading [pndir]th-ready... Loading [pndir]th... Loading [pndir]th... 31571 packages read Removed 2895 duplicate packages from available set Processing dependencies... php71-pcre-7.1.33-15.x32 marks php71-common-7.1.33-15.x32 (cap php71-common = 4:7.1.33-15) There are 5 packages to install (1 marked by dependencies): A php71-cli-7.1.33-15.x32 php71-common-7.1.33-15.x32 A php71-devel-7.1.33-15.x32 php71-json-7.1.33-15.x32 A php71-pcre-7.1.33-15.x32 This operation will use 8.1MB of disk space. php71-pcre-7.1.33-15.x32.rpm: digests OK php71-cli-7.1.33-15.x32.rpm: digests OK php71-devel-7.1.33-15.x32.rpm: digests OK php71-json-7.1.33-15.x32.rpm: digests OK php71-common-7.1.33-15.x32.rpm: digests OK Need to get 1.7MB of archives. php71-common-7.1.33-15.x32.rpm: digests OK php71-cli-7.1.33-15.x32.rpm: digests OK php71-devel-7.1.33-15.x32.rpm: digests OK php71-json-7.1.33-15.x32.rpm: digests OK php71-pcre-7.1.33-15.x32.rpm: digests OK Executing pm-command.sh --upgrade -vh --root / --define _check_dirname_deps 0... warning: /root/.cache/poldek/ftp_ftp1.pld-linux.org.dists.th.PLD.x32.RPMS/php71-common-7.1.33-15.x32.rpm: Header V4 DSA/SHA1 Signature, key ID e4f1bc2d: NOKEY Verifying... ######################################## Preparing... ######################################## Updating / installing... php71-common-4:7.1.33-15 ######################################## php71-cli-4:7.1.33-15 ######################################## php71-devel-4:7.1.33-15 ######################################## php71-json-4:7.1.33-15 ######################################## php71-pcre-4:7.1.33-15 ######################################## building RPM using: set -ex; : build-id: 9cd01e80-a4c5-45ac-930e-05e1740826c6; TMPDIR=/tmp/B.g_uirnud/BUILD/tmp exec nice -n 0 rpmbuild -bb --define '__jobs 28' --define '_smp_mflags -j28' --define '_make_opts -Otarget' --define '_pld_builder 1' --define '_topdir /tmp/B.g_uirnud' --define '_specdir %{_topdir}' --define '_sourcedir %{_specdir}' --define '_rpmdir %{_topdir}/RPMS' --define '_builddir %{_topdir}/BUILD' --target x32-pld-linux --define 'php_suffix 71' /tmp/B.g_uirnud/php-pecl-libsodium.spec + : build-id: 9cd01e80-a4c5-45ac-930e-05e1740826c6 + TMPDIR=/tmp/B.g_uirnud/BUILD/tmp + exec nice -n 0 rpmbuild -bb --define '__jobs 28' --define '_smp_mflags -j28' --define '_make_opts -Otarget' --define '_pld_builder 1' --define '_topdir /tmp/B.g_uirnud' --define '_specdir %{_topdir}' --define '_sourcedir %{_specdir}' --define '_rpmdir %{_topdir}/RPMS' --define '_builddir %{_topdir}/BUILD' --target x32-pld-linux --define 'php_suffix 71' /tmp/B.g_uirnud/php-pecl-libsodium.spec Building target platforms: x32-pld-linux Building for target x32-pld-linux Executing(%prep): /bin/sh -e /tmp/B.g_uirnud/BUILD/tmp/rpm-tmp.zYQDaD + umask 022 + cd /tmp/B.g_uirnud/BUILD + cd /tmp/B.g_uirnud/BUILD + rm -rf php71-pecl-libsodium-1.0.7 + /bin/mkdir -p php71-pecl-libsodium-1.0.7 + cd php71-pecl-libsodium-1.0.7 + /bin/gzip -dc /tmp/B.g_uirnud/libsodium-1.0.7.tgz + /bin/tar -xof - + STATUS=0 + '[' 0 -ne 0 ']' + /bin/chmod -Rf a+rX,u+w,g-w,o-w . + /bin/mv libsodium-1.0.7/LICENSE libsodium-1.0.7/README.md libsodium-1.0.7/acinclude.m4 libsodium-1.0.7/aclocal.m4 libsodium-1.0.7/build libsodium-1.0.7/compat.h libsodium-1.0.7/config.h libsodium-1.0.7/config.m4 libsodium-1.0.7/config.w32 libsodium-1.0.7/libsodium.c libsodium-1.0.7/php_libsodium.h libsodium-1.0.7/tests . + RPM_EC=0 + jobs -p + exit 0 Executing(%build): /bin/sh -e /tmp/B.g_uirnud/BUILD/tmp/rpm-tmp.DOdQZd HOME=/home/users/builder PATH=/home/users/builder/GNUstep/Tools:/bin:/usr/bin:/usr/local/bin TMPDIR=/tmp/B.g_uirnud/BUILD/tmp + umask 022 + cd /tmp/B.g_uirnud/BUILD + cd php71-pecl-libsodium-1.0.7 + sed -n '/#define PHP_LIBSODIUM_VERSION/{s/.* "//;s/".*$//;p}' php_libsodium.h + extver=1.0.7 + test x1.0.7 '!=' x1.0.7 + phpize Configuring for: PHP Api Version: 20160303 Zend Module Api No: 20160303 Zend Extension Api No: 320160303 configure.in:7: warning: The macro `LT_AC_PROG_SED' is obsolete. configure.in:7: You should run autoupdate. aclocal.m4:11526: LT_AC_PROG_SED is expanded from... aclocal.m4:2734: PHP_CONFIG_NICE is expanded from... configure.in:7: the top level configure.in:7: warning: $as_echo is obsolete; use AS_ECHO(["message"]) instead aclocal.m4:2734: PHP_CONFIG_NICE is expanded from... configure.in:7: the top level configure.in:34: warning: The macro `AC_TRY_LINK' is obsolete. configure.in:34: You should run autoupdate. ./lib/autoconf/general.m4:2920: AC_TRY_LINK is expanded from... lib/m4sugar/m4sh.m4:692: _AS_IF_ELSE is expanded from... lib/m4sugar/m4sh.m4:699: AS_IF is expanded from... ./lib/autoconf/general.m4:2249: AC_CACHE_VAL is expanded from... aclocal.m4:301: PHP_RUNPATH_SWITCH is expanded from... configure.in:34: the top level configure.in:149: warning: The macro `AC_PROG_LIBTOOL' is obsolete. configure.in:149: You should run autoupdate. aclocal.m4:3287: AC_PROG_LIBTOOL is expanded from... configure.in:149: the top level configure.in:199: warning: The macro `AC_CONFIG_HEADER' is obsolete. configure.in:199: You should run autoupdate. ./lib/autoconf/status.m4:719: AC_CONFIG_HEADER is expanded from... configure.in:199: the top level autoheader: warning: autoconf input should be named 'configure.ac', not 'configure.in' + ./configure 'LDFLAGS=-Wl,--as-needed -Wl,--no-copy-dt-needed-entries -Wl,-z,relro -Wl,-z,combreloc ' 'CFLAGS=-O2 -fwrapv -pipe -Wformat -Werror=format-security -gdwarf-4 -fno-debug-types-section -fvar-tracking-assignments -g2 -Wp,-D_FORTIFY_SOURCE=2 -fstack-protector-strong --param=ssp-buffer-size=4 -Werror=trampolines -fPIC -mtune=generic -march=x86-64 -gdwarf-4 -fno-debug-types-section -fvar-tracking-assignments -g2 ' 'CXXFLAGS=-O2 -fwrapv -pipe -Wformat -Werror=format-security -gdwarf-4 -fno-debug-types-section -fvar-tracking-assignments -g2 -Wp,-D_FORTIFY_SOURCE=2 -fstack-protector-strong --param=ssp-buffer-size=4 -Werror=trampolines -fPIC -mtune=generic -march=x86-64 -gdwarf-4 -fno-debug-types-section -fvar-tracking-assignments -g2 ' 'FFLAGS=-O2 -fwrapv -pipe -Wformat -Werror=format-security -gdwarf-4 -fno-debug-types-section -fvar-tracking-assignments -g2 -Wp,-D_FORTIFY_SOURCE=2 -fstack-protector-strong --param=ssp-buffer-size=4 -Werror=trampolines -fPIC -mtune=generic -march=x86-64 -gdwarf-4 -fno-debug-types-section -fvar-tracking-assignments -g2 ' 'FCFLAGS=-O2 -fwrapv -pipe -Wformat -Werror=format-security -gdwarf-4 -fno-debug-types-section -fvar-tracking-assignments -g2 -Wp,-D_FORTIFY_SOURCE=2 -fstack-protector-strong --param=ssp-buffer-size=4 -Werror=trampolines -fPIC -mtune=generic -march=x86-64 -gdwarf-4 -fno-debug-types-section -fvar-tracking-assignments -g2 ' 'CPPFLAGS=' 'CC=x86_64-pld-linux-gnux32-gcc' 'CXX=x86_64-pld-linux-gnux32-g++' '--host=x86_64-pld-linux-gnux32' '--build=x86_64-pld-linux-gnux32' '--prefix=/usr' '--exec-prefix=/usr' '--bindir=/usr/bin' '--sbindir=/usr/sbin' '--sysconfdir=/etc' '--datadir=/usr/share' '--includedir=/usr/include' '--libdir=/usr/libx32' '--libexecdir=/usr/libexec' '--localstatedir=/var' '--sharedstatedir=/var/lib' '--mandir=/usr/share/man' '--infodir=/usr/share/info' '--x-libraries=/usr/libx32' checking for grep that handles long lines and -e... /bin/grep checking for egrep... /bin/grep -E checking for a sed that does not truncate output... /bin/sed checking for x86_64-pld-linux-gnux32-cc... x86_64-pld-linux-gnux32-gcc checking whether the C compiler works... yes checking for C compiler default output file name... a.out checking for suffix of executables... checking whether we are cross compiling... no checking for suffix of object files... o checking whether the compiler supports GNU C... yes checking whether x86_64-pld-linux-gnux32-gcc accepts -g... yes checking for x86_64-pld-linux-gnux32-gcc option to enable C11 features... none needed checking how to run the C preprocessor... x86_64-pld-linux-gnux32-gcc -E checking for icc... no checking for suncc... no checking whether x86_64-pld-linux-gnux32-gcc and cc understand -c and -o together... yes checking for system library directory... lib checking if compiler supports -R... no checking if compiler supports -Wl,-rpath,... yes checking build system type... x86_64-pld-linux-gnux32 checking host system type... x86_64-pld-linux-gnux32 checking target system type... x86_64-pld-linux-gnux32 checking for PHP prefix... /usr checking for PHP includes... -I/usr/include/php -I/usr/include/php/main -I/usr/include/php/TSRM -I/usr/include/php/Zend -I/usr/include/php/ext -I/usr/include/php/ext/date/lib checking for PHP extension directory... /usr/libx32/php71 checking for PHP installed headers prefix... /usr/include/php checking if debug is enabled... no checking if zts is enabled... no checking for re2c... re2c checking for re2c version... 1.2 (ok) checking for gawk... gawk checking for libsodium support... yes, shared checking for libsodium files in default path... found in /usr checking for sodium_add in -lsodium... yes checking for crypto_aead_aes256gcm_encrypt in -lsodium... yes checking how to print strings... print -r checking for a sed that does not truncate output... (cached) /bin/sed checking for fgrep... /bin/grep -F checking for ld used by x86_64-pld-linux-gnux32-gcc... /usr/bin/ld checking if the linker (/usr/bin/ld) is GNU ld... yes checking for BSD- or MS-compatible name lister (nm)... /usr/bin/nm -B checking the name lister (/usr/bin/nm -B) interface... BSD nm checking whether ln -s works... yes checking the maximum length of command line arguments... 1572864 checking how to convert x86_64-pld-linux-gnux32 file names to x86_64-pld-linux-gnux32 format... func_convert_file_noop checking how to convert x86_64-pld-linux-gnux32 file names to toolchain format... func_convert_file_noop checking for /usr/bin/ld option to reload object files... -r checking for x86_64-pld-linux-gnux32-file... no checking for file... file checking for x86_64-pld-linux-gnux32-objdump... no checking for objdump... objdump checking how to recognize dependent libraries... pass_all checking for x86_64-pld-linux-gnux32-dlltool... no checking for dlltool... no checking how to associate runtime and link libraries... print -r -- checking for x86_64-pld-linux-gnux32-ar... no checking for ar... ar checking for archiver @FILE support... @ checking for x86_64-pld-linux-gnux32-strip... no checking for strip... strip checking for x86_64-pld-linux-gnux32-ranlib... no checking for ranlib... ranlib checking for mawk... (cached) gawk checking command to parse /usr/bin/nm -B output from x86_64-pld-linux-gnux32-gcc object... ok checking for sysroot... no checking for a working dd... /bin/dd checking how to truncate binary pipes... /bin/dd bs=4096 count=1 checking for x86_64-pld-linux-gnux32-mt... no checking for mt... no checking if : is a manifest tool... no checking for stdio.h... yes checking for stdlib.h... yes checking for string.h... yes checking for inttypes.h... yes checking for stdint.h... yes checking for strings.h... yes checking for sys/stat.h... yes checking for sys/types.h... yes checking for unistd.h... yes checking for dlfcn.h... yes checking for objdir... .libs checking if x86_64-pld-linux-gnux32-gcc supports -fno-rtti -fno-exceptions... no checking for x86_64-pld-linux-gnux32-gcc option to produce PIC... -fPIC -DPIC checking if x86_64-pld-linux-gnux32-gcc PIC flag -fPIC -DPIC works... yes checking if x86_64-pld-linux-gnux32-gcc static flag -static works... yes checking if x86_64-pld-linux-gnux32-gcc supports -c -o file.o... yes checking if x86_64-pld-linux-gnux32-gcc supports -c -o file.o... (cached) yes checking whether the x86_64-pld-linux-gnux32-gcc linker (/usr/bin/ld -m elf32_x86_64) supports shared libraries... yes checking whether -lc should be explicitly linked in... no checking dynamic linker characteristics... GNU/Linux ld.so checking how to hardcode library paths into programs... immediate checking whether stripping libraries is possible... yes checking if libtool supports shared libraries... yes checking whether to build shared libraries... yes checking whether to build static libraries... no configure: creating ./config.status config.status: creating config.h config.status: executing libtool commands + /usr/bin/make -Otarget -j28 /bin/sh /tmp/B.g_uirnud/BUILD/php71-pecl-libsodium-1.0.7/libtool --mode=compile x86_64-pld-linux-gnux32-gcc -I. -I/tmp/B.g_uirnud/BUILD/php71-pecl-libsodium-1.0.7 -DPHP_ATOM_INC -I/tmp/B.g_uirnud/BUILD/php71-pecl-libsodium-1.0.7/include -I/tmp/B.g_uirnud/BUILD/php71-pecl-libsodium-1.0.7/main -I/tmp/B.g_uirnud/BUILD/php71-pecl-libsodium-1.0.7 -I/usr/include/php -I/usr/include/php/main -I/usr/include/php/TSRM -I/usr/include/php/Zend -I/usr/include/php/ext -I/usr/include/php/ext/date/lib -DHAVE_CONFIG_H -O2 -fwrapv -pipe -Wformat -Werror=format-security -gdwarf-4 -fno-debug-types-section -fvar-tracking-assignments -g2 -Wp,-D_FORTIFY_SOURCE=2 -fstack-protector-strong --param=ssp-buffer-size=4 -Werror=trampolines -fPIC -mtune=generic -march=x86-64 -gdwarf-4 -fno-debug-types-section -fvar-tracking-assignments -g2 -c /tmp/B.g_uirnud/BUILD/php71-pecl-libsodium-1.0.7/libsodium.c -o libsodium.lo libtool: compile: x86_64-pld-linux-gnux32-gcc -I. -I/tmp/B.g_uirnud/BUILD/php71-pecl-libsodium-1.0.7 -DPHP_ATOM_INC -I/tmp/B.g_uirnud/BUILD/php71-pecl-libsodium-1.0.7/include -I/tmp/B.g_uirnud/BUILD/php71-pecl-libsodium-1.0.7/main -I/tmp/B.g_uirnud/BUILD/php71-pecl-libsodium-1.0.7 -I/usr/include/php -I/usr/include/php/main -I/usr/include/php/TSRM -I/usr/include/php/Zend -I/usr/include/php/ext -I/usr/include/php/ext/date/lib -DHAVE_CONFIG_H -O2 -fwrapv -pipe -Wformat -Werror=format-security -gdwarf-4 -fno-debug-types-section -fvar-tracking-assignments -g2 -Wp,-D_FORTIFY_SOURCE=2 -fstack-protector-strong --param=ssp-buffer-size=4 -Werror=trampolines -fPIC -mtune=generic -march=x86-64 -gdwarf-4 -fno-debug-types-section -fvar-tracking-assignments -g2 -c /tmp/B.g_uirnud/BUILD/php71-pecl-libsodium-1.0.7/libsodium.c -fPIC -DPIC -o .libs/libsodium.o /bin/sh /tmp/B.g_uirnud/BUILD/php71-pecl-libsodium-1.0.7/libtool --mode=link x86_64-pld-linux-gnux32-gcc -DPHP_ATOM_INC -I/tmp/B.g_uirnud/BUILD/php71-pecl-libsodium-1.0.7/include -I/tmp/B.g_uirnud/BUILD/php71-pecl-libsodium-1.0.7/main -I/tmp/B.g_uirnud/BUILD/php71-pecl-libsodium-1.0.7 -I/usr/include/php -I/usr/include/php/main -I/usr/include/php/TSRM -I/usr/include/php/Zend -I/usr/include/php/ext -I/usr/include/php/ext/date/lib -DHAVE_CONFIG_H -O2 -fwrapv -pipe -Wformat -Werror=format-security -gdwarf-4 -fno-debug-types-section -fvar-tracking-assignments -g2 -Wp,-D_FORTIFY_SOURCE=2 -fstack-protector-strong --param=ssp-buffer-size=4 -Werror=trampolines -fPIC -mtune=generic -march=x86-64 -gdwarf-4 -fno-debug-types-section -fvar-tracking-assignments -g2 -Wl,--as-needed -Wl,--no-copy-dt-needed-entries -Wl,-z,relro -Wl,-z,combreloc -o libsodium.la -export-dynamic -avoid-version -prefer-pic -module -rpath /tmp/B.g_uirnud/BUILD/php71-pecl-libsodium-1.0.7/modules libsodium.lo -lsodium libtool: link: x86_64-pld-linux-gnux32-gcc -shared -fPIC -DPIC -O2 -gdwarf-4 -g2 -fstack-protector-strong -mtune=generic -march=x86-64 -gdwarf-4 -g2 -Wl,--as-needed -Wl,--no-copy-dt-needed-entries -Wl,-z -Wl,relro -Wl,-z -Wl,combreloc .libs/libsodium.o -lsodium -Wl,-soname -Wl,libsodium.so -o .libs/libsodium.so libtool: link: ( cd ".libs" && rm -f "libsodium.la" && ln -s "../libsodium.la" "libsodium.la" ) /bin/sh /tmp/B.g_uirnud/BUILD/php71-pecl-libsodium-1.0.7/libtool --mode=install cp ./libsodium.la /tmp/B.g_uirnud/BUILD/php71-pecl-libsodium-1.0.7/modules libtool: install: cp ./.libs/libsodium.so /tmp/B.g_uirnud/BUILD/php71-pecl-libsodium-1.0.7/modules/libsodium.so libtool: install: cp ./.libs/libsodium.lai /tmp/B.g_uirnud/BUILD/php71-pecl-libsodium-1.0.7/modules/libsodium.la libtool: finish: PATH="/home/users/builder/GNUstep/Tools:/bin:/usr/bin:/usr/local/bin:/sbin" ldconfig -n /tmp/B.g_uirnud/BUILD/php71-pecl-libsodium-1.0.7/modules ---------------------------------------------------------------------- Libraries have been installed in: /tmp/B.g_uirnud/BUILD/php71-pecl-libsodium-1.0.7/modules If you ever happen to want to link against installed libraries in a given directory, LIBDIR, you must either use libtool, and specify the full pathname of the library, or use the '-LLIBDIR' flag during linking and do at least one of the following: - add LIBDIR to the 'LD_LIBRARY_PATH' environment variable during execution - add LIBDIR to the 'LD_RUN_PATH' environment variable during linking - use the '-Wl,-rpath -Wl,LIBDIR' linker flag - have your system administrator add LIBDIR to '/etc/ld.so.conf' See any operating system documentation about shared libraries for more information, such as the ld(1) and ld.so(8) manual pages. ---------------------------------------------------------------------- Build complete. Don't forget to run 'make test'. + : Minimal load test + >modules.log + /usr/bin/php71 -n -d 'extension_dir=modules' -d 'extension=libsodium.so' -m + grep libsodium modules.log libsodium + : Upstream test suite + export 'NO_INTERACTION=1' 'REPORT_EXIT_STATUS=1' 'MALLOC_CHECK_=2' + /usr/bin/make -Otarget -j28 test 'PHP_EXECUTABLE=/usr/bin/php71' 'PHP_TEST_SHARED_SYSTEM_EXTENSIONS=json' Build complete. Don't forget to run 'make test'. ===================================================================== PHP : /usr/bin/php71 PHP_SAPI : cli PHP_VERSION : 7.1.33 ZEND_VERSION: 3.1.0 PHP_OS : Linux - Linux naiad 6.1.55-1 #1 SMP PREEMPT_DYNAMIC Sun Oct 1 12:26:15 CEST 2023 x86_64 INI actual : /tmp/B.g_uirnud/BUILD/php71-pecl-libsodium-1.0.7/tmp-php.ini More .INIs : CWD : /tmp/B.g_uirnud/BUILD/php71-pecl-libsodium-1.0.7 Extra dirs : VALGRIND : Not used ===================================================================== TIME START 2023-11-27 23:26:32 ===================================================================== TEST 1/17 [tests/crypto_aead.phpt] PASS Check for libsodium AEAD [tests/crypto_aead.phpt] TEST 2/17 [tests/crypto_auth.phpt] FAIL Check for libsodium auth [tests/crypto_auth.phpt] TEST 3/17 [tests/crypto_box.phpt] PASS Check for libsodium box [tests/crypto_box.phpt] TEST 4/17 [tests/crypto_generichash.phpt] PASS Check for libsodium generichash [tests/crypto_generichash.phpt] TEST 5/17 [tests/crypto_hex.phpt] PASS Check for libsodium bin2hex [tests/crypto_hex.phpt] TEST 6/17 [tests/crypto_kx.phpt] PASS Check for libsodium-based key exchange [tests/crypto_kx.phpt] TEST 7/17 [tests/crypto_scalarmult.phpt] PASS Check for libsodium scalarmult [tests/crypto_scalarmult.phpt] TEST 8/17 [tests/crypto_secretbox.phpt] PASS Check for libsodium secretbox [tests/crypto_secretbox.phpt] TEST 9/17 [tests/crypto_shorthash.phpt] PASS Check for libsodium shorthash [tests/crypto_shorthash.phpt] TEST 10/17 [tests/crypto_sign.phpt] PASS Check for libsodium ed25519 signatures [tests/crypto_sign.phpt] TEST 11/17 [tests/crypto_stream.phpt] PASS Check for libsodium stream [tests/crypto_stream.phpt] TEST 12/17 [tests/installed.phpt] PASS Check for libsodium presence [tests/installed.phpt] TEST 13/17 [tests/pwhash_argon2i.phpt] PASS Check for libsodium utils [tests/pwhash_argon2i.phpt] TEST 14/17 [tests/pwhash_scrypt.phpt] PASS Check for libsodium utils [tests/pwhash_scrypt.phpt] TEST 15/17 [tests/randombytes.phpt] PASS Check for libsodium randombytes [tests/randombytes.phpt] TEST 16/17 [tests/utils.phpt] PASS Check for libsodium utils [tests/utils.phpt] TEST 17/17 [tests/version.phpt] PASS Check for libsodium version [tests/version.phpt] ===================================================================== TIME END 2023-11-27 23:26:33 ===================================================================== TEST RESULT SUMMARY --------------------------------------------------------------------- Exts skipped : 0 Exts tested : 7 --------------------------------------------------------------------- Number of tests : 17 17 Tests skipped : 0 ( 0.0%) -------- Tests warned : 0 ( 0.0%) ( 0.0%) Tests failed : 1 ( 5.9%) ( 5.9%) Expected fail : 0 ( 0.0%) ( 0.0%) Tests passed : 16 ( 94.1%) ( 94.1%) --------------------------------------------------------------------- Time taken : 1 seconds ===================================================================== ===================================================================== FAILED TEST SUMMARY --------------------------------------------------------------------- Check for libsodium auth [tests/crypto_auth.phpt] ===================================================================== make: *** [Makefile:151: test] Error 1 error: Bad exit status from /tmp/B.g_uirnud/BUILD/tmp/rpm-tmp.DOdQZd (%build) RPM build errors: Bad exit status from /tmp/B.g_uirnud/BUILD/tmp/rpm-tmp.DOdQZd (%build) ended at: Mon Nov 27 23:26:33 2023, done in 0:00:08.690053 error: No files produced. + chmod -R u+rwX /tmp/B.g_uirnud/BUILD + rm -rf /tmp/B.g_uirnud/tmp /tmp/B.g_uirnud/BUILD + rm -rf /tmp/B.g_uirnud Begin-PLD-Builder-Info Build-Time: user:13.78s sys:7.20s real:25.01s (faults io:3 non-io:1220822) End-PLD-Builder-Info
[Back to list of logs] [View rpm -qa of builder]