FailedOk

th/SRPMS[OK]
th/x32[OK]
th/i686[OK]
th/x86_64[OK]

ac/SRPMS[OK]
ac/i386[OK]
ac/i586[OK]
ac/i686[OK]
ac/alpha[OK]
ac/amd64[OK]
ac/athlon[OK]
ac/ppc[OK]
ac/sparc[OK]
ac/sparc64[OK]

Advanced Search
main()
Powered by PLD Linux
(c) 2002-2022 PLD Team
$Revision: 1.37 $
Powered by Linux.
Your IP: 35.175.107.185

php-pecl-memcache 7aacc08a-da05-4d53-ad79-4d579fb06a38

Status:Failed
Source URL:https://buildlogs.pld-linux.org/pld/th/x32/FAIL/php-pecl-memcache,7aacc08a-da05-4d53-ad79-4d579fb06a38.bz2
text/plain URL:View!
rpm -qa of builder:View!
Date:2022/09/29 16:57:03
Runtime:0:00:07.524445

Toc:

  • error 1
  • rpm: error: Failed build dependencies:
  • error 2
  • rpm: error: Failed build dependencies:
  • error 3
  • rpm: error: Failed build dependencies:
  • prep
  • Executing(%prep): /bin/sh -e /tmp/B.b8vhwhz8/BUILD/tmp/rpm-tmp.wr5fgF
  • error 4
  • XFAIL: memcache->addServer() [tests/019.phpt]
  • error 5
  • XFAIL: memcache->set()/memcache->get() with multiple keys and load balancing [tests/020.phpt]
  • error 6
  • XFAIL: memcache->getExtendedStats() [tests/022.phpt]
  • error 7
  • XFAIL: memcache_get_extended_stats() [tests/022a.phpt]
  • error 8
  • XFAIL: memcache->delete() with load balancing [tests/023.phpt]
  • error 9
  • XFAIL: memcache->increment() with load balancing [tests/025.phpt]
  • error 10
  • XFAIL: memcache->delete() with load balancing [tests/026.phpt]
  • error 11
  • XFAIL: memcache->addServer() adding server in failed mode [tests/031.phpt]
  • error 12
  • XFAIL: memcache->getServerStatus(), memcache->setServerParams() [tests/032.phpt]
  • error 13
  • XFAIL: memcache::connect() with unix domain socket [tests/035.phpt]
  • error 14
  • XFAIL: ini_set('session.save_handler') [tests/036.phpt]
  • error 15
  • XFAIL: ini_set('session.save_path') [tests/036b.phpt]
  • error 16
  • XFAIL: memcache->increment()/decrement() with multiple keys [tests/040.phpt]
  • error 17
  • XFAIL: memcache->delete() with multiple keys [tests/041.phpt]
  • error 18
  • XFAIL: memcache->set() with multiple values [tests/042.phpt]
  • error 19
  • XFAIL: ini_set('memcache.redundancy') [tests/043.phpt]
  • error 20
  • XFAIL: ini_set('memcache.session_redundancy') [tests/044.phpt]
  • error 21
  • XFAIL: hash strategies and functions [tests/046.phpt]
  • error 22
  • XFAIL: ini_set('session.save_handler') with unix domain socket [tests/053.phpt]
  • error 23
  • XFAIL: memcache multi host save path function [tests/bug73539.phpt]
  • error 24
  • XFAIL: session_regenerate_id() should not cause fatal error [tests/githubbug13.phpt]
  • build
  • Executing(%build): /bin/sh -e /tmp/B.b8vhwhz8/BUILD/tmp/rpm-tmp.i9ubtz
  • error 25
  • error: Bad exit status from /tmp/B.b8vhwhz8/BUILD/tmp/rpm-tmp.i9ubtz (%build)
  • error 26
  • RPM build errors:
  • error 27
  • error: No files produced.

Content:

request from: glen
checking if we should skip the build
started at: Thu Sep 29 16:56:37 2022
killing old processes on a builder
sending signal 9 to pid -1
cleaning up /tmp
fetching https://srcbuilder.pld-linux.org/th//srpms/7aacc08a-da05-4d53-ad79-4d579fb06a38/php82-pecl-memcache-8.0-1.src.rpm
fetched 95142 bytes, 271.5 K/s
installing srpm: php82-pecl-memcache-8.0-1.src.rpm
+ install -d /tmp/B.b8vhwhz8/BUILD /tmp/B.b8vhwhz8/RPMS
+ LC_ALL=en_US.UTF-8
+ rpm -qp --changelog php82-pecl-memcache-8.0-1.src.rpm
* Thu Sep 29 2022 PLD Linux Team <feedback@pld-linux.org>
- For complete changelog see: http://git.pld-linux.org/?p=packages/php-pecl-memcache.git;a=log;h=auto/th/php-pecl-memcache-8.0-1
* Tue Dec 15 2020 Elan Ruusamäe <glen@pld-linux.org> dc9c128
- Up to 8.0, adds php 8.0 support * Tue Dec 15 2020 Elan Ruusamäe <glen@pld-linux.org> 8f90994
- Up to 4.0.5.2 * Mon May 04 2020 Elan Ruusamäe <glen@pld-linux.org> e749f62
- Build web package standalone of extension version * Sat Jan 25 2020 Jan Rękorajski <baggins@pld-linux.org> 0b46688
- drop obsolete and outdated manual inclusion of rpm macros * Thu Dec 19 2019 Elan Ruusamäe <glen@pld-linux.org> a92c026
- Update for missing tests/044b.phpt * Thu Dec 19 2019 Elan Ruusamäe <glen@pld-linux.org> 3ed6454
- up to 4.0.5.1 * Wed Aug 21 2019 Elan Ruusamäe <glen@pld-linux.org> cb9f58e
- Add memcache with udp listen for tests * Tue Aug 20 2019 Elan Ruusamäe <glen@pld-linux.org> 746511d
- fix self-test on php 7.4; always do module load test * Fri Aug 16 2019 Elan Ruusamäe <glen@pld-linux.org> f00d600
- up to 4.0.4 * Sat May 11 2019 Elan Ruusamäe <glen@pld-linux.org> 31f4af4
- update failed tests * Sat May 11 2019 Elan Ruusamäe <glen@pld-linux.org> 9600d33
- php 5.2 deps * Sat May 11 2019 Elan Ruusamäe <glen@pld-linux.org> 2847bd4
- reset failed tests * Fri May 10 2019 Elan Ruusamäe <glen@pld-linux.org> f148f58
- up to 4.0.3 * Tue Nov 13 2018 Elan Ruusamäe <glen@pld-linux.org> 2b5f773
- rel 3; php 7.3 support * Tue Nov 13 2018 Elan Ruusamäe <glen@pld-linux.org> 7b17d00
- [PATCH] fix for PHP 7.3 + fix build warnings * Tue Nov 13 2018 Elan Ruusamäe <glen@pld-linux.org> 4b53237
- [PATCH] Fix #23 Failed to read session data with 7.1/7.2 * Tue Dec 05 2017 Elan Ruusamäe <glen@pld-linux.org> ea2e044
- tests/bug73539.phpt fails on most versions on builders * Tue Dec 05 2017 Elan Ruusamäe <glen@pld-linux.org> 7362daf
- up to e702b5f91 snapshot * Mon Dec 12 2016 Elan Ruusamäe <glen@delfi.ee> b5fd909
- strange keys [tests/005.phpt] fails on php 7.1 * Wed Nov 23 2016 Elan Ruusamäe <glen@delfi.ee> c6406d1
- repated failures for tests/029.phpt + rpm -Uhv --nodeps --define '_topdir /tmp/B.b8vhwhz8' --define '_specdir %{_topdir}' --define '_sourcedir %{_specdir}' --define '_rpmdir %{_topdir}/RPMS' --define '_builddir %{_topdir}/BUILD' --define 'php_suffix 82' php82-pecl-memcache-8.0-1.src.rpm Updating / installing... php82-pecl-memcache-8.0-1 ######################################## + rm -f php82-pecl-memcache-8.0-1.src.rpm + install -m 700 -d /tmp/B.b8vhwhz8/BUILD/tmp + TMPDIR=/tmp/B.b8vhwhz8/BUILD/tmp + exec nice -n 0 rpmbuild -bp --short-circuit --nodeps --define '_topdir /tmp/B.b8vhwhz8' --define '_specdir %{_topdir}' --define '_sourcedir %{_specdir}' --define '_rpmdir %{_topdir}/RPMS' --define '_builddir %{_topdir}/BUILD' --target x32-pld-linux --define 'php_suffix 82' --define 'prep exit 0' /tmp/B.b8vhwhz8/php-pecl-memcache.spec sh: php-config: inaccessible or not found Building target platforms: x32-pld-linux Building for target x32-pld-linux checking BuildConflict-ing packages rpm: sh: php-config: inaccessible or not found rpm: error: Failed build dependencies: rpm: php-packagexml2cl is needed by php82-pecl-memcache-8.0-1.x32 rpm: php82-cli is needed by php82-pecl-memcache-8.0-1.x32 rpm: php82-devel >= 3:7.0.0 is needed by php82-pecl-memcache-8.0-1.x32 rpm: php82-pcre is needed by php82-pecl-memcache-8.0-1.x32 rpm: php82-session is needed by php82-pecl-memcache-8.0-1.x32 rpm: php82-simplexml is needed by php82-pecl-memcache-8.0-1.x32 rpm: php82-spl is needed by php82-pecl-memcache-8.0-1.x32 rpm: php82-xml is needed by php82-pecl-memcache-8.0-1.x32 rpm: Building target platforms: x32-pld-linux rpm: Building for target x32-pld-linux no BuildConflicts found checking BR rpm: sh: php-config: inaccessible or not found rpm: error: Failed build dependencies: rpm: php-packagexml2cl is needed by php82-pecl-memcache-8.0-1.x32 rpm: php82-cli is needed by php82-pecl-memcache-8.0-1.x32 rpm: php82-devel >= 3:7.0.0 is needed by php82-pecl-memcache-8.0-1.x32 rpm: php82-pcre is needed by php82-pecl-memcache-8.0-1.x32 rpm: php82-session is needed by php82-pecl-memcache-8.0-1.x32 rpm: php82-simplexml is needed by php82-pecl-memcache-8.0-1.x32 rpm: php82-spl is needed by php82-pecl-memcache-8.0-1.x32 rpm: php82-xml is needed by php82-pecl-memcache-8.0-1.x32 rpm: Building target platforms: x32-pld-linux rpm: Building for target x32-pld-linux updating poldek cache... ready is up to date th is up to date th is up to date th-ready is up to date th-ready is up to date th-test is up to date th-test is up to date checking conflicting packages in BRed packages poldek: Loading [pndir]ready... poldek: Loading [pndir]th-test... poldek: Loading [pndir]th-test... poldek: Loading [pndir]th-ready... poldek: Loading [pndir]th-ready... poldek: Loading [pndir]th... poldek: Loading [pndir]th... poldek: 31122 packages read poldek: Removed 3652 duplicate packages from available set poldek: Processing dependencies... poldek: php-packagexml2cl-0.1-4.noarch marks php82-program-8.2.0-0.RC2.1.x32 (cap /usr/bin/php) poldek: There are 8 packages to install (1 marked by dependencies): poldek: A php-packagexml2cl-0.1-4.noarch php82-cli-8.2.0-0.RC2.1.x32 poldek: A php82-common-8.2.0-0.RC2.1.x32 php82-devel-8.2.0-0.RC2.1.x32 poldek: A php82-program-8.2.0-0.RC2.1.x32 php82-session-8.2.0-0.RC2.1.x32 poldek: A php82-simplexml-8.2.0-0.RC2.1.x32 php82-xml-8.2.0-0.RC2.1.x32 poldek: This operation will use 16.8MB of disk space. poldek: Need to get 2.4MB of archives (2.9KB to download). poldek: poldek: php82-common-8.2.0-0.RC2.1.x32.rpm: digests OK poldek: php82-cli-8.2.0-0.RC2.1.x32.rpm: digests OK poldek: php82-program-8.2.0-0.RC2.1.x32.rpm: digests OK poldek: php82-simplexml-8.2.0-0.RC2.1.x32.rpm: digests OK poldek: php82-devel-8.2.0-0.RC2.1.x32.rpm: digests OK poldek: php82-session-8.2.0-0.RC2.1.x32.rpm: digests OK poldek: php82-xml-8.2.0-0.RC2.1.x32.rpm: digests OK poldek: Retrieving th::php-packagexml2cl-0.1-4.noarch.rpm..........................................done poldek: php-packagexml2cl-0.1-4.noarch.rpm: digests OK poldek: Executing pm-command.sh --upgrade -vh --test --root / --define _check_dirname_deps 0... poldek: warning: /root/.cache/poldek/ftp_ftp1.pld-linux.org.dists.th.PLD.noarch.RPMS/php-packagexml2cl-0.1-4.noarch.rpm: Header V4 DSA/SHA1 Signature, key ID e4f1bc2d: NOKEY poldek: Verifying... ######################################## poldek: Preparing... ######################################## no conflicts found checking BR rpm: sh: php-config: inaccessible or not found rpm: error: Failed build dependencies: rpm: php-packagexml2cl is needed by php82-pecl-memcache-8.0-1.x32 rpm: php82-cli is needed by php82-pecl-memcache-8.0-1.x32 rpm: php82-devel >= 3:7.0.0 is needed by php82-pecl-memcache-8.0-1.x32 rpm: php82-pcre is needed by php82-pecl-memcache-8.0-1.x32 rpm: php82-session is needed by php82-pecl-memcache-8.0-1.x32 rpm: php82-simplexml is needed by php82-pecl-memcache-8.0-1.x32 rpm: php82-spl is needed by php82-pecl-memcache-8.0-1.x32 rpm: php82-xml is needed by php82-pecl-memcache-8.0-1.x32 rpm: Building target platforms: x32-pld-linux rpm: Building for target x32-pld-linux installing BR: php\-packagexml2cl php82\-cli php82\-devel php82\-pcre php82\-session php82\-simplexml php82\-spl php82\-xml + poldek --noask --caplookup -Q -v '--ignore=hhvm-*' '--ignore=php4-*' '--ignore=php52-*' '--ignore=php53-*' '--ignore=php54-*' '--ignore=php55-*' '--ignore=php56-*' '--ignore=php70-*' '--ignore=php71-*' '--ignore=php72-*' '--ignore=php73-*' '--ignore=php74-*' '--ignore=php80-*' '--ignore=php81-*' --upgrade php-packagexml2cl php82-cli php82-devel php82-pcre php82-session php82-simplexml php82-spl php82-xml Loading [pndir]ready... Loading [pndir]th-test... Loading [pndir]th-test... Loading [pndir]th-ready... Loading [pndir]th-ready... Loading [pndir]th... Loading [pndir]th... 31122 packages read Removed 3652 duplicate packages from available set Processing dependencies... There are 6 packages to install: A php82-cli-8.2.0-0.RC2.1.x32 php82-common-8.2.0-0.RC2.1.x32 A php82-devel-8.2.0-0.RC2.1.x32 php82-session-8.2.0-0.RC2.1.x32 A php82-simplexml-8.2.0-0.RC2.1.x32 php82-xml-8.2.0-0.RC2.1.x32 This operation will use 16.8MB of disk space. Need to get 2.4MB of archives. php82-common-8.2.0-0.RC2.1.x32.rpm: digests OK php82-cli-8.2.0-0.RC2.1.x32.rpm: digests OK php82-devel-8.2.0-0.RC2.1.x32.rpm: digests OK php82-session-8.2.0-0.RC2.1.x32.rpm: digests OK php82-simplexml-8.2.0-0.RC2.1.x32.rpm: digests OK php82-xml-8.2.0-0.RC2.1.x32.rpm: digests OK Executing pm-command.sh --upgrade -vh --root / --define _check_dirname_deps 0... Verifying... ######################################## Preparing... ######################################## Updating / installing... php82-common-4:8.2.0-0.RC2.1 ######################################## php82-cli-4:8.2.0-0.RC2.1 ######################################## php82-devel-4:8.2.0-0.RC2.1 ######################################## php82-session-4:8.2.0-0.RC2.1 ######################################## php82-simplexml-4:8.2.0-0.RC2.1 ######################################## php82-xml-4:8.2.0-0.RC2.1 ######################################## Installing set #2 Processing dependencies... php-packagexml2cl-0.1-4.noarch marks php82-program-8.2.0-0.RC2.1.x32 (cap /usr/bin/php) There are 2 packages to install (1 marked by dependencies): A php-packagexml2cl-0.1-4.noarch php82-program-8.2.0-0.RC2.1.x32 This operation will use 1.4KB of disk space. php-packagexml2cl-0.1-4.noarch.rpm: digests OK Need to get 12.0KB of archives. php82-program-8.2.0-0.RC2.1.x32.rpm: digests OK php-packagexml2cl-0.1-4.noarch.rpm: digests OK Executing pm-command.sh --upgrade -vh --root / --define _check_dirname_deps 0... warning: /root/.cache/poldek/ftp_ftp1.pld-linux.org.dists.th.PLD.noarch.RPMS/php-packagexml2cl-0.1-4.noarch.rpm: Header V4 DSA/SHA1 Signature, key ID e4f1bc2d: NOKEY Verifying... ######################################## Preparing... ######################################## Updating / installing... php82-program-4:8.2.0-0.RC2.1 ######################################## php-packagexml2cl-0:0.1-4 ######################################## building RPM using: set -ex; : build-id: 7aacc08a-da05-4d53-ad79-4d579fb06a38; TMPDIR=/tmp/B.b8vhwhz8/BUILD/tmp exec nice -n 0 rpmbuild -bb --define '__jobs 9' --define '_smp_mflags -j9' --define '_make_opts -Otarget' --define '_pld_builder 1' --define '_topdir /tmp/B.b8vhwhz8' --define '_specdir %{_topdir}' --define '_sourcedir %{_specdir}' --define '_rpmdir %{_topdir}/RPMS' --define '_builddir %{_topdir}/BUILD' --target x32-pld-linux --define 'php_suffix 82' /tmp/B.b8vhwhz8/php-pecl-memcache.spec + : build-id: 7aacc08a-da05-4d53-ad79-4d579fb06a38 + TMPDIR=/tmp/B.b8vhwhz8/BUILD/tmp + exec nice -n 0 rpmbuild -bb --define '__jobs 9' --define '_smp_mflags -j9' --define '_make_opts -Otarget' --define '_pld_builder 1' --define '_topdir /tmp/B.b8vhwhz8' --define '_specdir %{_topdir}' --define '_sourcedir %{_specdir}' --define '_rpmdir %{_topdir}/RPMS' --define '_builddir %{_topdir}/BUILD' --target x32-pld-linux --define 'php_suffix 82' /tmp/B.b8vhwhz8/php-pecl-memcache.spec Building target platforms: x32-pld-linux Building for target x32-pld-linux Executing(%prep): /bin/sh -e /tmp/B.b8vhwhz8/BUILD/tmp/rpm-tmp.wr5fgF + umask 022 + cd /tmp/B.b8vhwhz8/BUILD + cd /tmp/B.b8vhwhz8/BUILD + rm -rf php82-pecl-memcache-8.0 + /bin/mkdir -p php82-pecl-memcache-8.0 + cd php82-pecl-memcache-8.0 + /bin/gzip -dc /tmp/B.b8vhwhz8/memcache-8.0.tgz + /bin/tar -xof - + STATUS=0 + '[' 0 -ne 0 ']' + /bin/chmod -Rf a+rX,u+w,g-w,o-w . + mv memcache-8.0/CREDITS memcache-8.0/Dockerfile memcache-8.0/LICENSE memcache-8.0/README memcache-8.0/cloudbuild.yaml memcache-8.0/config.m4 memcache-8.0/config.w32 memcache-8.0/config9.m4 memcache-8.0/docker memcache-8.0/example.php memcache-8.0/memcache.php memcache-8.0/src memcache-8.0/tests . + echo 'Patch #0 (memcache-webapp.patch):' Patch #0 (memcache-webapp.patch): + </tmp/B.b8vhwhz8/memcache-webapp.patch + /usr/bin/patch -s -f -p1 '--fuzz=0' + echo 'Patch #1 (tests.patch):' Patch #1 (tests.patch): + </tmp/B.b8vhwhz8/tests.patch + /usr/bin/patch -s -f -p1 '--fuzz=0' + <<"EOF" #!/bin/sh export NO_INTERACTION=1 REPORT_EXIT_STATUS=1 MALLOC_CHECK_=2 exec /usr/bin/make -Otarget -j9 test \ PHP_EXECUTABLE=/usr/bin/php82 \ PHP_TEST_SHARED_SYSTEM_EXTENSIONS="simplexml session" \ RUN_TESTS_SETTINGS="-q $*" EOF + >run-tests.sh + cat + chmod +x run-tests.sh + <<"EOF" memcache->addServer() [tests/019.phpt] memcache->set()/memcache->get() with multiple keys and load balancing [tests/020.phpt] memcache->getExtendedStats() [tests/022.phpt] memcache_get_extended_stats() [tests/022a.phpt] memcache->delete() with load balancing [tests/023.phpt] memcache->increment() with load balancing [tests/025.phpt] memcache->delete() with load balancing [tests/026.phpt] memcache->addServer() adding server in failed mode [tests/031.phpt] memcache->getServerStatus(), memcache->setServerParams() [tests/032.phpt] memcache::connect() with unix domain socket [tests/035.phpt] ini_set('session.save_handler') [tests/036.phpt] ini_set('session.save_path') [tests/036b.phpt] memcache->increment()/decrement() with multiple keys [tests/040.phpt] memcache->delete() with multiple keys [tests/041.phpt] memcache->set() with multiple values [tests/042.phpt] ini_set('memcache.redundancy') [tests/043.phpt] ini_set('memcache.session_redundancy') [tests/044.phpt] hash strategies and functions [tests/046.phpt] ini_set('session.save_handler') with unix domain socket [tests/053.phpt] memcache multi host save path function [tests/bug73539.phpt] session_regenerate_id() should not cause fatal error [tests/githubbug13.phpt] EOF + xfail + set +x XFAIL: memcache->addServer() [tests/019.phpt] XFAIL: memcache->set()/memcache->get() with multiple keys and load balancing [tests/020.phpt] XFAIL: memcache->getExtendedStats() [tests/022.phpt] XFAIL: memcache_get_extended_stats() [tests/022a.phpt] XFAIL: memcache->delete() with load balancing [tests/023.phpt] XFAIL: memcache->increment() with load balancing [tests/025.phpt] XFAIL: memcache->delete() with load balancing [tests/026.phpt] XFAIL: memcache->addServer() adding server in failed mode [tests/031.phpt] XFAIL: memcache->getServerStatus(), memcache->setServerParams() [tests/032.phpt] XFAIL: memcache::connect() with unix domain socket [tests/035.phpt] XFAIL: ini_set('session.save_handler') [tests/036.phpt] XFAIL: ini_set('session.save_path') [tests/036b.phpt] XFAIL: memcache->increment()/decrement() with multiple keys [tests/040.phpt] XFAIL: memcache->delete() with multiple keys [tests/041.phpt] XFAIL: memcache->set() with multiple values [tests/042.phpt] XFAIL: ini_set('memcache.redundancy') [tests/043.phpt] XFAIL: ini_set('memcache.session_redundancy') [tests/044.phpt] XFAIL: hash strategies and functions [tests/046.phpt] XFAIL: ini_set('session.save_handler') with unix domain socket [tests/053.phpt] XFAIL: memcache multi host save path function [tests/bug73539.phpt] XFAIL: session_regenerate_id() should not cause fatal error [tests/githubbug13.phpt] + RPM_EC=0 + jobs -p + exit 0 Executing(%build): /bin/sh -e /tmp/B.b8vhwhz8/BUILD/tmp/rpm-tmp.i9ubtz HOME=/home/users/builder PATH=/home/users/builder/GNUstep/Tools:/bin:/usr/bin:/usr/local/bin TMPDIR=/tmp/B.b8vhwhz8/BUILD/tmp + umask 022 + cd /tmp/B.b8vhwhz8/BUILD + cd php82-pecl-memcache-8.0 + >ChangeLog + packagexml2cl package.xml + phpize Configuring for: PHP Api Version: 20220829 Zend Module Api No: 20220829 Zend Extension Api No: 420220829 config9.m4:71: warning: The macro `AC_TRY_COMPILE' is obsolete. config9.m4:71: You should run autoupdate. ./lib/autoconf/general.m4:2847: AC_TRY_COMPILE is expanded from... config9.m4:71: the top level configure.ac:161: warning: The macro `AC_PROG_LIBTOOL' is obsolete. configure.ac:161: You should run autoupdate. build/libtool.m4:100: AC_PROG_LIBTOOL is expanded from... configure.ac:161: the top level + ./configure 'LDFLAGS=-Wl,--as-needed -Wl,--no-copy-dt-needed-entries -Wl,-z,relro -Wl,-z,combreloc ' 'CFLAGS=-O2 -fwrapv -pipe -Wformat -Werror=format-security -gdwarf-4 -fno-debug-types-section -fvar-tracking-assignments -g2 -Wp,-D_FORTIFY_SOURCE=2 -fstack-protector-strong --param=ssp-buffer-size=4 -Werror=trampolines -fPIC -mtune=generic -march=x86-64 -gdwarf-4 -fno-debug-types-section -fvar-tracking-assignments -g2 ' 'CXXFLAGS=-O2 -fwrapv -pipe -Wformat -Werror=format-security -gdwarf-4 -fno-debug-types-section -fvar-tracking-assignments -g2 -Wp,-D_FORTIFY_SOURCE=2 -fstack-protector-strong --param=ssp-buffer-size=4 -Werror=trampolines -fPIC -mtune=generic -march=x86-64 -gdwarf-4 -fno-debug-types-section -fvar-tracking-assignments -g2 ' 'FFLAGS=-O2 -fwrapv -pipe -Wformat -Werror=format-security -gdwarf-4 -fno-debug-types-section -fvar-tracking-assignments -g2 -Wp,-D_FORTIFY_SOURCE=2 -fstack-protector-strong --param=ssp-buffer-size=4 -Werror=trampolines -fPIC -mtune=generic -march=x86-64 -gdwarf-4 -fno-debug-types-section -fvar-tracking-assignments -g2 ' 'FCFLAGS=-O2 -fwrapv -pipe -Wformat -Werror=format-security -gdwarf-4 -fno-debug-types-section -fvar-tracking-assignments -g2 -Wp,-D_FORTIFY_SOURCE=2 -fstack-protector-strong --param=ssp-buffer-size=4 -Werror=trampolines -fPIC -mtune=generic -march=x86-64 -gdwarf-4 -fno-debug-types-section -fvar-tracking-assignments -g2 ' 'CPPFLAGS=' 'CC=x86_64-pld-linux-gnux32-gcc' 'CXX=x86_64-pld-linux-gnux32-g++' '--host=x86_64-pld-linux-gnux32' '--build=x86_64-pld-linux-gnux32' '--prefix=/usr' '--exec-prefix=/usr' '--bindir=/usr/bin' '--sbindir=/usr/sbin' '--sysconfdir=/etc/webapps/memcache' '--datadir=/usr/share' '--includedir=/usr/include' '--libdir=/usr/libx32' '--libexecdir=/usr/libexec' '--localstatedir=/var' '--sharedstatedir=/var/lib' '--mandir=/usr/share/man' '--infodir=/usr/share/info' '--x-libraries=/usr/libx32' '--with-zlib-dir=/usr' checking for grep that handles long lines and -e... /bin/grep checking for egrep... /bin/grep -E checking for a sed that does not truncate output... /bin/sed checking for x86_64-pld-linux-gnux32-pkg-config... /usr/bin/x86_64-pld-linux-gnux32-pkg-config checking pkg-config is at least version 0.9.0... yes checking for x86_64-pld-linux-gnux32-cc... x86_64-pld-linux-gnux32-gcc checking whether the C compiler works... yes checking for C compiler default output file name... a.out checking for suffix of executables... checking whether we are cross compiling... no checking for suffix of object files... o checking whether the compiler supports GNU C... yes checking whether x86_64-pld-linux-gnux32-gcc accepts -g... yes checking for x86_64-pld-linux-gnux32-gcc option to enable C11 features... none needed checking how to run the C preprocessor... x86_64-pld-linux-gnux32-gcc -E checking for icc... no checking for suncc... no checking for system library directory... lib checking if compiler supports -Wl,-rpath,... yes checking build system type... x86_64-pld-linux-gnux32 checking host system type... x86_64-pld-linux-gnux32 checking target system type... x86_64-pld-linux-gnux32 checking for PHP prefix... /usr checking for PHP includes... -I/usr/include/php -I/usr/include/php/main -I/usr/include/php/TSRM -I/usr/include/php/Zend -I/usr/include/php/ext -I/usr/include/php/ext/date/lib checking for PHP extension directory... /usr/libx32/php82 checking for PHP installed headers prefix... /usr/include/php checking if debug is enabled... no checking if zts is enabled... no checking for gawk... gawk checking whether to enable memcache support... yes, shared checking whether to enable memcache session handler support... yes checking for the location of ZLIB... /usr checking for the location of zlib... /usr checking PHP version... PHP 7.x checking for session includes... /usr/include/php checking for memcache session support... enabled checking how to print strings... print -r checking for a sed that does not truncate output... (cached) /bin/sed checking for fgrep... /bin/grep -F checking for ld used by x86_64-pld-linux-gnux32-gcc... /usr/bin/ld checking if the linker (/usr/bin/ld) is GNU ld... yes checking for BSD- or MS-compatible name lister (nm)... /usr/bin/nm -B checking the name lister (/usr/bin/nm -B) interface... BSD nm checking whether ln -s works... yes checking the maximum length of command line arguments... 1572864 checking how to convert x86_64-pld-linux-gnux32 file names to x86_64-pld-linux-gnux32 format... func_convert_file_noop checking how to convert x86_64-pld-linux-gnux32 file names to toolchain format... func_convert_file_noop checking for /usr/bin/ld option to reload object files... -r checking for x86_64-pld-linux-gnux32-file... no checking for file... file checking for x86_64-pld-linux-gnux32-objdump... no checking for objdump... objdump checking how to recognize dependent libraries... pass_all checking for x86_64-pld-linux-gnux32-dlltool... no checking for dlltool... no checking how to associate runtime and link libraries... print -r -- checking for x86_64-pld-linux-gnux32-ar... no checking for ar... ar checking for archiver @FILE support... @ checking for x86_64-pld-linux-gnux32-strip... no checking for strip... strip checking for x86_64-pld-linux-gnux32-ranlib... no checking for ranlib... ranlib checking for mawk... (cached) gawk checking command to parse /usr/bin/nm -B output from x86_64-pld-linux-gnux32-gcc object... ok checking for sysroot... no checking for a working dd... /bin/dd checking how to truncate binary pipes... /bin/dd bs=4096 count=1 checking for x86_64-pld-linux-gnux32-mt... no checking for mt... no checking if : is a manifest tool... no checking for stdio.h... yes checking for stdlib.h... yes checking for string.h... yes checking for inttypes.h... yes checking for stdint.h... yes checking for strings.h... yes checking for sys/stat.h... yes checking for sys/types.h... yes checking for unistd.h... yes checking for dlfcn.h... yes checking for objdir... .libs checking if x86_64-pld-linux-gnux32-gcc supports -fno-rtti -fno-exceptions... no checking for x86_64-pld-linux-gnux32-gcc option to produce PIC... -fPIC -DPIC checking if x86_64-pld-linux-gnux32-gcc PIC flag -fPIC -DPIC works... yes checking if x86_64-pld-linux-gnux32-gcc static flag -static works... yes checking if x86_64-pld-linux-gnux32-gcc supports -c -o file.o... yes checking if x86_64-pld-linux-gnux32-gcc supports -c -o file.o... (cached) yes checking whether the x86_64-pld-linux-gnux32-gcc linker (/usr/bin/ld -m elf32_x86_64) supports shared libraries... yes checking whether -lc should be explicitly linked in... no checking dynamic linker characteristics... GNU/Linux ld.so checking how to hardcode library paths into programs... immediate checking whether stripping libraries is possible... yes checking if libtool supports shared libraries... yes checking whether to build shared libraries... yes checking whether to build static libraries... no configure: patching config.h.in configure: creating ./config.status config.status: creating config.h config.status: executing libtool commands + /usr/bin/make -Otarget -j9 /bin/sh /tmp/B.b8vhwhz8/BUILD/php82-pecl-memcache-8.0/libtool --mode=compile x86_64-pld-linux-gnux32-gcc -I. -I/tmp/B.b8vhwhz8/BUILD/php82-pecl-memcache-8.0 -I/tmp/B.b8vhwhz8/BUILD/php82-pecl-memcache-8.0/include -I/tmp/B.b8vhwhz8/BUILD/php82-pecl-memcache-8.0/main -I/tmp/B.b8vhwhz8/BUILD/php82-pecl-memcache-8.0 -I/usr/include/php -I/usr/include/php/main -I/usr/include/php/TSRM -I/usr/include/php/Zend -I/usr/include/php/ext -I/usr/include/php/ext/date/lib -DHAVE_CONFIG_H -O2 -fwrapv -pipe -Wformat -Werror=format-security -gdwarf-4 -fno-debug-types-section -fvar-tracking-assignments -g2 -Wp,-D_FORTIFY_SOURCE=2 -fstack-protector-strong --param=ssp-buffer-size=4 -Werror=trampolines -fPIC -mtune=generic -march=x86-64 -gdwarf-4 -fno-debug-types-section -fvar-tracking-assignments -g2 -D_GNU_SOURCE -I/usr/include/php -DZEND_COMPILE_DL_EXT=1 -c /tmp/B.b8vhwhz8/BUILD/php82-pecl-memcache-8.0/src/memcache_standard_hash.c -o src/memcache_standard_hash.lo -MMD -MF src/memcache_standard_hash.dep -MT src/memcache_standard_hash.lo libtool: compile: x86_64-pld-linux-gnux32-gcc -I. -I/tmp/B.b8vhwhz8/BUILD/php82-pecl-memcache-8.0 -I/tmp/B.b8vhwhz8/BUILD/php82-pecl-memcache-8.0/include -I/tmp/B.b8vhwhz8/BUILD/php82-pecl-memcache-8.0/main -I/tmp/B.b8vhwhz8/BUILD/php82-pecl-memcache-8.0 -I/usr/include/php -I/usr/include/php/main -I/usr/include/php/TSRM -I/usr/include/php/Zend -I/usr/include/php/ext -I/usr/include/php/ext/date/lib -DHAVE_CONFIG_H -O2 -fwrapv -pipe -Wformat -Werror=format-security -gdwarf-4 -fno-debug-types-section -fvar-tracking-assignments -g2 -Wp,-D_FORTIFY_SOURCE=2 -fstack-protector-strong --param=ssp-buffer-size=4 -Werror=trampolines -fPIC -mtune=generic -march=x86-64 -gdwarf-4 -fno-debug-types-section -fvar-tracking-assignments -g2 -D_GNU_SOURCE -I/usr/include/php -DZEND_COMPILE_DL_EXT=1 -c /tmp/B.b8vhwhz8/BUILD/php82-pecl-memcache-8.0/src/memcache_standard_hash.c -MMD -MF src/memcache_standard_hash.dep -MT src/memcache_standard_hash.lo -fPIC -DPIC -o src/.libs/memcache_standard_hash.o /bin/sh /tmp/B.b8vhwhz8/BUILD/php82-pecl-memcache-8.0/libtool --mode=compile x86_64-pld-linux-gnux32-gcc -I. -I/tmp/B.b8vhwhz8/BUILD/php82-pecl-memcache-8.0 -I/tmp/B.b8vhwhz8/BUILD/php82-pecl-memcache-8.0/include -I/tmp/B.b8vhwhz8/BUILD/php82-pecl-memcache-8.0/main -I/tmp/B.b8vhwhz8/BUILD/php82-pecl-memcache-8.0 -I/usr/include/php -I/usr/include/php/main -I/usr/include/php/TSRM -I/usr/include/php/Zend -I/usr/include/php/ext -I/usr/include/php/ext/date/lib -DHAVE_CONFIG_H -O2 -fwrapv -pipe -Wformat -Werror=format-security -gdwarf-4 -fno-debug-types-section -fvar-tracking-assignments -g2 -Wp,-D_FORTIFY_SOURCE=2 -fstack-protector-strong --param=ssp-buffer-size=4 -Werror=trampolines -fPIC -mtune=generic -march=x86-64 -gdwarf-4 -fno-debug-types-section -fvar-tracking-assignments -g2 -D_GNU_SOURCE -I/usr/include/php -DZEND_COMPILE_DL_EXT=1 -c /tmp/B.b8vhwhz8/BUILD/php82-pecl-memcache-8.0/src/memcache_queue.c -o src/memcache_queue.lo -MMD -MF src/memcache_queue.dep -MT src/memcache_queue.lo libtool: compile: x86_64-pld-linux-gnux32-gcc -I. -I/tmp/B.b8vhwhz8/BUILD/php82-pecl-memcache-8.0 -I/tmp/B.b8vhwhz8/BUILD/php82-pecl-memcache-8.0/include -I/tmp/B.b8vhwhz8/BUILD/php82-pecl-memcache-8.0/main -I/tmp/B.b8vhwhz8/BUILD/php82-pecl-memcache-8.0 -I/usr/include/php -I/usr/include/php/main -I/usr/include/php/TSRM -I/usr/include/php/Zend -I/usr/include/php/ext -I/usr/include/php/ext/date/lib -DHAVE_CONFIG_H -O2 -fwrapv -pipe -Wformat -Werror=format-security -gdwarf-4 -fno-debug-types-section -fvar-tracking-assignments -g2 -Wp,-D_FORTIFY_SOURCE=2 -fstack-protector-strong --param=ssp-buffer-size=4 -Werror=trampolines -fPIC -mtune=generic -march=x86-64 -gdwarf-4 -fno-debug-types-section -fvar-tracking-assignments -g2 -D_GNU_SOURCE -I/usr/include/php -DZEND_COMPILE_DL_EXT=1 -c /tmp/B.b8vhwhz8/BUILD/php82-pecl-memcache-8.0/src/memcache_queue.c -MMD -MF src/memcache_queue.dep -MT src/memcache_queue.lo -fPIC -DPIC -o src/.libs/memcache_queue.o /bin/sh /tmp/B.b8vhwhz8/BUILD/php82-pecl-memcache-8.0/libtool --mode=compile x86_64-pld-linux-gnux32-gcc -I. -I/tmp/B.b8vhwhz8/BUILD/php82-pecl-memcache-8.0 -I/tmp/B.b8vhwhz8/BUILD/php82-pecl-memcache-8.0/include -I/tmp/B.b8vhwhz8/BUILD/php82-pecl-memcache-8.0/main -I/tmp/B.b8vhwhz8/BUILD/php82-pecl-memcache-8.0 -I/usr/include/php -I/usr/include/php/main -I/usr/include/php/TSRM -I/usr/include/php/Zend -I/usr/include/php/ext -I/usr/include/php/ext/date/lib -DHAVE_CONFIG_H -O2 -fwrapv -pipe -Wformat -Werror=format-security -gdwarf-4 -fno-debug-types-section -fvar-tracking-assignments -g2 -Wp,-D_FORTIFY_SOURCE=2 -fstack-protector-strong --param=ssp-buffer-size=4 -Werror=trampolines -fPIC -mtune=generic -march=x86-64 -gdwarf-4 -fno-debug-types-section -fvar-tracking-assignments -g2 -D_GNU_SOURCE -I/usr/include/php -DZEND_COMPILE_DL_EXT=1 -c /tmp/B.b8vhwhz8/BUILD/php82-pecl-memcache-8.0/src/memcache_consistent_hash.c -o src/memcache_consistent_hash.lo -MMD -MF src/memcache_consistent_hash.dep -MT src/memcache_consistent_hash.lo libtool: compile: x86_64-pld-linux-gnux32-gcc -I. -I/tmp/B.b8vhwhz8/BUILD/php82-pecl-memcache-8.0 -I/tmp/B.b8vhwhz8/BUILD/php82-pecl-memcache-8.0/include -I/tmp/B.b8vhwhz8/BUILD/php82-pecl-memcache-8.0/main -I/tmp/B.b8vhwhz8/BUILD/php82-pecl-memcache-8.0 -I/usr/include/php -I/usr/include/php/main -I/usr/include/php/TSRM -I/usr/include/php/Zend -I/usr/include/php/ext -I/usr/include/php/ext/date/lib -DHAVE_CONFIG_H -O2 -fwrapv -pipe -Wformat -Werror=format-security -gdwarf-4 -fno-debug-types-section -fvar-tracking-assignments -g2 -Wp,-D_FORTIFY_SOURCE=2 -fstack-protector-strong --param=ssp-buffer-size=4 -Werror=trampolines -fPIC -mtune=generic -march=x86-64 -gdwarf-4 -fno-debug-types-section -fvar-tracking-assignments -g2 -D_GNU_SOURCE -I/usr/include/php -DZEND_COMPILE_DL_EXT=1 -c /tmp/B.b8vhwhz8/BUILD/php82-pecl-memcache-8.0/src/memcache_consistent_hash.c -MMD -MF src/memcache_consistent_hash.dep -MT src/memcache_consistent_hash.lo -fPIC -DPIC -o src/.libs/memcache_consistent_hash.o /bin/sh /tmp/B.b8vhwhz8/BUILD/php82-pecl-memcache-8.0/libtool --mode=compile x86_64-pld-linux-gnux32-gcc -I. -I/tmp/B.b8vhwhz8/BUILD/php82-pecl-memcache-8.0 -I/tmp/B.b8vhwhz8/BUILD/php82-pecl-memcache-8.0/include -I/tmp/B.b8vhwhz8/BUILD/php82-pecl-memcache-8.0/main -I/tmp/B.b8vhwhz8/BUILD/php82-pecl-memcache-8.0 -I/usr/include/php -I/usr/include/php/main -I/usr/include/php/TSRM -I/usr/include/php/Zend -I/usr/include/php/ext -I/usr/include/php/ext/date/lib -DHAVE_CONFIG_H -O2 -fwrapv -pipe -Wformat -Werror=format-security -gdwarf-4 -fno-debug-types-section -fvar-tracking-assignments -g2 -Wp,-D_FORTIFY_SOURCE=2 -fstack-protector-strong --param=ssp-buffer-size=4 -Werror=trampolines -fPIC -mtune=generic -march=x86-64 -gdwarf-4 -fno-debug-types-section -fvar-tracking-assignments -g2 -D_GNU_SOURCE -I/usr/include/php -DZEND_COMPILE_DL_EXT=1 -c /tmp/B.b8vhwhz8/BUILD/php82-pecl-memcache-8.0/src/memcache_session.c -o src/memcache_session.lo -MMD -MF src/memcache_session.dep -MT src/memcache_session.lo libtool: compile: x86_64-pld-linux-gnux32-gcc -I. -I/tmp/B.b8vhwhz8/BUILD/php82-pecl-memcache-8.0 -I/tmp/B.b8vhwhz8/BUILD/php82-pecl-memcache-8.0/include -I/tmp/B.b8vhwhz8/BUILD/php82-pecl-memcache-8.0/main -I/tmp/B.b8vhwhz8/BUILD/php82-pecl-memcache-8.0 -I/usr/include/php -I/usr/include/php/main -I/usr/include/php/TSRM -I/usr/include/php/Zend -I/usr/include/php/ext -I/usr/include/php/ext/date/lib -DHAVE_CONFIG_H -O2 -fwrapv -pipe -Wformat -Werror=format-security -gdwarf-4 -fno-debug-types-section -fvar-tracking-assignments -g2 -Wp,-D_FORTIFY_SOURCE=2 -fstack-protector-strong --param=ssp-buffer-size=4 -Werror=trampolines -fPIC -mtune=generic -march=x86-64 -gdwarf-4 -fno-debug-types-section -fvar-tracking-assignments -g2 -D_GNU_SOURCE -I/usr/include/php -DZEND_COMPILE_DL_EXT=1 -c /tmp/B.b8vhwhz8/BUILD/php82-pecl-memcache-8.0/src/memcache_session.c -MMD -MF src/memcache_session.dep -MT src/memcache_session.lo -fPIC -DPIC -o src/.libs/memcache_session.o /bin/sh /tmp/B.b8vhwhz8/BUILD/php82-pecl-memcache-8.0/libtool --mode=compile x86_64-pld-linux-gnux32-gcc -I. -I/tmp/B.b8vhwhz8/BUILD/php82-pecl-memcache-8.0 -I/tmp/B.b8vhwhz8/BUILD/php82-pecl-memcache-8.0/include -I/tmp/B.b8vhwhz8/BUILD/php82-pecl-memcache-8.0/main -I/tmp/B.b8vhwhz8/BUILD/php82-pecl-memcache-8.0 -I/usr/include/php -I/usr/include/php/main -I/usr/include/php/TSRM -I/usr/include/php/Zend -I/usr/include/php/ext -I/usr/include/php/ext/date/lib -DHAVE_CONFIG_H -O2 -fwrapv -pipe -Wformat -Werror=format-security -gdwarf-4 -fno-debug-types-section -fvar-tracking-assignments -g2 -Wp,-D_FORTIFY_SOURCE=2 -fstack-protector-strong --param=ssp-buffer-size=4 -Werror=trampolines -fPIC -mtune=generic -march=x86-64 -gdwarf-4 -fno-debug-types-section -fvar-tracking-assignments -g2 -D_GNU_SOURCE -I/usr/include/php -DZEND_COMPILE_DL_EXT=1 -c /tmp/B.b8vhwhz8/BUILD/php82-pecl-memcache-8.0/src/memcache_binary_protocol.c -o src/memcache_binary_protocol.lo -MMD -MF src/memcache_binary_protocol.dep -MT src/memcache_binary_protocol.lo libtool: compile: x86_64-pld-linux-gnux32-gcc -I. -I/tmp/B.b8vhwhz8/BUILD/php82-pecl-memcache-8.0 -I/tmp/B.b8vhwhz8/BUILD/php82-pecl-memcache-8.0/include -I/tmp/B.b8vhwhz8/BUILD/php82-pecl-memcache-8.0/main -I/tmp/B.b8vhwhz8/BUILD/php82-pecl-memcache-8.0 -I/usr/include/php -I/usr/include/php/main -I/usr/include/php/TSRM -I/usr/include/php/Zend -I/usr/include/php/ext -I/usr/include/php/ext/date/lib -DHAVE_CONFIG_H -O2 -fwrapv -pipe -Wformat -Werror=format-security -gdwarf-4 -fno-debug-types-section -fvar-tracking-assignments -g2 -Wp,-D_FORTIFY_SOURCE=2 -fstack-protector-strong --param=ssp-buffer-size=4 -Werror=trampolines -fPIC -mtune=generic -march=x86-64 -gdwarf-4 -fno-debug-types-section -fvar-tracking-assignments -g2 -D_GNU_SOURCE -I/usr/include/php -DZEND_COMPILE_DL_EXT=1 -c /tmp/B.b8vhwhz8/BUILD/php82-pecl-memcache-8.0/src/memcache_binary_protocol.c -MMD -MF src/memcache_binary_protocol.dep -MT src/memcache_binary_protocol.lo -fPIC -DPIC -o src/.libs/memcache_binary_protocol.o /bin/sh /tmp/B.b8vhwhz8/BUILD/php82-pecl-memcache-8.0/libtool --mode=compile x86_64-pld-linux-gnux32-gcc -I. -I/tmp/B.b8vhwhz8/BUILD/php82-pecl-memcache-8.0 -I/tmp/B.b8vhwhz8/BUILD/php82-pecl-memcache-8.0/include -I/tmp/B.b8vhwhz8/BUILD/php82-pecl-memcache-8.0/main -I/tmp/B.b8vhwhz8/BUILD/php82-pecl-memcache-8.0 -I/usr/include/php -I/usr/include/php/main -I/usr/include/php/TSRM -I/usr/include/php/Zend -I/usr/include/php/ext -I/usr/include/php/ext/date/lib -DHAVE_CONFIG_H -O2 -fwrapv -pipe -Wformat -Werror=format-security -gdwarf-4 -fno-debug-types-section -fvar-tracking-assignments -g2 -Wp,-D_FORTIFY_SOURCE=2 -fstack-protector-strong --param=ssp-buffer-size=4 -Werror=trampolines -fPIC -mtune=generic -march=x86-64 -gdwarf-4 -fno-debug-types-section -fvar-tracking-assignments -g2 -D_GNU_SOURCE -I/usr/include/php -DZEND_COMPILE_DL_EXT=1 -c /tmp/B.b8vhwhz8/BUILD/php82-pecl-memcache-8.0/src/memcache_ascii_protocol.c -o src/memcache_ascii_protocol.lo -MMD -MF src/memcache_ascii_protocol.dep -MT src/memcache_ascii_protocol.lo libtool: compile: x86_64-pld-linux-gnux32-gcc -I. -I/tmp/B.b8vhwhz8/BUILD/php82-pecl-memcache-8.0 -I/tmp/B.b8vhwhz8/BUILD/php82-pecl-memcache-8.0/include -I/tmp/B.b8vhwhz8/BUILD/php82-pecl-memcache-8.0/main -I/tmp/B.b8vhwhz8/BUILD/php82-pecl-memcache-8.0 -I/usr/include/php -I/usr/include/php/main -I/usr/include/php/TSRM -I/usr/include/php/Zend -I/usr/include/php/ext -I/usr/include/php/ext/date/lib -DHAVE_CONFIG_H -O2 -fwrapv -pipe -Wformat -Werror=format-security -gdwarf-4 -fno-debug-types-section -fvar-tracking-assignments -g2 -Wp,-D_FORTIFY_SOURCE=2 -fstack-protector-strong --param=ssp-buffer-size=4 -Werror=trampolines -fPIC -mtune=generic -march=x86-64 -gdwarf-4 -fno-debug-types-section -fvar-tracking-assignments -g2 -D_GNU_SOURCE -I/usr/include/php -DZEND_COMPILE_DL_EXT=1 -c /tmp/B.b8vhwhz8/BUILD/php82-pecl-memcache-8.0/src/memcache_ascii_protocol.c -MMD -MF src/memcache_ascii_protocol.dep -MT src/memcache_ascii_protocol.lo -fPIC -DPIC -o src/.libs/memcache_ascii_protocol.o /bin/sh /tmp/B.b8vhwhz8/BUILD/php82-pecl-memcache-8.0/libtool --mode=compile x86_64-pld-linux-gnux32-gcc -I. -I/tmp/B.b8vhwhz8/BUILD/php82-pecl-memcache-8.0 -I/tmp/B.b8vhwhz8/BUILD/php82-pecl-memcache-8.0/include -I/tmp/B.b8vhwhz8/BUILD/php82-pecl-memcache-8.0/main -I/tmp/B.b8vhwhz8/BUILD/php82-pecl-memcache-8.0 -I/usr/include/php -I/usr/include/php/main -I/usr/include/php/TSRM -I/usr/include/php/Zend -I/usr/include/php/ext -I/usr/include/php/ext/date/lib -DHAVE_CONFIG_H -O2 -fwrapv -pipe -Wformat -Werror=format-security -gdwarf-4 -fno-debug-types-section -fvar-tracking-assignments -g2 -Wp,-D_FORTIFY_SOURCE=2 -fstack-protector-strong --param=ssp-buffer-size=4 -Werror=trampolines -fPIC -mtune=generic -march=x86-64 -gdwarf-4 -fno-debug-types-section -fvar-tracking-assignments -g2 -D_GNU_SOURCE -I/usr/include/php -DZEND_COMPILE_DL_EXT=1 -c /tmp/B.b8vhwhz8/BUILD/php82-pecl-memcache-8.0/src/memcache_pool.c -o src/memcache_pool.lo -MMD -MF src/memcache_pool.dep -MT src/memcache_pool.lo libtool: compile: x86_64-pld-linux-gnux32-gcc -I. -I/tmp/B.b8vhwhz8/BUILD/php82-pecl-memcache-8.0 -I/tmp/B.b8vhwhz8/BUILD/php82-pecl-memcache-8.0/include -I/tmp/B.b8vhwhz8/BUILD/php82-pecl-memcache-8.0/main -I/tmp/B.b8vhwhz8/BUILD/php82-pecl-memcache-8.0 -I/usr/include/php -I/usr/include/php/main -I/usr/include/php/TSRM -I/usr/include/php/Zend -I/usr/include/php/ext -I/usr/include/php/ext/date/lib -DHAVE_CONFIG_H -O2 -fwrapv -pipe -Wformat -Werror=format-security -gdwarf-4 -fno-debug-types-section -fvar-tracking-assignments -g2 -Wp,-D_FORTIFY_SOURCE=2 -fstack-protector-strong --param=ssp-buffer-size=4 -Werror=trampolines -fPIC -mtune=generic -march=x86-64 -gdwarf-4 -fno-debug-types-section -fvar-tracking-assignments -g2 -D_GNU_SOURCE -I/usr/include/php -DZEND_COMPILE_DL_EXT=1 -c /tmp/B.b8vhwhz8/BUILD/php82-pecl-memcache-8.0/src/memcache_pool.c -MMD -MF src/memcache_pool.dep -MT src/memcache_pool.lo -fPIC -DPIC -o src/.libs/memcache_pool.o /bin/sh /tmp/B.b8vhwhz8/BUILD/php82-pecl-memcache-8.0/libtool --mode=compile x86_64-pld-linux-gnux32-gcc -I. -I/tmp/B.b8vhwhz8/BUILD/php82-pecl-memcache-8.0 -I/tmp/B.b8vhwhz8/BUILD/php82-pecl-memcache-8.0/include -I/tmp/B.b8vhwhz8/BUILD/php82-pecl-memcache-8.0/main -I/tmp/B.b8vhwhz8/BUILD/php82-pecl-memcache-8.0 -I/usr/include/php -I/usr/include/php/main -I/usr/include/php/TSRM -I/usr/include/php/Zend -I/usr/include/php/ext -I/usr/include/php/ext/date/lib -DHAVE_CONFIG_H -O2 -fwrapv -pipe -Wformat -Werror=format-security -gdwarf-4 -fno-debug-types-section -fvar-tracking-assignments -g2 -Wp,-D_FORTIFY_SOURCE=2 -fstack-protector-strong --param=ssp-buffer-size=4 -Werror=trampolines -fPIC -mtune=generic -march=x86-64 -gdwarf-4 -fno-debug-types-section -fvar-tracking-assignments -g2 -D_GNU_SOURCE -I/usr/include/php -DZEND_COMPILE_DL_EXT=1 -c /tmp/B.b8vhwhz8/BUILD/php82-pecl-memcache-8.0/src/memcache.c -o src/memcache.lo -MMD -MF src/memcache.dep -MT src/memcache.lo libtool: compile: x86_64-pld-linux-gnux32-gcc -I. -I/tmp/B.b8vhwhz8/BUILD/php82-pecl-memcache-8.0 -I/tmp/B.b8vhwhz8/BUILD/php82-pecl-memcache-8.0/include -I/tmp/B.b8vhwhz8/BUILD/php82-pecl-memcache-8.0/main -I/tmp/B.b8vhwhz8/BUILD/php82-pecl-memcache-8.0 -I/usr/include/php -I/usr/include/php/main -I/usr/include/php/TSRM -I/usr/include/php/Zend -I/usr/include/php/ext -I/usr/include/php/ext/date/lib -DHAVE_CONFIG_H -O2 -fwrapv -pipe -Wformat -Werror=format-security -gdwarf-4 -fno-debug-types-section -fvar-tracking-assignments -g2 -Wp,-D_FORTIFY_SOURCE=2 -fstack-protector-strong --param=ssp-buffer-size=4 -Werror=trampolines -fPIC -mtune=generic -march=x86-64 -gdwarf-4 -fno-debug-types-section -fvar-tracking-assignments -g2 -D_GNU_SOURCE -I/usr/include/php -DZEND_COMPILE_DL_EXT=1 -c /tmp/B.b8vhwhz8/BUILD/php82-pecl-memcache-8.0/src/memcache.c -MMD -MF src/memcache.dep -MT src/memcache.lo -fPIC -DPIC -o src/.libs/memcache.o /bin/sh /tmp/B.b8vhwhz8/BUILD/php82-pecl-memcache-8.0/libtool --mode=link x86_64-pld-linux-gnux32-gcc -shared -I/tmp/B.b8vhwhz8/BUILD/php82-pecl-memcache-8.0/include -I/tmp/B.b8vhwhz8/BUILD/php82-pecl-memcache-8.0/main -I/tmp/B.b8vhwhz8/BUILD/php82-pecl-memcache-8.0 -I/usr/include/php -I/usr/include/php/main -I/usr/include/php/TSRM -I/usr/include/php/Zend -I/usr/include/php/ext -I/usr/include/php/ext/date/lib -DHAVE_CONFIG_H -O2 -fwrapv -pipe -Wformat -Werror=format-security -gdwarf-4 -fno-debug-types-section -fvar-tracking-assignments -g2 -Wp,-D_FORTIFY_SOURCE=2 -fstack-protector-strong --param=ssp-buffer-size=4 -Werror=trampolines -fPIC -mtune=generic -march=x86-64 -gdwarf-4 -fno-debug-types-section -fvar-tracking-assignments -g2 -D_GNU_SOURCE -Wl,--as-needed -Wl,--no-copy-dt-needed-entries -Wl,-z,relro -Wl,-z,combreloc -o memcache.la -export-dynamic -avoid-version -prefer-pic -module -rpath /tmp/B.b8vhwhz8/BUILD/php82-pecl-memcache-8.0/modules src/memcache.lo src/memcache_pool.lo src/memcache_queue.lo src/memcache_ascii_protocol.lo src/memcache_binary_protocol.lo src/memcache_standard_hash.lo src/memcache_consistent_hash.lo src/memcache_session.lo -lz libtool: link: x86_64-pld-linux-gnux32-gcc -shared -fPIC -DPIC -O2 -gdwarf-4 -g2 -fstack-protector-strong -mtune=generic -march=x86-64 -gdwarf-4 -g2 -Wl,--as-needed -Wl,--no-copy-dt-needed-entries -Wl,-z -Wl,relro -Wl,-z -Wl,combreloc src/.libs/memcache.o src/.libs/memcache_pool.o src/.libs/memcache_queue.o src/.libs/memcache_ascii_protocol.o src/.libs/memcache_binary_protocol.o src/.libs/memcache_standard_hash.o src/.libs/memcache_consistent_hash.o src/.libs/memcache_session.o -lz -Wl,-soname -Wl,memcache.so -o .libs/memcache.so libtool: link: ( cd ".libs" && rm -f "memcache.la" && ln -s "../memcache.la" "memcache.la" ) /bin/sh /tmp/B.b8vhwhz8/BUILD/php82-pecl-memcache-8.0/libtool --mode=install cp ./memcache.la /tmp/B.b8vhwhz8/BUILD/php82-pecl-memcache-8.0/modules libtool: install: cp ./.libs/memcache.so /tmp/B.b8vhwhz8/BUILD/php82-pecl-memcache-8.0/modules/memcache.so libtool: install: cp ./.libs/memcache.lai /tmp/B.b8vhwhz8/BUILD/php82-pecl-memcache-8.0/modules/memcache.la libtool: finish: PATH="/home/users/builder/GNUstep/Tools:/bin:/usr/bin:/usr/local/bin:/sbin" ldconfig -n /tmp/B.b8vhwhz8/BUILD/php82-pecl-memcache-8.0/modules ---------------------------------------------------------------------- Libraries have been installed in: /tmp/B.b8vhwhz8/BUILD/php82-pecl-memcache-8.0/modules If you ever happen to want to link against installed libraries in a given directory, LIBDIR, you must either use libtool, and specify the full pathname of the library, or use the '-LLIBDIR' flag during linking and do at least one of the following: - add LIBDIR to the 'LD_LIBRARY_PATH' environment variable during execution - add LIBDIR to the 'LD_RUN_PATH' environment variable during linking - use the '-Wl,-rpath -Wl,LIBDIR' linker flag - have your system administrator add LIBDIR to '/etc/ld.so.conf' See any operating system documentation about shared libraries for more information, such as the ld(1) and ld.so(8) manual pages. ---------------------------------------------------------------------- Build complete. Don't forget to run 'make test'. + >modules.log + /usr/bin/php82 -n -q -d 'extension_dir=modules' -d 'extension=/usr/libx32/php82/simplexml.so' -d 'extension=/usr/libx32/php82/session.so' -d 'extension=memcache.so' -m + grep memcache modules.log memcache + domainsocket=/tmp/B.b8vhwhz8/BUILD/php82-pecl-memcache-8.0/memcached.sock + /usr/sbin/memcached -p 11211 -U 11211 -d -P /tmp/B.b8vhwhz8/BUILD/php82-pecl-memcache-8.0/memcached.pid + /usr/sbin/memcached -s /tmp/B.b8vhwhz8/BUILD/php82-pecl-memcache-8.0/memcached.sock -d -P /tmp/B.b8vhwhz8/BUILD/php82-pecl-memcache-8.0/memcached-udp.pid + trap 'kill $(cat memcached.pid memcached-udp.pid)' EXIT INT + ./run-tests.sh --show-diff Build complete. Don't forget to run 'make test'. ===================================================================== PHP : /usr/bin/php82 PHP_SAPI : cli PHP_VERSION : 8.2.0RC2 ZEND_VERSION: 4.2.0RC2 PHP_OS : Linux - Linux naiad 5.16.15-1 #1 SMP PREEMPT Wed Mar 16 19:42:05 CET 2022 x86_64 INI actual : /tmp/B.b8vhwhz8/BUILD/php82-pecl-memcache-8.0/tmp-php.ini More .INIs : CWD : /tmp/B.b8vhwhz8/BUILD/php82-pecl-memcache-8.0 Extra dirs : VALGRIND : Not used ===================================================================== TIME START 2022-09-29 16:57:02 ===================================================================== TEST 1/82 [tests/001.phpt] BORK Deprecated: Creation of dynamic property Memcache::$connection is deprecated in /tmp/B.b8vhwhz8/BUILD/php82-pecl-memcache-8.0/tests/connect.inc on line 70 [tests/001.phpt] reason: invalid output from SKIPIF TEST 2/82 [tests/001b.phpt] SKIP memcache_set() function [tests/001b.phpt] reason: php prior to 8 only TEST 3/82 [tests/002.phpt] BORK Deprecated: Creation of dynamic property Memcache::$connection is deprecated in /tmp/B.b8vhwhz8/BUILD/php82-pecl-memcache-8.0/tests/connect.inc on line 70 [tests/002.phpt] reason: invalid output from SKIPIF TEST 4/82 [tests/003.phpt] BORK Deprecated: Creation of dynamic property Memcache::$connection is deprecated in /tmp/B.b8vhwhz8/BUILD/php82-pecl-memcache-8.0/tests/connect.inc on line 70 [tests/003.phpt] reason: invalid output from SKIPIF TEST 5/82 [tests/004.phpt] BORK Deprecated: Creation of dynamic property Memcache::$connection is deprecated in /tmp/B.b8vhwhz8/BUILD/php82-pecl-memcache-8.0/tests/connect.inc on line 70 [tests/004.phpt] reason: invalid output from SKIPIF TEST 6/82 [tests/005.phpt] BORK Deprecated: Creation of dynamic property Memcache::$connection is deprecated in /tmp/B.b8vhwhz8/BUILD/php82-pecl-memcache-8.0/tests/connect.inc on line 70 [tests/005.phpt] reason: invalid output from SKIPIF TEST 7/82 [tests/006.phpt] BORK Deprecated: Creation of dynamic property Memcache::$connection is deprecated in /tmp/B.b8vhwhz8/BUILD/php82-pecl-memcache-8.0/tests/connect.inc on line 70 [tests/006.phpt] reason: invalid output from SKIPIF TEST 8/82 [tests/007.phpt] BORK Deprecated: Creation of dynamic property Memcache::$connection is deprecated in /tmp/B.b8vhwhz8/BUILD/php82-pecl-memcache-8.0/tests/connect.inc on line 70 [tests/007.phpt] reason: invalid output from SKIPIF TEST 9/82 [tests/008.phpt] BORK Deprecated: Creation of dynamic property Memcache::$connection is deprecated in /tmp/B.b8vhwhz8/BUILD/php82-pecl-memcache-8.0/tests/connect.inc on line 70 [tests/008.phpt] reason: invalid output from SKIPIF TEST 10/82 [tests/009.phpt] BORK Deprecated: Creation of dynamic property Memcache::$connection is deprecated in /tmp/B.b8vhwhz8/BUILD/php82-pecl-memcache-8.0/tests/connect.inc on line 70 [tests/009.phpt] reason: invalid output from SKIPIF TEST 11/82 [tests/010.phpt] BORK Deprecated: Creation of dynamic property Memcache::$connection is deprecated in /tmp/B.b8vhwhz8/BUILD/php82-pecl-memcache-8.0/tests/connect.inc on line 70 [tests/010.phpt] reason: invalid output from SKIPIF TEST 12/82 [tests/011.phpt] BORK Deprecated: Creation of dynamic property Memcache::$connection is deprecated in /tmp/B.b8vhwhz8/BUILD/php82-pecl-memcache-8.0/tests/connect.inc on line 70 [tests/011.phpt] reason: invalid output from SKIPIF TEST 13/82 [tests/012.phpt] BORK Deprecated: Creation of dynamic property Memcache::$connection is deprecated in /tmp/B.b8vhwhz8/BUILD/php82-pecl-memcache-8.0/tests/connect.inc on line 70 [tests/012.phpt] reason: invalid output from SKIPIF TEST 14/82 [tests/013.phpt] BORK Deprecated: Creation of dynamic property Memcache::$connection is deprecated in /tmp/B.b8vhwhz8/BUILD/php82-pecl-memcache-8.0/tests/connect.inc on line 70 [tests/013.phpt] reason: invalid output from SKIPIF TEST 15/82 [tests/014.phpt] BORK Deprecated: Creation of dynamic property Memcache::$connection is deprecated in /tmp/B.b8vhwhz8/BUILD/php82-pecl-memcache-8.0/tests/connect.inc on line 70 [tests/014.phpt] reason: invalid output from SKIPIF TEST 16/82 [tests/015.phpt] BORK Deprecated: Creation of dynamic property Memcache::$connection is deprecated in /tmp/B.b8vhwhz8/BUILD/php82-pecl-memcache-8.0/tests/connect.inc on line 70 [tests/015.phpt] reason: invalid output from SKIPIF TEST 17/82 [tests/016.phpt] BORK Deprecated: Creation of dynamic property Memcache::$connection is deprecated in /tmp/B.b8vhwhz8/BUILD/php82-pecl-memcache-8.0/tests/connect.inc on line 70 [tests/016.phpt] reason: invalid output from SKIPIF TEST 18/82 [tests/017.phpt] BORK Deprecated: Creation of dynamic property Memcache::$connection is deprecated in /tmp/B.b8vhwhz8/BUILD/php82-pecl-memcache-8.0/tests/connect.inc on line 70 [tests/017.phpt] reason: invalid output from SKIPIF TEST 19/82 [tests/018.phpt] BORK Deprecated: Creation of dynamic property Memcache::$connection is deprecated in /tmp/B.b8vhwhz8/BUILD/php82-pecl-memcache-8.0/tests/connect.inc on line 70 [tests/018.phpt] reason: invalid output from SKIPIF TEST 20/82 [tests/019.phpt] BORK Deprecated: Creation of dynamic property Memcache::$connection is deprecated in /tmp/B.b8vhwhz8/BUILD/php82-pecl-memcache-8.0/tests/connect.inc on line 70 [tests/019.phpt] reason: invalid output from SKIPIF TEST 21/82 [tests/019a.phpt] BORK Deprecated: Creation of dynamic property Memcache::$connection is deprecated in /tmp/B.b8vhwhz8/BUILD/php82-pecl-memcache-8.0/tests/connect.inc on line 70 [tests/019a.phpt] reason: invalid output from SKIPIF TEST 22/82 [tests/019b.phpt] SKIP memcache_add_server() [tests/019b.phpt] reason: php prior to 8 only TEST 23/82 [tests/020.phpt] BORK Deprecated: Creation of dynamic property Memcache::$connection is deprecated in /tmp/B.b8vhwhz8/BUILD/php82-pecl-memcache-8.0/tests/connect.inc on line 70 [tests/020.phpt] reason: invalid output from SKIPIF TEST 24/82 [tests/021.phpt] BORK Deprecated: Creation of dynamic property Memcache::$connection is deprecated in /tmp/B.b8vhwhz8/BUILD/php82-pecl-memcache-8.0/tests/connect.inc on line 70 [tests/021.phpt] reason: invalid output from SKIPIF TEST 25/82 [tests/022.phpt] BORK Deprecated: Creation of dynamic property Memcache::$connection is deprecated in /tmp/B.b8vhwhz8/BUILD/php82-pecl-memcache-8.0/tests/connect.inc on line 70 [tests/022.phpt] reason: invalid output from SKIPIF TEST 26/82 [tests/022a.phpt] BORK Deprecated: Creation of dynamic property Memcache::$connection is deprecated in /tmp/B.b8vhwhz8/BUILD/php82-pecl-memcache-8.0/tests/connect.inc on line 70 [tests/022a.phpt] reason: invalid output from SKIPIF TEST 27/82 [tests/022b.phpt] SKIP memcache_get_extended_stats() [tests/022b.phpt] reason: php prior to 8 only TEST 28/82 [tests/023.phpt] BORK Deprecated: Creation of dynamic property Memcache::$connection is deprecated in /tmp/B.b8vhwhz8/BUILD/php82-pecl-memcache-8.0/tests/connect.inc on line 70 [tests/023.phpt] reason: invalid output from SKIPIF TEST 29/82 [tests/024.phpt] BORK Deprecated: Creation of dynamic property Memcache::$connection is deprecated in /tmp/B.b8vhwhz8/BUILD/php82-pecl-memcache-8.0/tests/connect.inc on line 70 [tests/024.phpt] reason: invalid output from SKIPIF TEST 30/82 [tests/024a.phpt] BORK Deprecated: Creation of dynamic property Memcache::$connection is deprecated in /tmp/B.b8vhwhz8/BUILD/php82-pecl-memcache-8.0/tests/connect.inc on line 70 [tests/024a.phpt] reason: invalid output from SKIPIF TEST 31/82 [tests/024b.phpt] SKIP memcache_close(), memcache_get() [tests/024b.phpt] reason: php prior to 8 only TEST 32/82 [tests/025.phpt] BORK Deprecated: Creation of dynamic property Memcache::$connection is deprecated in /tmp/B.b8vhwhz8/BUILD/php82-pecl-memcache-8.0/tests/connect.inc on line 70 [tests/025.phpt] reason: invalid output from SKIPIF TEST 33/82 [tests/026.phpt] BORK Deprecated: Creation of dynamic property Memcache::$connection is deprecated in /tmp/B.b8vhwhz8/BUILD/php82-pecl-memcache-8.0/tests/connect.inc on line 70 [tests/026.phpt] reason: invalid output from SKIPIF TEST 34/82 [tests/027.phpt] BORK Deprecated: Creation of dynamic property Memcache::$connection is deprecated in /tmp/B.b8vhwhz8/BUILD/php82-pecl-memcache-8.0/tests/connect.inc on line 70 [tests/027.phpt] reason: invalid output from SKIPIF TEST 35/82 [tests/027a.phpt] BORK Deprecated: Creation of dynamic property Memcache::$connection is deprecated in /tmp/B.b8vhwhz8/BUILD/php82-pecl-memcache-8.0/tests/connect.inc on line 70 [tests/027a.phpt] reason: invalid output from SKIPIF TEST 36/82 [tests/027b.phpt] SKIP memcache_set_compress_threshold() [tests/027b.phpt] reason: php prior to 8 only TEST 37/82 [tests/028.phpt] BORK Deprecated: Creation of dynamic property Memcache::$connection is deprecated in /tmp/B.b8vhwhz8/BUILD/php82-pecl-memcache-8.0/tests/connect.inc on line 70 [tests/028.phpt] reason: invalid output from SKIPIF TEST 38/82 [tests/029.phpt] BORK Deprecated: Creation of dynamic property Memcache::$connection is deprecated in /tmp/B.b8vhwhz8/BUILD/php82-pecl-memcache-8.0/tests/connect.inc on line 70 [tests/029.phpt] reason: invalid output from SKIPIF TEST 39/82 [tests/030.phpt] BORK Deprecated: Creation of dynamic property Memcache::$connection is deprecated in /tmp/B.b8vhwhz8/BUILD/php82-pecl-memcache-8.0/tests/connect.inc on line 70 [tests/030.phpt] reason: invalid output from SKIPIF TEST 40/82 [tests/031.phpt] BORK Deprecated: Creation of dynamic property Memcache::$connection is deprecated in /tmp/B.b8vhwhz8/BUILD/php82-pecl-memcache-8.0/tests/connect.inc on line 70 [tests/031.phpt] reason: invalid output from SKIPIF TEST 41/82 [tests/032.phpt] BORK Deprecated: Creation of dynamic property Memcache::$connection is deprecated in /tmp/B.b8vhwhz8/BUILD/php82-pecl-memcache-8.0/tests/connect.inc on line 70 [tests/032.phpt] reason: invalid output from SKIPIF TEST 42/82 [tests/033.phpt] BORK Deprecated: Creation of dynamic property Memcache::$connection is deprecated in /tmp/B.b8vhwhz8/BUILD/php82-pecl-memcache-8.0/tests/connect.inc on line 70 [tests/033.phpt] reason: invalid output from SKIPIF TEST 43/82 [tests/034.phpt] BORK Deprecated: Creation of dynamic property Memcache::$connection is deprecated in /tmp/B.b8vhwhz8/BUILD/php82-pecl-memcache-8.0/tests/connect.inc on line 70 [tests/034.phpt] reason: invalid output from SKIPIF TEST 44/82 [tests/035.phpt] BORK Deprecated: Creation of dynamic property Memcache::$connection is deprecated in /tmp/B.b8vhwhz8/BUILD/php82-pecl-memcache-8.0/tests/connect.inc on line 70 [tests/035.phpt] reason: invalid output from SKIPIF TEST 45/82 [tests/036.phpt] BORK Deprecated: Creation of dynamic property Memcache::$connection is deprecated in /tmp/B.b8vhwhz8/BUILD/php82-pecl-memcache-8.0/tests/connect.inc on line 70 [tests/036.phpt] reason: invalid output from SKIPIF TEST 46/82 [tests/036b.phpt] BORK Deprecated: Creation of dynamic property Memcache::$connection is deprecated in /tmp/B.b8vhwhz8/BUILD/php82-pecl-memcache-8.0/tests/connect.inc on line 70 [tests/036b.phpt] reason: invalid output from SKIPIF TEST 47/82 [tests/037.phpt] BORK Deprecated: Creation of dynamic property Memcache::$connection is deprecated in /tmp/B.b8vhwhz8/BUILD/php82-pecl-memcache-8.0/tests/connect.inc on line 70 [tests/037.phpt] reason: invalid output from SKIPIF TEST 48/82 [tests/038.phpt] SKIP memcache->get() over UDP [tests/038.phpt] reason: known bug TEST 49/82 [tests/039.phpt] BORK Deprecated: Creation of dynamic property Memcache::$connection is deprecated in /tmp/B.b8vhwhz8/BUILD/php82-pecl-memcache-8.0/tests/connect.inc on line 70 skip UDP is not enabled in connect.inc [tests/039.phpt] reason: invalid output from SKIPIF TEST 50/82 [tests/040.phpt] BORK Deprecated: Creation of dynamic property Memcache::$connection is deprecated in /tmp/B.b8vhwhz8/BUILD/php82-pecl-memcache-8.0/tests/connect.inc on line 70 [tests/040.phpt] reason: invalid output from SKIPIF TEST 51/82 [tests/041.phpt] BORK Deprecated: Creation of dynamic property Memcache::$connection is deprecated in /tmp/B.b8vhwhz8/BUILD/php82-pecl-memcache-8.0/tests/connect.inc on line 70 [tests/041.phpt] reason: invalid output from SKIPIF TEST 52/82 [tests/042.phpt] BORK Deprecated: Creation of dynamic property Memcache::$connection is deprecated in /tmp/B.b8vhwhz8/BUILD/php82-pecl-memcache-8.0/tests/connect.inc on line 70 [tests/042.phpt] reason: invalid output from SKIPIF TEST 53/82 [tests/043.phpt] BORK Deprecated: Creation of dynamic property Memcache::$connection is deprecated in /tmp/B.b8vhwhz8/BUILD/php82-pecl-memcache-8.0/tests/connect.inc on line 70 [tests/043.phpt] reason: invalid output from SKIPIF TEST 54/82 [tests/044.phpt] BORK Deprecated: Creation of dynamic property Memcache::$connection is deprecated in /tmp/B.b8vhwhz8/BUILD/php82-pecl-memcache-8.0/tests/connect.inc on line 70 [tests/044.phpt] reason: invalid output from SKIPIF TEST 55/82 [tests/045.phpt] BORK Deprecated: Creation of dynamic property Memcache::$connection is deprecated in /tmp/B.b8vhwhz8/BUILD/php82-pecl-memcache-8.0/tests/connect.inc on line 70 [tests/045.phpt] reason: invalid output from SKIPIF TEST 56/82 [tests/046.phpt] BORK Deprecated: Creation of dynamic property Memcache::$connection is deprecated in /tmp/B.b8vhwhz8/BUILD/php82-pecl-memcache-8.0/tests/connect.inc on line 70 [tests/046.phpt] reason: invalid output from SKIPIF TEST 57/82 [tests/047.phpt] BORK Deprecated: Creation of dynamic property Memcache::$connection is deprecated in /tmp/B.b8vhwhz8/BUILD/php82-pecl-memcache-8.0/tests/connect.inc on line 70 [tests/047.phpt] reason: invalid output from SKIPIF TEST 58/82 [tests/048.phpt] BORK Deprecated: Creation of dynamic property Memcache::$connection is deprecated in /tmp/B.b8vhwhz8/BUILD/php82-pecl-memcache-8.0/tests/connect.inc on line 70 [tests/048.phpt] reason: invalid output from SKIPIF TEST 59/82 [tests/049.phpt] BORK Deprecated: Creation of dynamic property Memcache::$connection is deprecated in /tmp/B.b8vhwhz8/BUILD/php82-pecl-memcache-8.0/tests/connect.inc on line 70 [tests/049.phpt] reason: invalid output from SKIPIF TEST 60/82 [tests/050.phpt] BORK Deprecated: Creation of dynamic property Memcache::$connection is deprecated in /tmp/B.b8vhwhz8/BUILD/php82-pecl-memcache-8.0/tests/connect.inc on line 70 [tests/050.phpt] reason: invalid output from SKIPIF TEST 61/82 [tests/051.phpt] BORK Deprecated: Creation of dynamic property Memcache::$connection is deprecated in /tmp/B.b8vhwhz8/BUILD/php82-pecl-memcache-8.0/tests/connect.inc on line 70 [tests/051.phpt] reason: invalid output from SKIPIF TEST 62/82 [tests/052.phpt] BORK Deprecated: Creation of dynamic property Memcache::$connection is deprecated in /tmp/B.b8vhwhz8/BUILD/php82-pecl-memcache-8.0/tests/connect.inc on line 70 [tests/052.phpt] reason: invalid output from SKIPIF TEST 63/82 [tests/053.phpt] BORK Deprecated: Creation of dynamic property Memcache::$connection is deprecated in /tmp/B.b8vhwhz8/BUILD/php82-pecl-memcache-8.0/tests/connect.inc on line 70 [tests/053.phpt] reason: invalid output from SKIPIF TEST 64/82 [tests/054.phpt] BORK Deprecated: Creation of dynamic property Memcache::$connection is deprecated in /tmp/B.b8vhwhz8/BUILD/php82-pecl-memcache-8.0/tests/connect.inc on line 70 [tests/054.phpt] reason: invalid output from SKIPIF TEST 65/82 [tests/055.phpt] BORK Deprecated: Creation of dynamic property Memcache::$connection is deprecated in /tmp/B.b8vhwhz8/BUILD/php82-pecl-memcache-8.0/tests/connect.inc on line 70 [tests/055.phpt] reason: invalid output from SKIPIF TEST 66/82 [tests/056.phpt] BORK Deprecated: Creation of dynamic property Memcache::$connection is deprecated in /tmp/B.b8vhwhz8/BUILD/php82-pecl-memcache-8.0/tests/connect.inc on line 70 [tests/056.phpt] reason: invalid output from SKIPIF TEST 67/82 [tests/057.phpt] BORK Deprecated: Creation of dynamic property Memcache::$connection is deprecated in /tmp/B.b8vhwhz8/BUILD/php82-pecl-memcache-8.0/tests/connect.inc on line 70 skip not compiled with pcntl_fork() support [tests/057.phpt] reason: invalid output from SKIPIF TEST 68/82 [tests/058.phpt] BORK Deprecated: Creation of dynamic property Memcache::$connection is deprecated in /tmp/B.b8vhwhz8/BUILD/php82-pecl-memcache-8.0/tests/connect.inc on line 70 [tests/058.phpt] reason: invalid output from SKIPIF TEST 69/82 [tests/100.phpt] BORK Deprecated: Creation of dynamic property Memcache::$connection is deprecated in /tmp/B.b8vhwhz8/BUILD/php82-pecl-memcache-8.0/tests/connect.inc on line 70 [tests/100.phpt] reason: invalid output from SKIPIF TEST 70/82 [tests/100a.phpt] BORK Deprecated: Creation of dynamic property Memcache::$connection is deprecated in /tmp/B.b8vhwhz8/BUILD/php82-pecl-memcache-8.0/tests/connect.inc on line 70 [tests/100a.phpt] reason: invalid output from SKIPIF TEST 71/82 [tests/100c.phpt] BORK Deprecated: Creation of dynamic property Memcache::$connection is deprecated in /tmp/B.b8vhwhz8/BUILD/php82-pecl-memcache-8.0/tests/connect.inc on line 70 [tests/100c.phpt] reason: invalid output from SKIPIF TEST 72/82 [tests/bug73539.phpt] BORK Deprecated: Creation of dynamic property Memcache::$connection is deprecated in /tmp/B.b8vhwhz8/BUILD/php82-pecl-memcache-8.0/tests/connect.inc on line 70 [tests/bug73539.phpt] reason: invalid output from SKIPIF TEST 73/82 [tests/githubbug13.phpt] BORK Deprecated: Creation of dynamic property Memcache::$connection is deprecated in /tmp/B.b8vhwhz8/BUILD/php82-pecl-memcache-8.0/tests/connect.inc on line 70 [tests/githubbug13.phpt] reason: invalid output from SKIPIF TEST 74/82 [tests/githubbug53.phpt] BORK Deprecated: Creation of dynamic property Memcache::$connection is deprecated in /tmp/B.b8vhwhz8/BUILD/php82-pecl-memcache-8.0/tests/connect.inc on line 70 [tests/githubbug53.phpt] reason: invalid output from SKIPIF TEST 75/82 [tests/pecl11221.phpt] BORK Deprecated: Creation of dynamic property Memcache::$connection is deprecated in /tmp/B.b8vhwhz8/BUILD/php82-pecl-memcache-8.0/tests/connect.inc on line 70 [tests/pecl11221.phpt] reason: invalid output from SKIPIF TEST 76/82 [tests/pecl16442.phpt] BORK Deprecated: Creation of dynamic property Memcache::$connection is deprecated in /tmp/B.b8vhwhz8/BUILD/php82-pecl-memcache-8.0/tests/connect.inc on line 70 [tests/pecl16442.phpt] reason: invalid output from SKIPIF TEST 77/82 [tests/pecl16536.phpt] BORK Deprecated: Creation of dynamic property Memcache::$connection is deprecated in /tmp/B.b8vhwhz8/BUILD/php82-pecl-memcache-8.0/tests/connect.inc on line 70 [tests/pecl16536.phpt] reason: invalid output from SKIPIF TEST 78/82 [tests/pecl17518.phpt] BORK Deprecated: Creation of dynamic property Memcache::$connection is deprecated in /tmp/B.b8vhwhz8/BUILD/php82-pecl-memcache-8.0/tests/connect.inc on line 70 [tests/pecl17518.phpt] reason: invalid output from SKIPIF TEST 79/82 [tests/pecl17566.phpt] BORK Deprecated: Creation of dynamic property Memcache::$connection is deprecated in /tmp/B.b8vhwhz8/BUILD/php82-pecl-memcache-8.0/tests/connect.inc on line 70 [tests/pecl17566.phpt] reason: invalid output from SKIPIF TEST 80/82 [tests/pecl63142.phpt] BORK Deprecated: Creation of dynamic property Memcache::$connection is deprecated in /tmp/B.b8vhwhz8/BUILD/php82-pecl-memcache-8.0/tests/connect.inc on line 70 [tests/pecl63142.phpt] reason: invalid output from SKIPIF TEST 81/82 [tests/pecl63272.phpt] BORK Deprecated: Creation of dynamic property Memcache::$connection is deprecated in /tmp/B.b8vhwhz8/BUILD/php82-pecl-memcache-8.0/tests/connect.inc on line 70 [tests/pecl63272.phpt] reason: invalid output from SKIPIF TEST 82/82 [tests/pecl77900.phpt] BORK Deprecated: Creation of dynamic property Memcache::$connection is deprecated in /tmp/B.b8vhwhz8/BUILD/php82-pecl-memcache-8.0/tests/connect.inc on line 70 [tests/pecl77900.phpt] reason: invalid output from SKIPIF ===================================================================== TIME END 2022-09-29 16:57:03 ===================================================================== TEST RESULT SUMMARY --------------------------------------------------------------------- Exts skipped : 0 Exts tested : 13 --------------------------------------------------------------------- Number of tests : 82 0 Tests borked : 76 ( 92.7%) -------- Tests skipped : 6 ( 7.3%) -------- Tests warned : 0 ( 0.0%) ( 0.0%) Tests failed : 0 ( 0.0%) ( 0.0%) Tests passed : 0 ( 0.0%) ( 0.0%) --------------------------------------------------------------------- Time taken : 1 seconds ===================================================================== ===================================================================== BORKED TEST SUMMARY --------------------------------------------------------------------- Deprecated: Creation of dynamic property Memcache::$connection is deprecated in /tmp/B.b8vhwhz8/BUILD/php82-pecl-memcache-8.0/tests/connect.inc on line 70 [/tmp/B.b8vhwhz8/BUILD/php82-pecl-memcache-8.0/tests/001.phpt] Deprecated: Creation of dynamic property Memcache::$connection is deprecated in /tmp/B.b8vhwhz8/BUILD/php82-pecl-memcache-8.0/tests/connect.inc on line 70 [/tmp/B.b8vhwhz8/BUILD/php82-pecl-memcache-8.0/tests/002.phpt] Deprecated: Creation of dynamic property Memcache::$connection is deprecated in /tmp/B.b8vhwhz8/BUILD/php82-pecl-memcache-8.0/tests/connect.inc on line 70 [/tmp/B.b8vhwhz8/BUILD/php82-pecl-memcache-8.0/tests/003.phpt] Deprecated: Creation of dynamic property Memcache::$connection is deprecated in /tmp/B.b8vhwhz8/BUILD/php82-pecl-memcache-8.0/tests/connect.inc on line 70 [/tmp/B.b8vhwhz8/BUILD/php82-pecl-memcache-8.0/tests/004.phpt] Deprecated: Creation of dynamic property Memcache::$connection is deprecated in /tmp/B.b8vhwhz8/BUILD/php82-pecl-memcache-8.0/tests/connect.inc on line 70 [/tmp/B.b8vhwhz8/BUILD/php82-pecl-memcache-8.0/tests/005.phpt] Deprecated: Creation of dynamic property Memcache::$connection is deprecated in /tmp/B.b8vhwhz8/BUILD/php82-pecl-memcache-8.0/tests/connect.inc on line 70 [/tmp/B.b8vhwhz8/BUILD/php82-pecl-memcache-8.0/tests/006.phpt] Deprecated: Creation of dynamic property Memcache::$connection is deprecated in /tmp/B.b8vhwhz8/BUILD/php82-pecl-memcache-8.0/tests/connect.inc on line 70 [/tmp/B.b8vhwhz8/BUILD/php82-pecl-memcache-8.0/tests/007.phpt] Deprecated: Creation of dynamic property Memcache::$connection is deprecated in /tmp/B.b8vhwhz8/BUILD/php82-pecl-memcache-8.0/tests/connect.inc on line 70 [/tmp/B.b8vhwhz8/BUILD/php82-pecl-memcache-8.0/tests/008.phpt] Deprecated: Creation of dynamic property Memcache::$connection is deprecated in /tmp/B.b8vhwhz8/BUILD/php82-pecl-memcache-8.0/tests/connect.inc on line 70 [/tmp/B.b8vhwhz8/BUILD/php82-pecl-memcache-8.0/tests/009.phpt] Deprecated: Creation of dynamic property Memcache::$connection is deprecated in /tmp/B.b8vhwhz8/BUILD/php82-pecl-memcache-8.0/tests/connect.inc on line 70 [/tmp/B.b8vhwhz8/BUILD/php82-pecl-memcache-8.0/tests/010.phpt] Deprecated: Creation of dynamic property Memcache::$connection is deprecated in /tmp/B.b8vhwhz8/BUILD/php82-pecl-memcache-8.0/tests/connect.inc on line 70 [/tmp/B.b8vhwhz8/BUILD/php82-pecl-memcache-8.0/tests/011.phpt] Deprecated: Creation of dynamic property Memcache::$connection is deprecated in /tmp/B.b8vhwhz8/BUILD/php82-pecl-memcache-8.0/tests/connect.inc on line 70 [/tmp/B.b8vhwhz8/BUILD/php82-pecl-memcache-8.0/tests/012.phpt] Deprecated: Creation of dynamic property Memcache::$connection is deprecated in /tmp/B.b8vhwhz8/BUILD/php82-pecl-memcache-8.0/tests/connect.inc on line 70 [/tmp/B.b8vhwhz8/BUILD/php82-pecl-memcache-8.0/tests/013.phpt] Deprecated: Creation of dynamic property Memcache::$connection is deprecated in /tmp/B.b8vhwhz8/BUILD/php82-pecl-memcache-8.0/tests/connect.inc on line 70 [/tmp/B.b8vhwhz8/BUILD/php82-pecl-memcache-8.0/tests/014.phpt] Deprecated: Creation of dynamic property Memcache::$connection is deprecated in /tmp/B.b8vhwhz8/BUILD/php82-pecl-memcache-8.0/tests/connect.inc on line 70 [/tmp/B.b8vhwhz8/BUILD/php82-pecl-memcache-8.0/tests/015.phpt] Deprecated: Creation of dynamic property Memcache::$connection is deprecated in /tmp/B.b8vhwhz8/BUILD/php82-pecl-memcache-8.0/tests/connect.inc on line 70 [/tmp/B.b8vhwhz8/BUILD/php82-pecl-memcache-8.0/tests/016.phpt] Deprecated: Creation of dynamic property Memcache::$connection is deprecated in /tmp/B.b8vhwhz8/BUILD/php82-pecl-memcache-8.0/tests/connect.inc on line 70 [/tmp/B.b8vhwhz8/BUILD/php82-pecl-memcache-8.0/tests/017.phpt] Deprecated: Creation of dynamic property Memcache::$connection is deprecated in /tmp/B.b8vhwhz8/BUILD/php82-pecl-memcache-8.0/tests/connect.inc on line 70 [/tmp/B.b8vhwhz8/BUILD/php82-pecl-memcache-8.0/tests/018.phpt] Deprecated: Creation of dynamic property Memcache::$connection is deprecated in /tmp/B.b8vhwhz8/BUILD/php82-pecl-memcache-8.0/tests/connect.inc on line 70 [/tmp/B.b8vhwhz8/BUILD/php82-pecl-memcache-8.0/tests/019.phpt] Deprecated: Creation of dynamic property Memcache::$connection is deprecated in /tmp/B.b8vhwhz8/BUILD/php82-pecl-memcache-8.0/tests/connect.inc on line 70 [/tmp/B.b8vhwhz8/BUILD/php82-pecl-memcache-8.0/tests/019a.phpt] Deprecated: Creation of dynamic property Memcache::$connection is deprecated in /tmp/B.b8vhwhz8/BUILD/php82-pecl-memcache-8.0/tests/connect.inc on line 70 [/tmp/B.b8vhwhz8/BUILD/php82-pecl-memcache-8.0/tests/020.phpt] Deprecated: Creation of dynamic property Memcache::$connection is deprecated in /tmp/B.b8vhwhz8/BUILD/php82-pecl-memcache-8.0/tests/connect.inc on line 70 [/tmp/B.b8vhwhz8/BUILD/php82-pecl-memcache-8.0/tests/021.phpt] Deprecated: Creation of dynamic property Memcache::$connection is deprecated in /tmp/B.b8vhwhz8/BUILD/php82-pecl-memcache-8.0/tests/connect.inc on line 70 [/tmp/B.b8vhwhz8/BUILD/php82-pecl-memcache-8.0/tests/022.phpt] Deprecated: Creation of dynamic property Memcache::$connection is deprecated in /tmp/B.b8vhwhz8/BUILD/php82-pecl-memcache-8.0/tests/connect.inc on line 70 [/tmp/B.b8vhwhz8/BUILD/php82-pecl-memcache-8.0/tests/022a.phpt] Deprecated: Creation of dynamic property Memcache::$connection is deprecated in /tmp/B.b8vhwhz8/BUILD/php82-pecl-memcache-8.0/tests/connect.inc on line 70 [/tmp/B.b8vhwhz8/BUILD/php82-pecl-memcache-8.0/tests/023.phpt] Deprecated: Creation of dynamic property Memcache::$connection is deprecated in /tmp/B.b8vhwhz8/BUILD/php82-pecl-memcache-8.0/tests/connect.inc on line 70 [/tmp/B.b8vhwhz8/BUILD/php82-pecl-memcache-8.0/tests/024.phpt] Deprecated: Creation of dynamic property Memcache::$connection is deprecated in /tmp/B.b8vhwhz8/BUILD/php82-pecl-memcache-8.0/tests/connect.inc on line 70 [/tmp/B.b8vhwhz8/BUILD/php82-pecl-memcache-8.0/tests/024a.phpt] Deprecated: Creation of dynamic property Memcache::$connection is deprecated in /tmp/B.b8vhwhz8/BUILD/php82-pecl-memcache-8.0/tests/connect.inc on line 70 [/tmp/B.b8vhwhz8/BUILD/php82-pecl-memcache-8.0/tests/025.phpt] Deprecated: Creation of dynamic property Memcache::$connection is deprecated in /tmp/B.b8vhwhz8/BUILD/php82-pecl-memcache-8.0/tests/connect.inc on line 70 [/tmp/B.b8vhwhz8/BUILD/php82-pecl-memcache-8.0/tests/026.phpt] Deprecated: Creation of dynamic property Memcache::$connection is deprecated in /tmp/B.b8vhwhz8/BUILD/php82-pecl-memcache-8.0/tests/connect.inc on line 70 [/tmp/B.b8vhwhz8/BUILD/php82-pecl-memcache-8.0/tests/027.phpt] Deprecated: Creation of dynamic property Memcache::$connection is deprecated in /tmp/B.b8vhwhz8/BUILD/php82-pecl-memcache-8.0/tests/connect.inc on line 70 [/tmp/B.b8vhwhz8/BUILD/php82-pecl-memcache-8.0/tests/027a.phpt] Deprecated: Creation of dynamic property Memcache::$connection is deprecated in /tmp/B.b8vhwhz8/BUILD/php82-pecl-memcache-8.0/tests/connect.inc on line 70 [/tmp/B.b8vhwhz8/BUILD/php82-pecl-memcache-8.0/tests/028.phpt] Deprecated: Creation of dynamic property Memcache::$connection is deprecated in /tmp/B.b8vhwhz8/BUILD/php82-pecl-memcache-8.0/tests/connect.inc on line 70 [/tmp/B.b8vhwhz8/BUILD/php82-pecl-memcache-8.0/tests/029.phpt] Deprecated: Creation of dynamic property Memcache::$connection is deprecated in /tmp/B.b8vhwhz8/BUILD/php82-pecl-memcache-8.0/tests/connect.inc on line 70 [/tmp/B.b8vhwhz8/BUILD/php82-pecl-memcache-8.0/tests/030.phpt] Deprecated: Creation of dynamic property Memcache::$connection is deprecated in /tmp/B.b8vhwhz8/BUILD/php82-pecl-memcache-8.0/tests/connect.inc on line 70 [/tmp/B.b8vhwhz8/BUILD/php82-pecl-memcache-8.0/tests/031.phpt] Deprecated: Creation of dynamic property Memcache::$connection is deprecated in /tmp/B.b8vhwhz8/BUILD/php82-pecl-memcache-8.0/tests/connect.inc on line 70 [/tmp/B.b8vhwhz8/BUILD/php82-pecl-memcache-8.0/tests/032.phpt] Deprecated: Creation of dynamic property Memcache::$connection is deprecated in /tmp/B.b8vhwhz8/BUILD/php82-pecl-memcache-8.0/tests/connect.inc on line 70 [/tmp/B.b8vhwhz8/BUILD/php82-pecl-memcache-8.0/tests/033.phpt] Deprecated: Creation of dynamic property Memcache::$connection is deprecated in /tmp/B.b8vhwhz8/BUILD/php82-pecl-memcache-8.0/tests/connect.inc on line 70 [/tmp/B.b8vhwhz8/BUILD/php82-pecl-memcache-8.0/tests/034.phpt] Deprecated: Creation of dynamic property Memcache::$connection is deprecated in /tmp/B.b8vhwhz8/BUILD/php82-pecl-memcache-8.0/tests/connect.inc on line 70 [/tmp/B.b8vhwhz8/BUILD/php82-pecl-memcache-8.0/tests/035.phpt] Deprecated: Creation of dynamic property Memcache::$connection is deprecated in /tmp/B.b8vhwhz8/BUILD/php82-pecl-memcache-8.0/tests/connect.inc on line 70 [/tmp/B.b8vhwhz8/BUILD/php82-pecl-memcache-8.0/tests/036.phpt] Deprecated: Creation of dynamic property Memcache::$connection is deprecated in /tmp/B.b8vhwhz8/BUILD/php82-pecl-memcache-8.0/tests/connect.inc on line 70 [/tmp/B.b8vhwhz8/BUILD/php82-pecl-memcache-8.0/tests/036b.phpt] Deprecated: Creation of dynamic property Memcache::$connection is deprecated in /tmp/B.b8vhwhz8/BUILD/php82-pecl-memcache-8.0/tests/connect.inc on line 70 [/tmp/B.b8vhwhz8/BUILD/php82-pecl-memcache-8.0/tests/037.phpt] Deprecated: Creation of dynamic property Memcache::$connection is deprecated in /tmp/B.b8vhwhz8/BUILD/php82-pecl-memcache-8.0/tests/connect.inc on line 70 skip UDP is not enabled in connect.inc [/tmp/B.b8vhwhz8/BUILD/php82-pecl-memcache-8.0/tests/039.phpt] Deprecated: Creation of dynamic property Memcache::$connection is deprecated in /tmp/B.b8vhwhz8/BUILD/php82-pecl-memcache-8.0/tests/connect.inc on line 70 [/tmp/B.b8vhwhz8/BUILD/php82-pecl-memcache-8.0/tests/040.phpt] Deprecated: Creation of dynamic property Memcache::$connection is deprecated in /tmp/B.b8vhwhz8/BUILD/php82-pecl-memcache-8.0/tests/connect.inc on line 70 [/tmp/B.b8vhwhz8/BUILD/php82-pecl-memcache-8.0/tests/041.phpt] Deprecated: Creation of dynamic property Memcache::$connection is deprecated in /tmp/B.b8vhwhz8/BUILD/php82-pecl-memcache-8.0/tests/connect.inc on line 70 [/tmp/B.b8vhwhz8/BUILD/php82-pecl-memcache-8.0/tests/042.phpt] Deprecated: Creation of dynamic property Memcache::$connection is deprecated in /tmp/B.b8vhwhz8/BUILD/php82-pecl-memcache-8.0/tests/connect.inc on line 70 [/tmp/B.b8vhwhz8/BUILD/php82-pecl-memcache-8.0/tests/043.phpt] Deprecated: Creation of dynamic property Memcache::$connection is deprecated in /tmp/B.b8vhwhz8/BUILD/php82-pecl-memcache-8.0/tests/connect.inc on line 70 [/tmp/B.b8vhwhz8/BUILD/php82-pecl-memcache-8.0/tests/044.phpt] Deprecated: Creation of dynamic property Memcache::$connection is deprecated in /tmp/B.b8vhwhz8/BUILD/php82-pecl-memcache-8.0/tests/connect.inc on line 70 [/tmp/B.b8vhwhz8/BUILD/php82-pecl-memcache-8.0/tests/045.phpt] Deprecated: Creation of dynamic property Memcache::$connection is deprecated in /tmp/B.b8vhwhz8/BUILD/php82-pecl-memcache-8.0/tests/connect.inc on line 70 [/tmp/B.b8vhwhz8/BUILD/php82-pecl-memcache-8.0/tests/046.phpt] Deprecated: Creation of dynamic property Memcache::$connection is deprecated in /tmp/B.b8vhwhz8/BUILD/php82-pecl-memcache-8.0/tests/connect.inc on line 70 [/tmp/B.b8vhwhz8/BUILD/php82-pecl-memcache-8.0/tests/047.phpt] Deprecated: Creation of dynamic property Memcache::$connection is deprecated in /tmp/B.b8vhwhz8/BUILD/php82-pecl-memcache-8.0/tests/connect.inc on line 70 [/tmp/B.b8vhwhz8/BUILD/php82-pecl-memcache-8.0/tests/048.phpt] Deprecated: Creation of dynamic property Memcache::$connection is deprecated in /tmp/B.b8vhwhz8/BUILD/php82-pecl-memcache-8.0/tests/connect.inc on line 70 [/tmp/B.b8vhwhz8/BUILD/php82-pecl-memcache-8.0/tests/049.phpt] Deprecated: Creation of dynamic property Memcache::$connection is deprecated in /tmp/B.b8vhwhz8/BUILD/php82-pecl-memcache-8.0/tests/connect.inc on line 70 [/tmp/B.b8vhwhz8/BUILD/php82-pecl-memcache-8.0/tests/050.phpt] Deprecated: Creation of dynamic property Memcache::$connection is deprecated in /tmp/B.b8vhwhz8/BUILD/php82-pecl-memcache-8.0/tests/connect.inc on line 70 [/tmp/B.b8vhwhz8/BUILD/php82-pecl-memcache-8.0/tests/051.phpt] Deprecated: Creation of dynamic property Memcache::$connection is deprecated in /tmp/B.b8vhwhz8/BUILD/php82-pecl-memcache-8.0/tests/connect.inc on line 70 [/tmp/B.b8vhwhz8/BUILD/php82-pecl-memcache-8.0/tests/052.phpt] Deprecated: Creation of dynamic property Memcache::$connection is deprecated in /tmp/B.b8vhwhz8/BUILD/php82-pecl-memcache-8.0/tests/connect.inc on line 70 [/tmp/B.b8vhwhz8/BUILD/php82-pecl-memcache-8.0/tests/053.phpt] Deprecated: Creation of dynamic property Memcache::$connection is deprecated in /tmp/B.b8vhwhz8/BUILD/php82-pecl-memcache-8.0/tests/connect.inc on line 70 [/tmp/B.b8vhwhz8/BUILD/php82-pecl-memcache-8.0/tests/054.phpt] Deprecated: Creation of dynamic property Memcache::$connection is deprecated in /tmp/B.b8vhwhz8/BUILD/php82-pecl-memcache-8.0/tests/connect.inc on line 70 [/tmp/B.b8vhwhz8/BUILD/php82-pecl-memcache-8.0/tests/055.phpt] Deprecated: Creation of dynamic property Memcache::$connection is deprecated in /tmp/B.b8vhwhz8/BUILD/php82-pecl-memcache-8.0/tests/connect.inc on line 70 [/tmp/B.b8vhwhz8/BUILD/php82-pecl-memcache-8.0/tests/056.phpt] Deprecated: Creation of dynamic property Memcache::$connection is deprecated in /tmp/B.b8vhwhz8/BUILD/php82-pecl-memcache-8.0/tests/connect.inc on line 70 skip not compiled with pcntl_fork() support [/tmp/B.b8vhwhz8/BUILD/php82-pecl-memcache-8.0/tests/057.phpt] Deprecated: Creation of dynamic property Memcache::$connection is deprecated in /tmp/B.b8vhwhz8/BUILD/php82-pecl-memcache-8.0/tests/connect.inc on line 70 [/tmp/B.b8vhwhz8/BUILD/php82-pecl-memcache-8.0/tests/058.phpt] Deprecated: Creation of dynamic property Memcache::$connection is deprecated in /tmp/B.b8vhwhz8/BUILD/php82-pecl-memcache-8.0/tests/connect.inc on line 70 [/tmp/B.b8vhwhz8/BUILD/php82-pecl-memcache-8.0/tests/100.phpt] Deprecated: Creation of dynamic property Memcache::$connection is deprecated in /tmp/B.b8vhwhz8/BUILD/php82-pecl-memcache-8.0/tests/connect.inc on line 70 [/tmp/B.b8vhwhz8/BUILD/php82-pecl-memcache-8.0/tests/100a.phpt] Deprecated: Creation of dynamic property Memcache::$connection is deprecated in /tmp/B.b8vhwhz8/BUILD/php82-pecl-memcache-8.0/tests/connect.inc on line 70 [/tmp/B.b8vhwhz8/BUILD/php82-pecl-memcache-8.0/tests/100c.phpt] Deprecated: Creation of dynamic property Memcache::$connection is deprecated in /tmp/B.b8vhwhz8/BUILD/php82-pecl-memcache-8.0/tests/connect.inc on line 70 [/tmp/B.b8vhwhz8/BUILD/php82-pecl-memcache-8.0/tests/bug73539.phpt] Deprecated: Creation of dynamic property Memcache::$connection is deprecated in /tmp/B.b8vhwhz8/BUILD/php82-pecl-memcache-8.0/tests/connect.inc on line 70 [/tmp/B.b8vhwhz8/BUILD/php82-pecl-memcache-8.0/tests/githubbug13.phpt] Deprecated: Creation of dynamic property Memcache::$connection is deprecated in /tmp/B.b8vhwhz8/BUILD/php82-pecl-memcache-8.0/tests/connect.inc on line 70 [/tmp/B.b8vhwhz8/BUILD/php82-pecl-memcache-8.0/tests/githubbug53.phpt] Deprecated: Creation of dynamic property Memcache::$connection is deprecated in /tmp/B.b8vhwhz8/BUILD/php82-pecl-memcache-8.0/tests/connect.inc on line 70 [/tmp/B.b8vhwhz8/BUILD/php82-pecl-memcache-8.0/tests/pecl11221.phpt] Deprecated: Creation of dynamic property Memcache::$connection is deprecated in /tmp/B.b8vhwhz8/BUILD/php82-pecl-memcache-8.0/tests/connect.inc on line 70 [/tmp/B.b8vhwhz8/BUILD/php82-pecl-memcache-8.0/tests/pecl16442.phpt] Deprecated: Creation of dynamic property Memcache::$connection is deprecated in /tmp/B.b8vhwhz8/BUILD/php82-pecl-memcache-8.0/tests/connect.inc on line 70 [/tmp/B.b8vhwhz8/BUILD/php82-pecl-memcache-8.0/tests/pecl16536.phpt] Deprecated: Creation of dynamic property Memcache::$connection is deprecated in /tmp/B.b8vhwhz8/BUILD/php82-pecl-memcache-8.0/tests/connect.inc on line 70 [/tmp/B.b8vhwhz8/BUILD/php82-pecl-memcache-8.0/tests/pecl17518.phpt] Deprecated: Creation of dynamic property Memcache::$connection is deprecated in /tmp/B.b8vhwhz8/BUILD/php82-pecl-memcache-8.0/tests/connect.inc on line 70 [/tmp/B.b8vhwhz8/BUILD/php82-pecl-memcache-8.0/tests/pecl17566.phpt] Deprecated: Creation of dynamic property Memcache::$connection is deprecated in /tmp/B.b8vhwhz8/BUILD/php82-pecl-memcache-8.0/tests/connect.inc on line 70 [/tmp/B.b8vhwhz8/BUILD/php82-pecl-memcache-8.0/tests/pecl63142.phpt] Deprecated: Creation of dynamic property Memcache::$connection is deprecated in /tmp/B.b8vhwhz8/BUILD/php82-pecl-memcache-8.0/tests/connect.inc on line 70 [/tmp/B.b8vhwhz8/BUILD/php82-pecl-memcache-8.0/tests/pecl63272.phpt] Deprecated: Creation of dynamic property Memcache::$connection is deprecated in /tmp/B.b8vhwhz8/BUILD/php82-pecl-memcache-8.0/tests/connect.inc on line 70 [/tmp/B.b8vhwhz8/BUILD/php82-pecl-memcache-8.0/tests/pecl77900.phpt] ===================================================================== make: *** [Makefile:153: test] Error 1 + cat memcached.pid memcached-udp.pid + kill 26669 26676 error: Bad exit status from /tmp/B.b8vhwhz8/BUILD/tmp/rpm-tmp.i9ubtz (%build) RPM build errors: Bad exit status from /tmp/B.b8vhwhz8/BUILD/tmp/rpm-tmp.i9ubtz (%build) ended at: Thu Sep 29 16:57:03 2022, done in 0:00:07.524445 error: No files produced. + chmod -R u+rwX /tmp/B.b8vhwhz8/BUILD + rm -rf /tmp/B.b8vhwhz8/tmp /tmp/B.b8vhwhz8/BUILD + rm -rf /tmp/B.b8vhwhz8 Begin-PLD-Builder-Info Build-Time: user:20.33s sys:7.53s real:25.81s (faults io:51 non-io:1315228) End-PLD-Builder-Info
[Back to list of logs] [View rpm -qa of builder]