FailedOk

th/SRPMS[OK]
th/x32[OK]
th/i686[OK]
th/x86_64[OK]

ac/SRPMS[OK]
ac/i386[OK]
ac/i586[OK]
ac/i686[OK]
ac/alpha[OK]
ac/amd64[OK]
ac/athlon[OK]
ac/ppc[OK]
ac/sparc[OK]
ac/sparc64[OK]

Advanced Search
main()
Powered by PLD Linux
(c) 2002-2022 PLD Team
$Revision: 1.37 $
Powered by ed.
Your IP: 3.238.49.228

pylint 0290c84a-1461-453d-b6c7-e3dbb7e6f1df

Status:Failed
Source URL:https://buildlogs.pld-linux.org/pld/th/x32/FAIL/pylint,0290c84a-1461-453d-b6c7-e3dbb7e6f1df.bz2
text/plain URL:View!
full text:View!
rpm -qa of builder:View!
Date:2022/09/18 15:16:39
Runtime:0:05:47.816206

Toc:

  • error 1
  • rpm: error: Failed build dependencies:
  • error 2
  • rpm: error: Failed build dependencies:
  • error 3
  • rpm: error: Failed build dependencies:
  • prep
  • Executing(%prep): /bin/sh -e /tmp/B.f0kk72b1/BUILD/tmp/rpm-tmp.lL3bgs
  • build
  • Executing(%build): /bin/sh -e /tmp/B.f0kk72b1/BUILD/tmp/rpm-tmp.ibamnr
  • error 4
  • error: Bad exit status from /tmp/B.f0kk72b1/BUILD/tmp/rpm-tmp.ibamnr (%build)
  • error 5
  • RPM build errors:
  • error 6
  • error: No files produced.

Content:

checking if we should skip the build
started at: Sun Sep 18 15:10:27 2022
killing old processes on a builder
sending signal 9 to pid -1
cleaning up /tmp
fetching https://srcbuilder.pld-linux.org/th//srpms/0290c84a-1461-453d-b6c7-e3dbb7e6f1df/pylint-2.15.2-1.src.rpm
fetched 1319320 bytes, 2661.4 K/s
installing srpm: pylint-2.15.2-1.src.rpm
+ install -d /tmp/B.f0kk72b1/BUILD /tmp/B.f0kk72b1/RPMS
+ LC_ALL=en_US.UTF-8
+ rpm -qp --changelog pylint-2.15.2-1.src.rpm
* Sun Sep 18 2022 PLD Linux Team <feedback@pld-linux.org>
- For complete changelog see: http://git.pld-linux.org/?p=packages/pylint.git;a=log;h=master
* Wed Sep 14 2022 Jakub Bogusz <qboosh@pld-linux.org> fdba914
- updated to 2.15.2 * Mon Apr 04 2022 Jan Rękorajski <baggins@pld-linux.org> db91902
- Release 3 (by relup.sh) * Sat Mar 26 2022 Jan Rękorajski <baggins@pld-linux.org> 5c33100
- rebuild with python 3.10 * Mon Mar 21 2022 Jakub Bogusz <qboosh@pld-linux.org> b9af353
- updated dependencies * Wed Dec 15 2021 Jakub Bogusz <qboosh@pld-linux.org> 4ccf643
- setuptools epoch * Wed Dec 08 2021 Jan Palus <atler@pld-linux.org> 966cfc1
- up to 2.12.2 * Wed Mar 03 2021 Jan Rękorajski <baggins@pld-linux.org> f8bbbbb
- fix docs build * Wed Mar 03 2021 Jan Rękorajski <baggins@pld-linux.org> da7eaa4
- drop conflictiong dependencies * Wed Mar 03 2021 Jan Rękorajski <baggins@pld-linux.org> 3de3201
- up to 2.7.2 * Sun Mar 29 2020 Jakub Bogusz <qboosh@pld-linux.org> 9b3953e
- added deps patch: fix python_requires (broke distlib: '.*' not allowed for '>=' constraints) - release 2 * Sat Nov 16 2019 Jakub Bogusz <qboosh@pld-linux.org> 2a5c34f
- updated dependencies * Sat Nov 16 2019 Jakub Bogusz <qboosh@pld-linux.org> b50e511
- updated to 2.4.4 - package binaries with -3 suffix (as commonly packaged by others) in py3lint package - base pylint package is a wrapper for py3lint with standard binary names * Sun Nov 03 2019 Jan Rękorajski <baggins@pld-linux.org> a6607fb
- updated BRs - rel 3 * Mon Oct 28 2019 Jakub Bogusz <qboosh@pld-linux.org> 9101e20
- updated dependencies; now requires python 3.5+ (separate spec with pylint 1.9.x for python2 pending) * Mon Oct 28 2019 Jan Rękorajski <baggins@pld-linux.org> e1a36fc
- rebuild with python 3.8 - release 2 (by relup.sh) * Sun Oct 20 2019 Adam Gołębiowski <adamg@pld-linux.org> b0e6a31
- updated to 2.4.3 * Mon Sep 30 2019 Adam Gołębiowski <adamg@pld-linux.org> c35cc74
- updated to 2.4.2 * Sat Sep 28 2019 Adam Gołębiowski <adamg@pld-linux.org> 27c1271
- updated to 2.4.1 * Thu Feb 28 2019 Adam Gołębiowski <adamg@pld-linux.org> 0f8320e
- updated to 2.3.0 * Thu Nov 29 2018 Adam Gołębiowski <adamg@pld-linux.org> 995aa40
- updated to 2.2.2 + rpm -Uhv --nodeps --define '_topdir /tmp/B.f0kk72b1' --define '_specdir %{_topdir}' --define '_sourcedir %{_specdir}' --define '_rpmdir %{_topdir}/RPMS' --define '_builddir %{_topdir}/BUILD' pylint-2.15.2-1.src.rpm Updating / installing... pylint-2.15.2-1 ######################################## + rm -f pylint-2.15.2-1.src.rpm + install -m 700 -d /tmp/B.f0kk72b1/BUILD/tmp + TMPDIR=/tmp/B.f0kk72b1/BUILD/tmp + exec nice -n 0 rpmbuild -bp --short-circuit --nodeps --define '_topdir /tmp/B.f0kk72b1' --define '_specdir %{_topdir}' --define '_sourcedir %{_specdir}' --define '_rpmdir %{_topdir}/RPMS' --define '_builddir %{_topdir}/BUILD' --target x32-pld-linux --define 'prep exit 0' /tmp/B.f0kk72b1/pylint.spec Building target platforms: x32-pld-linux Building for target x32-pld-linux checking BuildConflict-ing packages rpm: error: Failed build dependencies: rpm: python3-dill >= 0.2 is needed by pylint-2.15.2-1.noarch rpm: python3-sphinx_reredirects < 1 is needed by pylint-2.15.2-1.noarch rpm: python3-tomli >= 1.1.0 is needed by pylint-2.15.2-1.noarch rpm: python3-tomlkit >= 0.10.1 is needed by pylint-2.15.2-1.noarch rpm: Building target platforms: x32-pld-linux rpm: Building for target x32-pld-linux no BuildConflicts found checking BR rpm: error: Failed build dependencies: rpm: python3-dill >= 0.2 is needed by pylint-2.15.2-1.noarch rpm: python3-sphinx_reredirects < 1 is needed by pylint-2.15.2-1.noarch rpm: python3-tomli >= 1.1.0 is needed by pylint-2.15.2-1.noarch rpm: python3-tomlkit >= 0.10.1 is needed by pylint-2.15.2-1.noarch rpm: Building target platforms: x32-pld-linux rpm: Building for target x32-pld-linux updating poldek cache... ready is up to date th is up to date th is up to date th-ready is up to date th-ready is up to date Retrieving th-test::packages.ndir.diff.toc.gz..............................................done Retrieving diff::packages.ndir.2022.09.17-19.50.01.gz......................................done Loading [pndir]th-test... Applying packages.ndir.2022.09.17-19.50.01.gz... Applying packages.ndir.2022.09.17-20.31.02.gz... Applying packages.ndir.2022.09.18-05.26.02.gz... Applying packages.ndir.2022.09.18-05.29.02.gz... Retrieving diff::packages.ndir.2022.09.18-05.32.02.gz......................................done Applying packages.ndir.2022.09.18-05.32.02.gz... Retrieving diff::packages.ndir.2022.09.18-05.38.01.gz......................................done Applying packages.ndir.2022.09.18-05.38.01.gz... Applying packages.ndir.2022.09.18-05.39.01.gz... Retrieving diff::packages.ndir.2022.09.18-05.51.01.gz......................................done Applying packages.ndir.2022.09.18-05.51.01.gz... Writing /root/.cache/poldek/[...]/packages.ndir.gz... Retrieving th-test::packages.ndir.diff.toc.gz..............................................done Loading [pndir]th-test... Applying packages.ndir.2022.09.17-19.25.03.gz... Applying packages.ndir.2022.09.17-20.31.04.gz... Retrieving diff::packages.ndir.2022.09.18-01.47.03.gz......................................done Applying packages.ndir.2022.09.18-01.47.03.gz... Retrieving diff::packages.ndir.2022.09.18-05.29.02.gz......................................done Applying packages.ndir.2022.09.18-05.29.02.gz... Retrieving diff::packages.ndir.2022.09.18-05.34.01.gz......................................done Applying packages.ndir.2022.09.18-05.34.01.gz... Writing /root/.cache/poldek/[...]/packages.ndir.gz... checking conflicting packages in BRed packages poldek: Loading [pndir]ready... poldek: Loading [pndir]th-test... poldek: Loading [pndir]th-test... poldek: Loading [pndir]th-ready... poldek: Loading [pndir]th-ready... poldek: Loading [pndir]th... poldek: Loading [pndir]th... poldek: 34966 packages read poldek: Removed 6495 duplicate packages from available set poldek: Processing dependencies... poldek: There are 4 packages to install: poldek: A python3-dill-0.3.5.1-1.noarch python3-sphinx_reredirects-0.1.1-1.noarch poldek: A python3-tomli-2.0.1-1.noarch python3-tomlkit-0.11.4-1.noarch poldek: This operation will use 1.2MB of disk space. poldek: Need to get 274.6KB of archives. poldek: python3-dill-0.3.5.1-1.noarch.rpm: digests OK poldek: python3-sphinx_reredirects-0.1.1-1.noarch.rpm: digests OK poldek: python3-tomli-2.0.1-1.noarch.rpm: digests OK poldek: python3-tomlkit-0.11.4-1.noarch.rpm: digests OK poldek: Executing pm-command.sh --upgrade -vh --test --root / --define _check_dirname_deps 0... poldek: Verifying... ######################################## poldek: Preparing... ######################################## no conflicts found checking BR rpm: error: Failed build dependencies: rpm: python3-dill >= 0.2 is needed by pylint-2.15.2-1.noarch rpm: python3-sphinx_reredirects < 1 is needed by pylint-2.15.2-1.noarch rpm: python3-tomli >= 1.1.0 is needed by pylint-2.15.2-1.noarch rpm: python3-tomlkit >= 0.10.1 is needed by pylint-2.15.2-1.noarch rpm: Building target platforms: x32-pld-linux rpm: Building for target x32-pld-linux installing BR: python3\-dill python3\-sphinx_reredirects python3\-tomli python3\-tomlkit + poldek --noask --caplookup -Q -v '--ignore=hhvm-*' '--ignore=php4-*' '--ignore=php52-*' '--ignore=php54-*' '--ignore=php55-*' '--ignore=php56-*' '--ignore=php70-*' '--ignore=php71-*' '--ignore=php72-*' '--ignore=php73-*' '--ignore=php74-*' '--ignore=php80-*' '--ignore=php81-*' --upgrade python3-dill python3-sphinx_reredirects python3-tomli python3-tomlkit Loading [pndir]ready... Loading [pndir]th-test... Loading [pndir]th-test... Loading [pndir]th-ready... Loading [pndir]th-ready... Loading [pndir]th... Loading [pndir]th... 34966 packages read Removed 6495 duplicate packages from available set Processing dependencies... There are 4 packages to install: A python3-dill-0.3.5.1-1.noarch python3-sphinx_reredirects-0.1.1-1.noarch A python3-tomli-2.0.1-1.noarch python3-tomlkit-0.11.4-1.noarch This operation will use 1.2MB of disk space. Need to get 274.6KB of archives. python3-dill-0.3.5.1-1.noarch.rpm: digests OK python3-sphinx_reredirects-0.1.1-1.noarch.rpm: digests OK python3-tomli-2.0.1-1.noarch.rpm: digests OK python3-tomlkit-0.11.4-1.noarch.rpm: digests OK Executing pm-command.sh --upgrade -vh --root / --define _check_dirname_deps 0... Verifying... ######################################## Preparing... ######################################## Updating / installing... python3-tomlkit-0.11.4-1 ######################################## python3-tomli-2.0.1-1 ######################################## python3-sphinx_reredirects-0.1.1-1 ######################################## python3-dill-0.3.5.1-1 ######################################## building RPM using: set -ex; : build-id: 0290c84a-1461-453d-b6c7-e3dbb7e6f1df; TMPDIR=/tmp/B.f0kk72b1/BUILD/tmp exec nice -n 0 rpmbuild -bb --define '__jobs 9' --define '_smp_mflags -j9' --define '_make_opts -Otarget' --define '_pld_builder 1' --define '_topdir /tmp/B.f0kk72b1' --define '_specdir %{_topdir}' --define '_sourcedir %{_specdir}' --define '_rpmdir %{_topdir}/RPMS' --define '_builddir %{_topdir}/BUILD' --target x32-pld-linux /tmp/B.f0kk72b1/pylint.spec + : build-id: 0290c84a-1461-453d-b6c7-e3dbb7e6f1df + TMPDIR=/tmp/B.f0kk72b1/BUILD/tmp + exec nice -n 0 rpmbuild -bb --define '__jobs 9' --define '_smp_mflags -j9' --define '_make_opts -Otarget' --define '_pld_builder 1' --define '_topdir /tmp/B.f0kk72b1' --define '_specdir %{_topdir}' --define '_sourcedir %{_specdir}' --define '_rpmdir %{_topdir}/RPMS' --define '_builddir %{_topdir}/BUILD' --target x32-pld-linux /tmp/B.f0kk72b1/pylint.spec Building target platforms: x32-pld-linux Building for target x32-pld-linux Executing(%prep): /bin/sh -e /tmp/B.f0kk72b1/BUILD/tmp/rpm-tmp.lL3bgs + umask 022 + cd /tmp/B.f0kk72b1/BUILD + cd /tmp/B.f0kk72b1/BUILD + rm -rf pylint-2.15.2 + /bin/gzip -dc /tmp/B.f0kk72b1/pylint-2.15.2.tar.gz + /bin/tar -xof - + STATUS=0 + '[' 0 -ne 0 ']' + cd pylint-2.15.2 + /bin/chmod -Rf a+rX,u+w,g-w,o-w . + >setup.py + <<EOF from setuptools import setup setup() EOF + cat + RPM_EC=0 + jobs -p + exit 0 Executing(%build): /bin/sh -e /tmp/B.f0kk72b1/BUILD/tmp/rpm-tmp.ibamnr HOME=/home/users/builder PATH=/home/users/builder/GNUstep/Tools:/bin:/usr/bin:/usr/local/bin TMPDIR=/tmp/B.f0kk72b1/BUILD/tmp + umask 022 + cd /tmp/B.f0kk72b1/BUILD + cd pylint-2.15.2 + LDFLAGS='-Wl,--as-needed -Wl,--no-copy-dt-needed-entries -Wl,-z,relro -Wl,-z,combreloc ' + export LDFLAGS + CFLAGS=' -O2 -fwrapv -pipe -Wformat -Werror=format-security -gdwarf-4 -fno-debug-types-section -fvar-tracking-assignments -g2 -Wp,-D_FORTIFY_SOURCE=2 -fstack-protector-strong --param=ssp-buffer-size=4 -Werror=trampolines -fPIC -mtune=generic -march=x86-64 -gdwarf-4 -fno-debug-types-section -fvar-tracking-assignments -g2 ' + export CFLAGS + CXXFLAGS=' -O2 -fwrapv -pipe -Wformat -Werror=format-security -gdwarf-4 -fno-debug-types-section -fvar-tracking-assignments -g2 -Wp,-D_FORTIFY_SOURCE=2 -fstack-protector-strong --param=ssp-buffer-size=4 -Werror=trampolines -fPIC -mtune=generic -march=x86-64 -gdwarf-4 -fno-debug-types-section -fvar-tracking-assignments -g2 ' + export CXXFLAGS + CC=x86_64-pld-linux-gnux32-gcc + export CC + CXX=x86_64-pld-linux-gnux32-g++ + export CXX + /usr/bin/python3 setup.py build '--build-base=build-3' /usr/share/python3.10/site-packages/setuptools/config/pyprojecttoml.py:108: _BetaConfiguration: Support for `[tool.setuptools]` in `pyproject.toml` is still *beta*. warnings.warn(msg, _BetaConfiguration) DefaultPluginManager load plugin flaky = flaky.flaky_nose_plugin:FlakyPlugin DefaultPluginManager load plugin NOSETESTS_PLUGINS = rednose:RedNose DefaultPluginManager load plugin randomly = nose_randomly:RandomlyPlugin DefaultPluginManager load plugin nose_random = nose_random:NoseRandomPlugin DefaultPluginManager load plugin xcover = nosexcover.nosexcover:XCoverage DefaultPluginManager load plugin nose_exclude = nose_exclude:NoseExclude running build running build_py creating build-3 creating build-3/lib creating build-3/lib/pylint copying pylint/__init__.py -> build-3/lib/pylint copying pylint/__main__.py -> build-3/lib/pylint copying pylint/__pkginfo__.py -> build-3/lib/pylint copying pylint/constants.py -> build-3/lib/pylint copying pylint/epylint.py -> build-3/lib/pylint copying pylint/exceptions.py -> build-3/lib/pylint copying pylint/graph.py -> build-3/lib/pylint copying pylint/interfaces.py -> build-3/lib/pylint copying pylint/typing.py -> build-3/lib/pylint creating build-3/lib/pylint/checkers copying pylint/checkers/__init__.py -> build-3/lib/pylint/checkers copying pylint/checkers/async.py -> build-3/lib/pylint/checkers copying pylint/checkers/base_checker.py -> build-3/lib/pylint/checkers copying pylint/checkers/deprecated.py -> build-3/lib/pylint/checkers copying pylint/checkers/design_analysis.py -> build-3/lib/pylint/checkers copying pylint/checkers/dunder_methods.py -> build-3/lib/pylint/checkers copying pylint/checkers/ellipsis_checker.py -> build-3/lib/pylint/checkers copying pylint/checkers/exceptions.py -> build-3/lib/pylint/checkers copying pylint/checkers/format.py -> build-3/lib/pylint/checkers copying pylint/checkers/imports.py -> build-3/lib/pylint/checkers copying pylint/checkers/lambda_expressions.py -> build-3/lib/pylint/checkers copying pylint/checkers/logging.py -> build-3/lib/pylint/checkers copying pylint/checkers/mapreduce_checker.py -> build-3/lib/pylint/checkers copying pylint/checkers/method_args.py -> build-3/lib/pylint/checkers copying pylint/checkers/misc.py -> build-3/lib/pylint/checkers copying pylint/checkers/modified_iterating_checker.py -> build-3/lib/pylint/checkers copying pylint/checkers/newstyle.py -> build-3/lib/pylint/checkers copying pylint/checkers/non_ascii_names.py -> build-3/lib/pylint/checkers copying pylint/checkers/raw_metrics.py -> build-3/lib/pylint/checkers copying pylint/checkers/similar.py -> build-3/lib/pylint/checkers copying pylint/checkers/spelling.py -> build-3/lib/pylint/checkers copying pylint/checkers/stdlib.py -> build-3/lib/pylint/checkers copying pylint/checkers/strings.py -> build-3/lib/pylint/checkers copying pylint/checkers/threading_checker.py -> build-3/lib/pylint/checkers copying pylint/checkers/typecheck.py -> build-3/lib/pylint/checkers copying pylint/checkers/unicode.py -> build-3/lib/pylint/checkers copying pylint/checkers/unsupported_version.py -> build-3/lib/pylint/checkers copying pylint/checkers/utils.py -> build-3/lib/pylint/checkers copying pylint/checkers/variables.py -> build-3/lib/pylint/checkers creating build-3/lib/pylint/config copying pylint/config/__init__.py -> build-3/lib/pylint/config copying pylint/config/argument.py -> build-3/lib/pylint/config copying pylint/config/arguments_manager.py -> build-3/lib/pylint/config copying pylint/config/arguments_provider.py -> build-3/lib/pylint/config copying pylint/config/callback_actions.py -> build-3/lib/pylint/config copying pylint/config/config_file_parser.py -> build-3/lib/pylint/config copying pylint/config/config_initialization.py -> build-3/lib/pylint/config copying pylint/config/configuration_mixin.py -> build-3/lib/pylint/config copying pylint/config/deprecation_actions.py -> build-3/lib/pylint/config copying pylint/config/environment_variable.py -> build-3/lib/pylint/config copying pylint/config/exceptions.py -> build-3/lib/pylint/config copying pylint/config/find_default_config_files.py -> build-3/lib/pylint/config copying pylint/config/help_formatter.py -> build-3/lib/pylint/config copying pylint/config/option.py -> build-3/lib/pylint/config copying pylint/config/option_manager_mixin.py -> build-3/lib/pylint/config copying pylint/config/option_parser.py -> build-3/lib/pylint/config copying pylint/config/options_provider_mixin.py -> build-3/lib/pylint/config copying pylint/config/utils.py -> build-3/lib/pylint/config creating build-3/lib/pylint/extensions copying pylint/extensions/__init__.py -> build-3/lib/pylint/extensions copying pylint/extensions/_check_docs_utils.py -> build-3/lib/pylint/extensions copying pylint/extensions/bad_builtin.py -> build-3/lib/pylint/extensions copying pylint/extensions/broad_try_clause.py -> build-3/lib/pylint/extensions copying pylint/extensions/check_elif.py -> build-3/lib/pylint/extensions copying pylint/extensions/code_style.py -> build-3/lib/pylint/extensions copying pylint/extensions/comparetozero.py -> build-3/lib/pylint/extensions copying pylint/extensions/comparison_placement.py -> build-3/lib/pylint/extensions copying pylint/extensions/confusing_elif.py -> build-3/lib/pylint/extensions copying pylint/extensions/consider_ternary_expression.py -> build-3/lib/pylint/extensions copying pylint/extensions/docparams.py -> build-3/lib/pylint/extensions copying pylint/extensions/docstyle.py -> build-3/lib/pylint/extensions copying pylint/extensions/empty_comment.py -> build-3/lib/pylint/extensions copying pylint/extensions/emptystring.py -> build-3/lib/pylint/extensions copying pylint/extensions/eq_without_hash.py -> build-3/lib/pylint/extensions copying pylint/extensions/for_any_all.py -> build-3/lib/pylint/extensions copying pylint/extensions/mccabe.py -> build-3/lib/pylint/extensions copying pylint/extensions/no_self_use.py -> build-3/lib/pylint/extensions copying pylint/extensions/overlapping_exceptions.py -> build-3/lib/pylint/extensions copying pylint/extensions/private_import.py -> build-3/lib/pylint/extensions copying pylint/extensions/redefined_loop_name.py -> build-3/lib/pylint/extensions copying pylint/extensions/redefined_variable_type.py -> build-3/lib/pylint/extensions copying pylint/extensions/set_membership.py -> build-3/lib/pylint/extensions copying pylint/extensions/typing.py -> build-3/lib/pylint/extensions copying pylint/extensions/while_used.py -> build-3/lib/pylint/extensions creating build-3/lib/pylint/lint copying pylint/lint/__init__.py -> build-3/lib/pylint/lint copying pylint/lint/base_options.py -> build-3/lib/pylint/lint copying pylint/lint/caching.py -> build-3/lib/pylint/lint copying pylint/lint/expand_modules.py -> build-3/lib/pylint/lint copying pylint/lint/message_state_handler.py -> build-3/lib/pylint/lint copying pylint/lint/parallel.py -> build-3/lib/pylint/lint copying pylint/lint/pylinter.py -> build-3/lib/pylint/lint copying pylint/lint/report_functions.py -> build-3/lib/pylint/lint copying pylint/lint/run.py -> build-3/lib/pylint/lint copying pylint/lint/utils.py -> build-3/lib/pylint/lint creating build-3/lib/pylint/message copying pylint/message/__init__.py -> build-3/lib/pylint/message copying pylint/message/_deleted_message_ids.py -> build-3/lib/pylint/message copying pylint/message/message.py -> build-3/lib/pylint/message copying pylint/message/message_definition.py -> build-3/lib/pylint/message copying pylint/message/message_definition_store.py -> build-3/lib/pylint/message copying pylint/message/message_id_store.py -> build-3/lib/pylint/message creating build-3/lib/pylint/pyreverse copying pylint/pyreverse/__init__.py -> build-3/lib/pylint/pyreverse copying pylint/pyreverse/diadefslib.py -> build-3/lib/pylint/pyreverse copying pylint/pyreverse/diagrams.py -> build-3/lib/pylint/pyreverse copying pylint/pyreverse/dot_printer.py -> build-3/lib/pylint/pyreverse copying pylint/pyreverse/inspector.py -> build-3/lib/pylint/pyreverse copying pylint/pyreverse/main.py -> build-3/lib/pylint/pyreverse copying pylint/pyreverse/mermaidjs_printer.py -> build-3/lib/pylint/pyreverse copying pylint/pyreverse/plantuml_printer.py -> build-3/lib/pylint/pyreverse copying pylint/pyreverse/printer.py -> build-3/lib/pylint/pyreverse copying pylint/pyreverse/printer_factory.py -> build-3/lib/pylint/pyreverse copying pylint/pyreverse/utils.py -> build-3/lib/pylint/pyreverse copying pylint/pyreverse/vcg_printer.py -> build-3/lib/pylint/pyreverse copying pylint/pyreverse/writer.py -> build-3/lib/pylint/pyreverse creating build-3/lib/pylint/reporters copying pylint/reporters/__init__.py -> build-3/lib/pylint/reporters copying pylint/reporters/base_reporter.py -> build-3/lib/pylint/reporters copying pylint/reporters/collecting_reporter.py -> build-3/lib/pylint/reporters copying pylint/reporters/json_reporter.py -> build-3/lib/pylint/reporters copying pylint/reporters/multi_reporter.py -> build-3/lib/pylint/reporters copying pylint/reporters/reports_handler_mix_in.py -> build-3/lib/pylint/reporters copying pylint/reporters/text.py -> build-3/lib/pylint/reporters creating build-3/lib/pylint/testutils copying pylint/testutils/__init__.py -> build-3/lib/pylint/testutils copying pylint/testutils/_run.py -> build-3/lib/pylint/testutils copying pylint/testutils/checker_test_case.py -> build-3/lib/pylint/testutils copying pylint/testutils/configuration_test.py -> build-3/lib/pylint/testutils copying pylint/testutils/constants.py -> build-3/lib/pylint/testutils copying pylint/testutils/decorator.py -> build-3/lib/pylint/testutils copying pylint/testutils/functional_test_file.py -> build-3/lib/pylint/testutils copying pylint/testutils/get_test_info.py -> build-3/lib/pylint/testutils copying pylint/testutils/global_test_linter.py -> build-3/lib/pylint/testutils copying pylint/testutils/lint_module_test.py -> build-3/lib/pylint/testutils copying pylint/testutils/output_line.py -> build-3/lib/pylint/testutils copying pylint/testutils/pyreverse.py -> build-3/lib/pylint/testutils copying pylint/testutils/reporter_for_tests.py -> build-3/lib/pylint/testutils copying pylint/testutils/tokenize_str.py -> build-3/lib/pylint/testutils copying pylint/testutils/unittest_linter.py -> build-3/lib/pylint/testutils copying pylint/testutils/utils.py -> build-3/lib/pylint/testutils creating build-3/lib/pylint/utils copying pylint/utils/__init__.py -> build-3/lib/pylint/utils copying pylint/utils/ast_walker.py -> build-3/lib/pylint/utils copying pylint/utils/docs.py -> build-3/lib/pylint/utils copying pylint/utils/file_state.py -> build-3/lib/pylint/utils copying pylint/utils/linterstats.py -> build-3/lib/pylint/utils copying pylint/utils/pragma_parser.py -> build-3/lib/pylint/utils copying pylint/utils/utils.py -> build-3/lib/pylint/utils creating build-3/lib/pylint/checkers/base copying pylint/checkers/base/__init__.py -> build-3/lib/pylint/checkers/base copying pylint/checkers/base/basic_checker.py -> build-3/lib/pylint/checkers/base copying pylint/checkers/base/basic_error_checker.py -> build-3/lib/pylint/checkers/base copying pylint/checkers/base/comparison_checker.py -> build-3/lib/pylint/checkers/base copying pylint/checkers/base/docstring_checker.py -> build-3/lib/pylint/checkers/base copying pylint/checkers/base/pass_checker.py -> build-3/lib/pylint/checkers/base creating build-3/lib/pylint/checkers/classes copying pylint/checkers/classes/__init__.py -> build-3/lib/pylint/checkers/classes copying pylint/checkers/classes/class_checker.py -> build-3/lib/pylint/checkers/classes copying pylint/checkers/classes/special_methods_checker.py -> build-3/lib/pylint/checkers/classes creating build-3/lib/pylint/checkers/refactoring copying pylint/checkers/refactoring/__init__.py -> build-3/lib/pylint/checkers/refactoring copying pylint/checkers/refactoring/implicit_booleaness_checker.py -> build-3/lib/pylint/checkers/refactoring copying pylint/checkers/refactoring/not_checker.py -> build-3/lib/pylint/checkers/refactoring copying pylint/checkers/refactoring/recommendation_checker.py -> build-3/lib/pylint/checkers/refactoring copying pylint/checkers/refactoring/refactoring_checker.py -> build-3/lib/pylint/checkers/refactoring creating build-3/lib/pylint/checkers/base/name_checker copying pylint/checkers/base/name_checker/__init__.py -> build-3/lib/pylint/checkers/base/name_checker copying pylint/checkers/base/name_checker/checker.py -> build-3/lib/pylint/checkers/base/name_checker copying pylint/checkers/base/name_checker/naming_style.py -> build-3/lib/pylint/checkers/base/name_checker creating build-3/lib/pylint/config/_pylint_config copying pylint/config/_pylint_config/__init__.py -> build-3/lib/pylint/config/_pylint_config copying pylint/config/_pylint_config/generate_command.py -> build-3/lib/pylint/config/_pylint_config copying pylint/config/_pylint_config/help_message.py -> build-3/lib/pylint/config/_pylint_config copying pylint/config/_pylint_config/main.py -> build-3/lib/pylint/config/_pylint_config copying pylint/config/_pylint_config/setup.py -> build-3/lib/pylint/config/_pylint_config copying pylint/config/_pylint_config/utils.py -> build-3/lib/pylint/config/_pylint_config creating build-3/lib/pylint/reporters/ureports copying pylint/reporters/ureports/__init__.py -> build-3/lib/pylint/reporters/ureports copying pylint/reporters/ureports/base_writer.py -> build-3/lib/pylint/reporters/ureports copying pylint/reporters/ureports/nodes.py -> build-3/lib/pylint/reporters/ureports copying pylint/reporters/ureports/text_writer.py -> build-3/lib/pylint/reporters/ureports creating build-3/lib/pylint/testutils/_primer copying pylint/testutils/_primer/__init__.py -> build-3/lib/pylint/testutils/_primer copying pylint/testutils/_primer/package_to_lint.py -> build-3/lib/pylint/testutils/_primer copying pylint/testutils/_primer/primer.py -> build-3/lib/pylint/testutils/_primer copying pylint/testutils/_primer/primer_command.py -> build-3/lib/pylint/testutils/_primer copying pylint/testutils/_primer/primer_compare_command.py -> build-3/lib/pylint/testutils/_primer copying pylint/testutils/_primer/primer_prepare_command.py -> build-3/lib/pylint/testutils/_primer copying pylint/testutils/_primer/primer_run_command.py -> build-3/lib/pylint/testutils/_primer creating build-3/lib/pylint/testutils/functional copying pylint/testutils/functional/__init__.py -> build-3/lib/pylint/testutils/functional copying pylint/testutils/functional/find_functional_tests.py -> build-3/lib/pylint/testutils/functional copying pylint/testutils/functional/lint_module_output_update.py -> build-3/lib/pylint/testutils/functional copying pylint/testutils/functional/test_file.py -> build-3/lib/pylint/testutils/functional running egg_info creating pylint.egg-info writing pylint.egg-info/PKG-INFO writing dependency_links to pylint.egg-info/dependency_links.txt writing entry points to pylint.egg-info/entry_points.txt writing requirements to pylint.egg-info/requires.txt writing top-level names to pylint.egg-info/top_level.txt writing manifest file 'pylint.egg-info/SOURCES.txt' reading manifest file 'pylint.egg-info/SOURCES.txt' reading manifest template 'MANIFEST.in' adding license file 'LICENSE' adding license file 'CONTRIBUTORS.txt' writing manifest file 'pylint.egg-info/SOURCES.txt' copying pylint/testutils/testing_pylintrc -> build-3/lib/pylint/testutils + /usr/bin/make -Otarget -j9 -C doc build-html 'PYTHONPATH=/tmp/B.f0kk72b1/BUILD/pylint-2.15.2' 'SPHINXBUILD=sphinx-build-3' make: Entering directory '/tmp/B.f0kk72b1/BUILD/pylint-2.15.2/doc' If you did not run 'make install-dependencies', you need to. sphinx-build-3 -b html -d _build/doctrees -T -W --keep-going -n . _build/html Running Sphinx v4.5.0 PYLINTHOME is now '/home/users/builder/.cache/pylint' but obsolescent '/home/users/builder/.pylint.d' is found; you can safely remove the latter making output directory... done loading intersphinx inventory from https://pylint.pycqa.org/projects/astroid/en/latest/objects.inv... loading intersphinx inventory from https://docs.python.org/3/objects.inv... WARNING: failed to reach any of the inventories with the following issues: intersphinx inventory 'https://pylint.pycqa.org/projects/astroid/en/latest/objects.inv' not fetchable due to <class 'requests.exceptions.ConnectionError'>: HTTPSConnectionPool(host='pylint.pycqa.org', port=443): Max retries exceeded with url: /projects/astroid/en/latest/objects.inv (Caused by NewConnectionError('<urllib3.connection.HTTPSConnection object at 0xf39e9538>: Failed to establish a new connection: [Errno -3] Temporary failure in name resolution')) WARNING: failed to reach any of the inventories with the following issues: intersphinx inventory 'https://docs.python.org/3/objects.inv' not fetchable due to <class 'requests.exceptions.ConnectionError'>: HTTPSConnectionPool(host='docs.python.org', port=443): Max retries exceeded with url: /3/objects.inv (Caused by NewConnectionError('<urllib3.connection.HTTPSConnection object at 0xf39e99a0>: Failed to establish a new connection: [Errno -3] Temporary failure in name resolution')) myst v0.17.0: MdParserConfig(commonmark_only=False, gfm_only=False, enable_extensions=[], linkify_fuzzy_links=True, dmath_allow_labels=True, dmath_allow_space=True, dmath_allow_digits=True, dmath_double_inline=False, update_mathjax=True, mathjax_classes='tex2jax_process|mathjax_process|math|output_area', disable_syntax=[], all_links_external=False, url_schemes=['http', 'https', 'mailto', 'ftp'], ref_domains=None, highlight_code_blocks=True, number_code_blocks=[], title_to_header=False, heading_anchors=None, heading_slug_func=None, html_meta=[], footnote_transition=True, substitutions=[], sub_delimiters=['{', '}'], words_per_minute=200) building [mo]: targets for 0 po files that are out of date building [html]: targets for 121 source files that are out of date updating environment: [new config] 554 added, 0 changed, 0 removed reading sources... [ 0%] contact reading sources... [ 0%] development_guide/api/epylint reading sources... [ 0%] development_guide/api/index reading sources... [ 0%] development_guide/api/pylint reading sources... [ 0%] development_guide/contributor_guide/contribute reading sources... [ 1%] development_guide/contributor_guide/index reading sources... [ 1%] development_guide/contributor_guide/major_release reading sources... [ 1%] development_guide/contributor_guide/minor_release reading sources... [ 1%] development_guide/contributor_guide/patch_release reading sources... [ 1%] development_guide/contributor_guide/profiling reading sources... [ 1%] development_guide/contributor_guide/release reading sources... [ 2%] development_guide/contributor_guide/tests/index reading sources... [ 2%] development_guide/contributor_guide/tests/install reading sources... [ 2%] development_guide/contributor_guide/tests/launching_test reading sources... [ 2%] development_guide/contributor_guide/tests/writing_test reading sources... [ 2%] development_guide/how_tos/custom_checkers reading sources... [ 3%] development_guide/how_tos/index reading sources... [ 3%] development_guide/how_tos/plugins reading sources... [ 3%] development_guide/how_tos/transform_plugins reading sources... [ 3%] development_guide/technical_reference/checkers reading sources... [ 3%] development_guide/technical_reference/index reading sources... [ 3%] development_guide/technical_reference/startup reading sources... [ 4%] faq reading sources... [ 4%] index reading sources... [ 4%] pyreverse reading sources... [ 4%] short_text_contribute reading sources... [ 4%] short_text_installation reading sources... [ 5%] symilar reading sources... [ 5%] tutorial reading sources... [ 5%] user_guide/checkers/extensions reading sources... [ 5%] user_guide/checkers/features reading sources... [ 5%] user_guide/checkers/index reading sources... [ 5%] user_guide/configuration/all-options reading sources... [ 6%] user_guide/configuration/index reading sources... [ 6%] user_guide/installation/badge reading sources... [ 6%] user_guide/installation/command_line_installation reading sources... [ 6%] user_guide/installation/ide_integration/flymake-emacs reading sources... [ 6%] user_guide/installation/ide_integration/index reading sources... [ 7%] user_guide/installation/ide_integration/textmate reading sources... [ 7%] user_guide/installation/index reading sources... [ 7%] user_guide/installation/pre-commit-integration reading sources... [ 7%] user_guide/installation/upgrading_pylint reading sources... [ 7%] user_guide/installation/with-multiple-interpreters reading sources... [ 7%] user_guide/messages/convention/bad-classmethod-argument reading sources... [ 8%] user_guide/messages/convention/bad-docstring-quotes reading sources... [ 8%] user_guide/messages/convention/bad-file-encoding reading sources... [ 8%] user_guide/messages/convention/bad-mcs-classmethod-argument reading sources... [ 8%] user_guide/messages/convention/bad-mcs-method-argument reading sources... [ 8%] user_guide/messages/convention/blacklisted-name reading sources... [ 9%] user_guide/messages/convention/compare-to-empty-string reading sources... [ 9%] user_guide/messages/convention/compare-to-zero reading sources... [ 9%] user_guide/messages/convention/consider-iterating-dictionary reading sources... [ 9%] user_guide/messages/convention/consider-using-any-or-all reading sources... [ 9%] user_guide/messages/convention/consider-using-dict-items reading sources... [ 9%] user_guide/messages/convention/consider-using-enumerate reading sources... [ 10%] user_guide/messages/convention/consider-using-f-string reading sources... [ 10%] user_guide/messages/convention/disallowed-name reading sources... [ 10%] user_guide/messages/convention/docstring-first-line-empty reading sources... [ 10%] user_guide/messages/convention/empty-docstring reading sources... [ 10%] user_guide/messages/convention/import-outside-toplevel reading sources... [ 11%] user_guide/messages/convention/import-private-name reading sources... [ 11%] user_guide/messages/convention/invalid-characters-in-docstring reading sources... [ 11%] user_guide/messages/convention/invalid-name reading sources... [ 11%] user_guide/messages/convention/len-as-condition reading sources... [ 11%] user_guide/messages/convention/line-too-long reading sources... [ 11%] user_guide/messages/convention/misplaced-comparison-constant reading sources... [ 12%] user_guide/messages/convention/missing-class-docstring reading sources... [ 12%] user_guide/messages/convention/missing-docstring reading sources... [ 12%] user_guide/messages/convention/missing-final-newline reading sources... [ 12%] user_guide/messages/convention/missing-function-docstring reading sources... [ 12%] user_guide/messages/convention/missing-module-docstring reading sources... [ 12%] user_guide/messages/convention/mixed-line-endings reading sources... [ 13%] user_guide/messages/convention/multiple-imports reading sources... [ 13%] user_guide/messages/convention/multiple-statements reading sources... [ 13%] user_guide/messages/convention/non-ascii-module-import reading sources... [ 13%] user_guide/messages/convention/non-ascii-name reading sources... [ 13%] user_guide/messages/convention/old-misplaced-comparison-constant reading sources... [ 14%] user_guide/messages/convention/old-non-ascii-name reading sources... [ 14%] user_guide/messages/convention/single-string-used-for-slots reading sources... [ 14%] user_guide/messages/convention/singleton-comparison reading sources... [ 14%] user_guide/messages/convention/superfluous-parens reading sources... [ 14%] user_guide/messages/convention/too-many-lines reading sources... [ 14%] user_guide/messages/convention/trailing-newlines reading sources... [ 15%] user_guide/messages/convention/trailing-whitespace reading sources... [ 15%] user_guide/messages/convention/typevar-double-variance reading sources... [ 15%] user_guide/messages/convention/typevar-name-incorrect-variance reading sources... [ 15%] user_guide/messages/convention/typevar-name-mismatch reading sources... [ 15%] user_guide/messages/convention/unexpected-line-ending-format reading sources... [ 16%] user_guide/messages/convention/ungrouped-imports reading sources... [ 16%] user_guide/messages/convention/unidiomatic-typecheck reading sources... [ 16%] user_guide/messages/convention/unnecessary-direct-lambda-call reading sources... [ 16%] user_guide/messages/convention/unnecessary-dunder-call reading sources... [ 16%] user_guide/messages/convention/unnecessary-lambda-assignment reading sources... [ 16%] user_guide/messages/convention/unneeded-not reading sources... [ 17%] user_guide/messages/convention/use-implicit-booleaness-not-comparison reading sources... [ 17%] user_guide/messages/convention/use-implicit-booleaness-not-len reading sources... [ 17%] user_guide/messages/convention/use-maxsplit-arg reading sources... [ 17%] user_guide/messages/convention/use-sequence-for-iteration reading sources... [ 17%] user_guide/messages/convention/useless-import-alias reading sources... [ 18%] user_guide/messages/convention/wrong-import-order reading sources... [ 18%] user_guide/messages/convention/wrong-import-position reading sources... [ 18%] user_guide/messages/convention/wrong-spelling-in-comment reading sources... [ 18%] user_guide/messages/convention/wrong-spelling-in-docstring reading sources... [ 18%] user_guide/messages/error/abstract-class-instantiated reading sources... [ 18%] user_guide/messages/error/access-member-before-definition reading sources... [ 19%] user_guide/messages/error/assigning-non-slot reading sources... [ 19%] user_guide/messages/error/assignment-from-no-return reading sources... [ 19%] user_guide/messages/error/assignment-from-none reading sources... [ 19%] user_guide/messages/error/await-outside-async reading sources... [ 19%] user_guide/messages/error/bad-configuration-section reading sources... [ 20%] user_guide/messages/error/bad-context-manager reading sources... [ 20%] user_guide/messages/error/bad-except-order reading sources... [ 20%] user_guide/messages/error/bad-exception-cause reading sources... [ 20%] user_guide/messages/error/bad-exception-context reading sources... [ 20%] user_guide/messages/error/bad-format-character reading sources... [ 20%] user_guide/messages/error/bad-option-value reading sources... [ 21%] user_guide/messages/error/bad-plugin-value reading sources... [ 21%] user_guide/messages/error/bad-reversed-sequence reading sources... [ 21%] user_guide/messages/error/bad-str-strip-call reading sources... [ 21%] user_guide/messages/error/bad-string-format-type reading sources... [ 21%] user_guide/messages/error/bad-super-call reading sources... [ 22%] user_guide/messages/error/bidirectional-unicode reading sources... [ 22%] user_guide/messages/error/broken-collections-callable reading sources... [ 22%] user_guide/messages/error/broken-noreturn reading sources... [ 22%] user_guide/messages/error/catching-non-exception reading sources... [ 22%] user_guide/messages/error/class-variable-slots-conflict reading sources... [ 22%] user_guide/messages/error/continue-in-finally reading sources... [ 23%] user_guide/messages/error/dict-iter-missing-items reading sources... [ 23%] user_guide/messages/error/duplicate-argument-name reading sources... [ 23%] user_guide/messages/error/duplicate-bases reading sources... [ 23%] user_guide/messages/error/format-needs-mapping reading sources... [ 23%] user_guide/messages/error/function-redefined reading sources... [ 24%] user_guide/messages/error/import-error reading sources... [ 24%] user_guide/messages/error/inconsistent-mro reading sources... [ 24%] user_guide/messages/error/inherit-non-class reading sources... [ 24%] user_guide/messages/error/init-is-generator reading sources... [ 24%] user_guide/messages/error/invalid-all-format reading sources... [ 24%] user_guide/messages/error/invalid-all-object reading sources... [ 25%] user_guide/messages/error/invalid-bool-returned reading sources... [ 25%] user_guide/messages/error/invalid-bytes-returned reading sources... [ 25%] user_guide/messages/error/invalid-character-backspace reading sources... [ 25%] user_guide/messages/error/invalid-character-carriage-return reading sources... [ 25%] user_guide/messages/error/invalid-character-esc reading sources... [ 25%] user_guide/messages/error/invalid-character-nul reading sources... [ 26%] user_guide/messages/error/invalid-character-sub reading sources... [ 26%] user_guide/messages/error/invalid-character-zero-width-space reading sources... [ 26%] user_guide/messages/error/invalid-class-object reading sources... [ 26%] user_guide/messages/error/invalid-enum-extension reading sources... [ 26%] user_guide/messages/error/invalid-envvar-value reading sources... [ 27%] user_guide/messages/error/invalid-format-returned reading sources... [ 27%] user_guide/messages/error/invalid-getnewargs-ex-returned reading sources... [ 27%] user_guide/messages/error/invalid-getnewargs-returned reading sources... [ 27%] user_guide/messages/error/invalid-hash-returned reading sources... [ 27%] user_guide/messages/error/invalid-index-returned reading sources... [ 27%] user_guide/messages/error/invalid-length-hint-returned reading sources... [ 28%] user_guide/messages/error/invalid-length-returned reading sources... [ 28%] user_guide/messages/error/invalid-metaclass reading sources... [ 28%] user_guide/messages/error/invalid-repr-returned reading sources... [ 28%] user_guide/messages/error/invalid-sequence-index reading sources... [ 28%] user_guide/messages/error/invalid-slice-index reading sources... [ 29%] user_guide/messages/error/invalid-slots reading sources... [ 29%] user_guide/messages/error/invalid-slots-object reading sources... [ 29%] user_guide/messages/error/invalid-star-assignment-target reading sources... [ 29%] user_guide/messages/error/invalid-str-returned reading sources... [ 29%] user_guide/messages/error/invalid-unary-operand-type reading sources... [ 29%] user_guide/messages/error/invalid-unicode-codec reading sources... [ 30%] user_guide/messages/error/logging-format-truncated reading sources... [ 30%] user_guide/messages/error/logging-too-few-args reading sources... [ 30%] user_guide/messages/error/logging-too-many-args reading sources... [ 30%] user_guide/messages/error/logging-unsupported-format reading sources... [ 30%] user_guide/messages/error/maybe-no-member reading sources... [ 31%] user_guide/messages/error/method-hidden reading sources... [ 31%] user_guide/messages/error/misplaced-bare-raise reading sources... [ 31%] user_guide/messages/error/misplaced-format-function reading sources... [ 31%] user_guide/messages/error/missing-format-string-key reading sources... [ 31%] user_guide/messages/error/missing-kwoa reading sources... [ 31%] user_guide/messages/error/mixed-format-string reading sources... [ 32%] user_guide/messages/error/modified-iterating-dict reading sources... [ 32%] user_guide/messages/error/modified-iterating-set reading sources... [ 32%] user_guide/messages/error/no-member reading sources... [ 32%] user_guide/messages/error/no-method-argument reading sources... [ 32%] user_guide/messages/error/no-name-in-module reading sources... [ 33%] user_guide/messages/error/no-self-argument reading sources... [ 33%] user_guide/messages/error/no-value-for-parameter reading sources... [ 33%] user_guide/messages/error/non-iterator-returned reading sources... [ 33%] user_guide/messages/error/nonexistent-operator reading sources... [ 33%] user_guide/messages/error/nonlocal-and-global reading sources... [ 33%] user_guide/messages/error/nonlocal-without-binding reading sources... [ 34%] user_guide/messages/error/not-a-mapping reading sources... [ 34%] user_guide/messages/error/not-an-iterable reading sources... [ 34%] user_guide/messages/error/not-async-context-manager reading sources... [ 34%] user_guide/messages/error/not-callable reading sources... [ 34%] user_guide/messages/error/not-context-manager reading sources... [ 35%] user_guide/messages/error/not-in-loop reading sources... [ 35%] user_guide/messages/error/notimplemented-raised reading sources... [ 35%] user_guide/messages/error/old-non-iterator-returned-2 reading sources... [ 35%] user_guide/messages/error/old-unbalanced-tuple-unpacking reading sources... [ 35%] user_guide/messages/error/potential-index-error reading sources... [ 35%] user_guide/messages/error/raising-bad-type reading sources... [ 36%] user_guide/messages/error/raising-non-exception reading sources... [ 36%] user_guide/messages/error/redundant-keyword-arg reading sources... [ 36%] user_guide/messages/error/relative-beyond-top-level reading sources... [ 36%] user_guide/messages/error/repeated-keyword reading sources... [ 36%] user_guide/messages/error/return-arg-in-generator reading sources... [ 37%] user_guide/messages/error/return-in-init reading sources... [ 37%] user_guide/messages/error/return-outside-function reading sources... [ 37%] user_guide/messages/error/star-needs-assignment-target reading sources... [ 37%] user_guide/messages/error/syntax-error reading sources... [ 37%] user_guide/messages/error/too-few-format-args reading sources... [ 37%] user_guide/messages/error/too-many-format-args reading sources... [ 38%] user_guide/messages/error/too-many-function-args reading sources... [ 38%] user_guide/messages/error/too-many-star-expressions reading sources... [ 38%] user_guide/messages/error/truncated-format-string reading sources... [ 38%] user_guide/messages/error/undefined-all-variable reading sources... [ 38%] user_guide/messages/error/undefined-variable reading sources... [ 38%] user_guide/messages/error/unexpected-keyword-arg reading sources... [ 39%] user_guide/messages/error/unexpected-special-method-signature reading sources... [ 39%] user_guide/messages/error/unhashable-dict-key reading sources... [ 39%] user_guide/messages/error/unhashable-member reading sources... [ 39%] user_guide/messages/error/unpacking-non-sequence reading sources... [ 39%] user_guide/messages/error/unrecognized-inline-option reading sources... [ 40%] user_guide/messages/error/unrecognized-option reading sources... [ 40%] user_guide/messages/error/unsubscriptable-object reading sources... [ 40%] user_guide/messages/error/unsupported-assignment-operation reading sources... [ 40%] user_guide/messages/error/unsupported-binary-operation reading sources... [ 40%] user_guide/messages/error/unsupported-delete-operation reading sources... [ 40%] user_guide/messages/error/unsupported-membership-test reading sources... [ 41%] user_guide/messages/error/used-before-assignment reading sources... [ 41%] user_guide/messages/error/used-prior-global-declaration reading sources... [ 41%] user_guide/messages/error/yield-inside-async-function reading sources... [ 41%] user_guide/messages/error/yield-outside-function reading sources... [ 41%] user_guide/messages/fatal/astroid-error reading sources... [ 42%] user_guide/messages/fatal/config-parse-error reading sources... [ 42%] user_guide/messages/fatal/fatal reading sources... [ 42%] user_guide/messages/fatal/method-check-failed reading sources... [ 42%] user_guide/messages/fatal/old-import-error reading sources... [ 42%] user_guide/messages/fatal/parse-error reading sources... [ 42%] user_guide/messages/index reading sources... [ 43%] user_guide/messages/information/bad-inline-option reading sources... [ 43%] user_guide/messages/information/c-extension-no-member reading sources... [ 43%] user_guide/messages/information/deprecated-disable-all reading sources... [ 43%] user_guide/messages/information/deprecated-pragma reading sources... [ 43%] user_guide/messages/information/file-ignored reading sources... [ 44%] user_guide/messages/information/locally-disabled reading sources... [ 44%] user_guide/messages/information/raw-checker-failed reading sources... [ 44%] user_guide/messages/information/suppressed-message reading sources... [ 44%] user_guide/messages/information/use-symbolic-message-instead reading sources... [ 44%] user_guide/messages/information/useless-suppression reading sources... [ 44%] user_guide/messages/message_control reading sources... [ 45%] user_guide/messages/messages_overview reading sources... [ 45%] user_guide/messages/refactor/chained-comparison reading sources... [ 45%] user_guide/messages/refactor/comparison-of-constants reading sources... [ 45%] user_guide/messages/refactor/comparison-with-itself reading sources... [ 45%] user_guide/messages/refactor/condition-evals-to-constant reading sources... [ 46%] user_guide/messages/refactor/confusing-consecutive-elif reading sources... [ 46%] user_guide/messages/refactor/consider-alternative-union-syntax reading sources... [ 46%] user_guide/messages/refactor/consider-merging-isinstance reading sources... [ 46%] user_guide/messages/refactor/consider-swap-variables reading sources... [ 46%] user_guide/messages/refactor/consider-using-alias reading sources... [ 46%] user_guide/messages/refactor/consider-using-assignment-expr reading sources... [ 47%] user_guide/messages/refactor/consider-using-dict-comprehension reading sources... [ 47%] user_guide/messages/refactor/consider-using-from-import reading sources... [ 47%] user_guide/messages/refactor/consider-using-generator reading sources... [ 47%] user_guide/messages/refactor/consider-using-get reading sources... [ 47%] user_guide/messages/refactor/consider-using-in reading sources... [ 48%] user_guide/messages/refactor/consider-using-join reading sources... [ 48%] user_guide/messages/refactor/consider-using-max-builtin reading sources... [ 48%] user_guide/messages/refactor/consider-using-min-builtin reading sources... [ 48%] user_guide/messages/refactor/consider-using-namedtuple-or-dataclass reading sources... [ 48%] user_guide/messages/refactor/consider-using-set-comprehension reading sources... [ 48%] user_guide/messages/refactor/consider-using-sys-exit reading sources... [ 49%] user_guide/messages/refactor/consider-using-ternary reading sources... [ 49%] user_guide/messages/refactor/consider-using-tuple reading sources... [ 49%] user_guide/messages/refactor/consider-using-with reading sources... [ 49%] user_guide/messages/refactor/cyclic-import reading sources... [ 49%] user_guide/messages/refactor/duplicate-code reading sources... [ 50%] user_guide/messages/refactor/else-if-used reading sources... [ 50%] user_guide/messages/refactor/empty-comment reading sources... [ 50%] user_guide/messages/refactor/inconsistent-return-statements reading sources... [ 50%] user_guide/messages/refactor/literal-comparison reading sources... [ 50%] user_guide/messages/refactor/no-classmethod-decorator reading sources... [ 50%] user_guide/messages/refactor/no-else-break reading sources... [ 51%] user_guide/messages/refactor/no-else-continue reading sources... [ 51%] user_guide/messages/refactor/no-else-raise reading sources... [ 51%] user_guide/messages/refactor/no-else-return reading sources... [ 51%] user_guide/messages/refactor/no-self-use reading sources... [ 51%] user_guide/messages/refactor/no-staticmethod-decorator reading sources... [ 51%] user_guide/messages/refactor/old-no-self-use reading sources... [ 52%] user_guide/messages/refactor/old-simplifiable-if-statement reading sources... [ 52%] user_guide/messages/refactor/old-too-many-nested-blocks reading sources... [ 52%] user_guide/messages/refactor/property-with-parameters reading sources... [ 52%] user_guide/messages/refactor/redefined-argument-from-local reading sources... [ 52%] user_guide/messages/refactor/redefined-variable-type reading sources... [ 53%] user_guide/messages/refactor/simplifiable-condition reading sources... [ 53%] user_guide/messages/refactor/simplifiable-if-expression reading sources... [ 53%] user_guide/messages/refactor/simplifiable-if-statement reading sources... [ 53%] user_guide/messages/refactor/simplify-boolean-expression reading sources... [ 53%] user_guide/messages/refactor/stop-iteration-return reading sources... [ 53%] user_guide/messages/refactor/super-with-arguments reading sources... [ 54%] user_guide/messages/refactor/too-complex reading sources... [ 54%] user_guide/messages/refactor/too-few-public-methods reading sources... [ 54%] user_guide/messages/refactor/too-many-ancestors reading sources... [ 54%] user_guide/messages/refactor/too-many-arguments reading sources... [ 54%] user_guide/messages/refactor/too-many-boolean-expressions reading sources... [ 55%] user_guide/messages/refactor/too-many-branches reading sources... [ 55%] user_guide/messages/refactor/too-many-instance-attributes reading sources... [ 55%] user_guide/messages/refactor/too-many-locals reading sources... [ 55%] user_guide/messages/refactor/too-many-nested-blocks reading sources... [ 55%] user_guide/messages/refactor/too-many-public-methods reading sources... [ 55%] user_guide/messages/refactor/too-many-return-statements reading sources... [ 56%] user_guide/messages/refactor/too-many-statements reading sources... [ 56%] user_guide/messages/refactor/trailing-comma-tuple reading sources... [ 56%] user_guide/messages/refactor/unnecessary-comprehension reading sources... [ 56%] user_guide/messages/refactor/unnecessary-dict-index-lookup reading sources... [ 56%] user_guide/messages/refactor/unnecessary-list-index-lookup reading sources... [ 57%] user_guide/messages/refactor/use-a-generator reading sources... [ 57%] user_guide/messages/refactor/use-dict-literal reading sources... [ 57%] user_guide/messages/refactor/use-list-literal reading sources... [ 57%] user_guide/messages/refactor/use-set-for-membership reading sources... [ 57%] user_guide/messages/refactor/useless-object-inheritance reading sources... [ 57%] user_guide/messages/refactor/useless-option-value reading sources... [ 58%] user_guide/messages/refactor/useless-return reading sources... [ 58%] user_guide/messages/warning/abstract-method reading sources... [ 58%] user_guide/messages/warning/anomalous-backslash-in-string reading sources... [ 58%] user_guide/messages/warning/anomalous-unicode-escape-in-string reading sources... [ 58%] user_guide/messages/warning/arguments-differ reading sources... [ 59%] user_guide/messages/warning/arguments-out-of-order reading sources... [ 59%] user_guide/messages/warning/arguments-renamed reading sources... [ 59%] user_guide/messages/warning/assert-on-string-literal reading sources... [ 59%] user_guide/messages/warning/assert-on-tuple reading sources... [ 59%] user_guide/messages/warning/attribute-defined-outside-init reading sources... [ 59%] user_guide/messages/warning/bad-builtin reading sources... [ 60%] user_guide/messages/warning/bad-format-string reading sources... [ 60%] user_guide/messages/warning/bad-format-string-key reading sources... [ 60%] user_guide/messages/warning/bad-indentation reading sources... [ 60%] user_guide/messages/warning/bad-open-mode reading sources... [ 60%] user_guide/messages/warning/bad-staticmethod-argument reading sources... [ 61%] user_guide/messages/warning/bad-thread-instantiation reading sources... [ 61%] user_guide/messages/warning/bare-except reading sources... [ 61%] user_guide/messages/warning/binary-op-exception reading sources... [ 61%] user_guide/messages/warning/boolean-datetime reading sources... [ 61%] user_guide/messages/warning/broad-except reading sources... [ 61%] user_guide/messages/warning/cache-max-size-none reading sources... [ 62%] user_guide/messages/warning/cell-var-from-loop reading sources... [ 62%] user_guide/messages/warning/comparison-with-callable reading sources... [ 62%] user_guide/messages/warning/confusing-with-statement reading sources... [ 62%] user_guide/messages/warning/consider-ternary-expression reading sources... [ 62%] user_guide/messages/warning/dangerous-default-value reading sources... [ 62%] user_guide/messages/warning/deprecated-argument reading sources... [ 63%] user_guide/messages/warning/deprecated-class reading sources... [ 63%] user_guide/messages/warning/deprecated-decorator reading sources... [ 63%] user_guide/messages/warning/deprecated-method reading sources... [ 63%] user_guide/messages/warning/deprecated-module reading sources... [ 63%] user_guide/messages/warning/deprecated-typing-alias reading sources... [ 64%] user_guide/messages/warning/differing-param-doc reading sources... [ 64%] user_guide/messages/warning/differing-type-doc reading sources... [ 64%] user_guide/messages/warning/duplicate-except reading sources... [ 64%] user_guide/messages/warning/duplicate-key reading sources... [ 64%] user_guide/messages/warning/duplicate-string-formatting-argument reading sources... [ 64%] user_guide/messages/warning/duplicate-value reading sources... [ 65%] user_guide/messages/warning/eq-without-hash reading sources... [ 65%] user_guide/messages/warning/eval-used reading sources... [ 65%] user_guide/messages/warning/exec-used reading sources... [ 65%] user_guide/messages/warning/expression-not-assigned reading sources... [ 65%] user_guide/messages/warning/f-string-without-interpolation reading sources... [ 66%] user_guide/messages/warning/fixme reading sources... [ 66%] user_guide/messages/warning/forgotten-debug-statement reading sources... [ 66%] user_guide/messages/warning/format-combined-specification reading sources... [ 66%] user_guide/messages/warning/format-string-without-interpolation reading sources... [ 66%] user_guide/messages/warning/global-at-module-level reading sources... [ 66%] user_guide/messages/warning/global-statement reading sources... [ 67%] user_guide/messages/warning/global-variable-not-assigned reading sources... [ 67%] user_guide/messages/warning/global-variable-undefined reading sources... [ 67%] user_guide/messages/warning/implicit-str-concat reading sources... [ 67%] user_guide/messages/warning/implicit-str-concat-in-sequence reading sources... [ 67%] user_guide/messages/warning/import-self reading sources... [ 68%] user_guide/messages/warning/inconsistent-quotes reading sources... [ 68%] user_guide/messages/warning/invalid-envvar-default reading sources... [ 68%] user_guide/messages/warning/invalid-format-index reading sources... [ 68%] user_guide/messages/warning/invalid-overridden-method reading sources... [ 68%] user_guide/messages/warning/isinstance-second-argument-not-valid-type reading sources... [ 68%] user_guide/messages/warning/keyword-arg-before-vararg reading sources... [ 69%] user_guide/messages/warning/logging-format-interpolation reading sources... [ 69%] user_guide/messages/warning/logging-fstring-interpolation reading sources... [ 69%] user_guide/messages/warning/logging-not-lazy reading sources... [ 69%] user_guide/messages/warning/lost-exception reading sources... [ 69%] user_guide/messages/warning/lru-cache-decorating-method reading sources... [ 70%] user_guide/messages/warning/method-cache-max-size-none reading sources... [ 70%] user_guide/messages/warning/misplaced-future reading sources... [ 70%] user_guide/messages/warning/missing-any-param-doc reading sources... [ 70%] user_guide/messages/warning/missing-format-argument-key reading sources... [ 70%] user_guide/messages/warning/missing-format-attribute reading sources... [ 70%] user_guide/messages/warning/missing-param-doc reading sources... [ 71%] user_guide/messages/warning/missing-parentheses-for-call-in-test reading sources... [ 71%] user_guide/messages/warning/missing-raises-doc reading sources... [ 71%] user_guide/messages/warning/missing-return-doc reading sources... [ 71%] user_guide/messages/warning/missing-return-type-doc reading sources... [ 71%] user_guide/messages/warning/missing-timeout reading sources... [ 72%] user_guide/messages/warning/missing-type-doc reading sources... [ 72%] user_guide/messages/warning/missing-yield-doc reading sources... [ 72%] user_guide/messages/warning/missing-yield-type-doc reading sources... [ 72%] user_guide/messages/warning/modified-iterating-list reading sources... [ 72%] user_guide/messages/warning/multiple-constructor-doc reading sources... [ 72%] user_guide/messages/warning/nan-comparison reading sources... [ 73%] user_guide/messages/warning/non-ascii-file-name reading sources... [ 73%] user_guide/messages/warning/non-parent-init-called reading sources... [ 73%] user_guide/messages/warning/non-str-assignment-to-dunder-name reading sources... [ 73%] user_guide/messages/warning/old-assignment-from-none reading sources... [ 73%] user_guide/messages/warning/old-deprecated-argument reading sources... [ 74%] user_guide/messages/warning/old-deprecated-class reading sources... [ 74%] user_guide/messages/warning/old-deprecated-decorator reading sources... [ 74%] user_guide/messages/warning/old-deprecated-method reading sources... [ 74%] user_guide/messages/warning/old-deprecated-module reading sources... [ 74%] user_guide/messages/warning/old-empty-docstring reading sources... [ 74%] user_guide/messages/warning/old-missing-param-doc reading sources... [ 75%] user_guide/messages/warning/old-missing-returns-doc reading sources... [ 75%] user_guide/messages/warning/old-missing-type-doc reading sources... [ 75%] user_guide/messages/warning/old-missing-yields-doc reading sources... [ 75%] user_guide/messages/warning/old-non-iterator-returned-1 reading sources... [ 75%] user_guide/messages/warning/old-unidiomatic-typecheck reading sources... [ 75%] user_guide/messages/warning/old-unpacking-non-sequence reading sources... [ 76%] user_guide/messages/warning/overlapping-except reading sources... [ 76%] user_guide/messages/warning/overridden-final-method reading sources... [ 76%] user_guide/messages/warning/pointless-statement reading sources... [ 76%] user_guide/messages/warning/pointless-string-statement reading sources... [ 76%] user_guide/messages/warning/possibly-unused-variable reading sources... [ 77%] user_guide/messages/warning/preferred-module reading sources... [ 77%] user_guide/messages/warning/protected-access reading sources... [ 77%] user_guide/messages/warning/raise-missing-from reading sources... [ 77%] user_guide/messages/warning/raising-format-tuple reading sources... [ 77%] user_guide/messages/warning/redeclared-assigned-name reading sources... [ 77%] user_guide/messages/warning/redefined-builtin reading sources... [ 78%] user_guide/messages/warning/redefined-loop-name reading sources... [ 78%] user_guide/messages/warning/redefined-outer-name reading sources... [ 78%] user_guide/messages/warning/redefined-slots-in-subclass reading sources... [ 78%] user_guide/messages/warning/redundant-returns-doc reading sources... [ 78%] user_guide/messages/warning/redundant-u-string-prefix reading sources... [ 79%] user_guide/messages/warning/redundant-unittest-assert reading sources... [ 79%] user_guide/messages/warning/redundant-yields-doc reading sources... [ 79%] user_guide/messages/warning/reimported reading sources... [ 79%] user_guide/messages/warning/self-assigning-variable reading sources... [ 79%] user_guide/messages/warning/self-cls-assignment reading sources... [ 79%] user_guide/messages/warning/shallow-copy-environ reading sources... [ 80%] user_guide/messages/warning/signature-differs reading sources... [ 80%] user_guide/messages/warning/subclassed-final-class reading sources... [ 80%] user_guide/messages/warning/subprocess-popen-preexec-fn reading sources... [ 80%] user_guide/messages/warning/subprocess-run-check reading sources... [ 80%] user_guide/messages/warning/super-init-not-called reading sources... [ 81%] user_guide/messages/warning/super-without-brackets reading sources... [ 81%] user_guide/messages/warning/too-many-try-statements reading sources... [ 81%] user_guide/messages/warning/try-except-raise reading sources... [ 81%] user_guide/messages/warning/unbalanced-tuple-unpacking reading sources... [ 81%] user_guide/messages/warning/undefined-loop-variable reading sources... [ 81%] user_guide/messages/warning/unknown-option-value reading sources... [ 82%] user_guide/messages/warning/unnecessary-ellipsis reading sources... [ 82%] user_guide/messages/warning/unnecessary-lambda reading sources... [ 82%] user_guide/messages/warning/unnecessary-pass reading sources... [ 82%] user_guide/messages/warning/unnecessary-semicolon reading sources... [ 82%] user_guide/messages/warning/unreachable reading sources... [ 83%] user_guide/messages/warning/unspecified-encoding reading sources... [ 83%] user_guide/messages/warning/unused-argument reading sources... [ 83%] user_guide/messages/warning/unused-format-string-argument reading sources... [ 83%] user_guide/messages/warning/unused-format-string-key reading sources... [ 83%] user_guide/messages/warning/unused-import reading sources... [ 83%] user_guide/messages/warning/unused-private-member reading sources... [ 84%] user_guide/messages/warning/unused-variable reading sources... [ 84%] user_guide/messages/warning/unused-wildcard-import reading sources... [ 84%] user_guide/messages/warning/useless-else-on-loop reading sources... [ 84%] user_guide/messages/warning/useless-param-doc reading sources... [ 84%] user_guide/messages/warning/useless-parent-delegation reading sources... [ 85%] user_guide/messages/warning/useless-super-delegation reading sources... [ 85%] user_guide/messages/warning/useless-type-doc reading sources... [ 85%] user_guide/messages/warning/useless-with-lock reading sources... [ 85%] user_guide/messages/warning/using-constant-test reading sources... [ 85%] user_guide/messages/warning/using-f-string-in-unsupported-version reading sources... [ 85%] user_guide/messages/warning/using-final-decorator-in-unsupported-version reading sources... [ 86%] user_guide/messages/warning/while-used reading sources... [ 86%] user_guide/messages/warning/wildcard-import reading sources... [ 86%] user_guide/messages/warning/wrong-exception-operation reading sources... [ 86%] user_guide/usage/index reading sources... [ 86%] user_guide/usage/output reading sources... [ 87%] user_guide/usage/run reading sources... [ 87%] whatsnew/0/0.x reading sources... [ 87%] whatsnew/0/index reading sources... [ 87%] whatsnew/1/1.0 reading sources... [ 87%] whatsnew/1/1.1 reading sources... [ 87%] whatsnew/1/1.2 reading sources... [ 88%] whatsnew/1/1.3 reading sources... [ 88%] whatsnew/1/1.4 reading sources... [ 88%] whatsnew/1/1.5 reading sources... [ 88%] whatsnew/1/1.6/full reading sources... [ 88%] whatsnew/1/1.6/index reading sources... [ 88%] whatsnew/1/1.6/summary reading sources... [ 89%] whatsnew/1/1.7/full reading sources... [ 89%] whatsnew/1/1.7/index reading sources... [ 89%] whatsnew/1/1.7/summary reading sources... [ 89%] whatsnew/1/1.8/full reading sources... [ 89%] whatsnew/1/1.8/index reading sources... [ 90%] whatsnew/1/1.8/summary reading sources... [ 90%] whatsnew/1/1.9/full reading sources... [ 90%] whatsnew/1/1.9/index reading sources... [ 90%] whatsnew/1/1.9/summary reading sources... [ 90%] whatsnew/1/index reading sources... [ 90%] whatsnew/2/2.0/full reading sources... [ 91%] whatsnew/2/2.0/index reading sources... [ 91%] whatsnew/2/2.0/summary reading sources... [ 91%] whatsnew/2/2.1/full reading sources... [ 91%] whatsnew/2/2.1/index reading sources... [ 91%] whatsnew/2/2.1/summary reading sources... [ 92%] whatsnew/2/2.10/full reading sources... [ 92%] whatsnew/2/2.10/index reading sources... [ 92%] whatsnew/2/2.10/summary reading sources... [ 92%] whatsnew/2/2.11/full reading sources... [ 92%] whatsnew/2/2.11/index reading sources... [ 92%] whatsnew/2/2.11/summary reading sources... [ 93%] whatsnew/2/2.12/full reading sources... [ 93%] whatsnew/2/2.12/index reading sources... [ 93%] whatsnew/2/2.12/summary reading sources... [ 93%] whatsnew/2/2.13/full reading sources... [ 93%] whatsnew/2/2.13/index reading sources... [ 94%] whatsnew/2/2.13/summary reading sources... [ 94%] whatsnew/2/2.14/full reading sources... [ 94%] whatsnew/2/2.14/index reading sources... [ 94%] whatsnew/2/2.14/summary reading sources... [ 94%] whatsnew/2/2.15/index reading sources... [ 94%] whatsnew/2/2.16/index reading sources... [ 95%] whatsnew/2/2.2/full reading sources... [ 95%] whatsnew/2/2.2/index reading sources... [ 95%] whatsnew/2/2.2/summary reading sources... [ 95%] whatsnew/2/2.3/full reading sources... [ 95%] whatsnew/2/2.3/index reading sources... [ 96%] whatsnew/2/2.3/summary reading sources... [ 96%] whatsnew/2/2.4/full reading sources... [ 96%] whatsnew/2/2.4/index reading sources... [ 96%] whatsnew/2/2.4/summary reading sources... [ 96%] whatsnew/2/2.5/full reading sources... [ 96%] whatsnew/2/2.5/index reading sources... [ 97%] whatsnew/2/2.5/summary reading sources... [ 97%] whatsnew/2/2.6/full reading sources... [ 97%] whatsnew/2/2.6/index reading sources... [ 97%] whatsnew/2/2.6/summary reading sources... [ 97%] whatsnew/2/2.7/full reading sources... [ 98%] whatsnew/2/2.7/index reading sources... [ 98%] whatsnew/2/2.7/summary reading sources... [ 98%] whatsnew/2/2.8/full reading sources... [ 98%] whatsnew/2/2.8/index reading sources... [ 98%] whatsnew/2/2.8/summary reading sources... [ 98%] whatsnew/2/2.9/full reading sources... [ 99%] whatsnew/2/2.9/index reading sources... [ 99%] whatsnew/2/2.9/summary reading sources... [ 99%] whatsnew/2/index reading sources... [ 99%] whatsnew/full_changelog_explanation reading sources... [ 99%] whatsnew/index reading sources... [100%] whatsnew/summary_explanation looking for now-outdated files... none found pickling environment... done checking consistency... done preparing documents... done writing output... [ 0%] contact /usr/share/python3.10/site-packages/sphinx/builders/html/__init__.py:619: FutureWarning: The configuration setting "embed_images" will be removed in Docutils 1.2. Use "image_loading: link". self.docwriter.write(doctree, destination) writing output... [ 0%] development_guide/api/epylint writing output... [ 0%] development_guide/api/index writing output... [ 0%] development_guide/api/pylint writing output... [ 0%] development_guide/contributor_guide/contribute writing output... [ 1%] development_guide/contributor_guide/index writing output... [ 1%] development_guide/contributor_guide/major_release writing output... [ 1%] development_guide/contributor_guide/minor_release writing output... [ 1%] development_guide/contributor_guide/patch_release writing output... [ 1%] development_guide/contributor_guide/profiling writing output... [ 1%] development_guide/contributor_guide/release writing output... [ 2%] development_guide/contributor_guide/tests/index writing output... [ 2%] development_guide/contributor_guide/tests/install writing output... [ 2%] development_guide/contributor_guide/tests/launching_test writing output... [ 2%] development_guide/contributor_guide/tests/writing_test writing output... [ 2%] development_guide/how_tos/custom_checkers writing output... [ 3%] development_guide/how_tos/index writing output... [ 3%] development_guide/how_tos/plugins writing output... [ 3%] development_guide/how_tos/transform_plugins writing output... [ 3%] development_guide/technical_reference/checkers writing output... [ 3%] development_guide/technical_reference/index writing output... [ 3%] development_guide/technical_reference/startup writing output... [ 4%] faq writing output... [ 4%] index writing output... [ 4%] pyreverse writing output... [ 4%] short_text_contribute writing output... [ 4%] short_text_installation writing output... [ 5%] symilar writing output... [ 5%] tutorial writing output... [ 5%] user_guide/checkers/extensions writing output... [ 5%] user_guide/checkers/features writing output... [ 5%] user_guide/checkers/index writing output... [ 5%] user_guide/configuration/all-options writing output... [ 6%] user_guide/configuration/index writing output... [ 6%] user_guide/installation/badge writing output... [ 6%] user_guide/installation/command_line_installation writing output... [ 6%] user_guide/installation/ide_integration/flymake-emacs writing output... [ 6%] user_guide/installation/ide_integration/index writing output... [ 7%] user_guide/installation/ide_integration/textmate writing output... [ 7%] user_guide/installation/index writing output... [ 7%] user_guide/installation/pre-commit-integration writing output... [ 7%] user_guide/installation/upgrading_pylint writing output... [ 7%] user_guide/installation/with-multiple-interpreters writing output... [ 7%] user_guide/messages/convention/bad-classmethod-argument writing output... [ 8%] user_guide/messages/convention/bad-docstring-quotes writing output... [ 8%] user_guide/messages/convention/bad-file-encoding writing output... [ 8%] user_guide/messages/convention/bad-mcs-classmethod-argument writing output... [ 8%] user_guide/messages/convention/bad-mcs-method-argument writing output... [ 8%] user_guide/messages/convention/blacklisted-name writing output... [ 9%] user_guide/messages/convention/compare-to-empty-string writing output... [ 9%] user_guide/messages/convention/compare-to-zero writing output... [ 9%] user_guide/messages/convention/consider-iterating-dictionary writing output... [ 9%] user_guide/messages/convention/consider-using-any-or-all writing output... [ 9%] user_guide/messages/convention/consider-using-dict-items writing output... [ 9%] user_guide/messages/convention/consider-using-enumerate writing output... [ 10%] user_guide/messages/convention/consider-using-f-string writing output... [ 10%] user_guide/messages/convention/disallowed-name writing output... [ 10%] user_guide/messages/convention/docstring-first-line-empty writing output... [ 10%] user_guide/messages/convention/empty-docstring writing output... [ 10%] user_guide/messages/convention/import-outside-toplevel writing output... [ 11%] user_guide/messages/convention/import-private-name writing output... [ 11%] user_guide/messages/convention/invalid-characters-in-docstring writing output... [ 11%] user_guide/messages/convention/invalid-name writing output... [ 11%] user_guide/messages/convention/len-as-condition writing output... [ 11%] user_guide/messages/convention/line-too-long writing output... [ 11%] user_guide/messages/convention/misplaced-comparison-constant writing output... [ 12%] user_guide/messages/convention/missing-class-docstring writing output... [ 12%] user_guide/messages/convention/missing-docstring writing output... [ 12%] user_guide/messages/convention/missing-final-newline writing output... [ 12%] user_guide/messages/convention/missing-function-docstring writing output... [ 12%] user_guide/messages/convention/missing-module-docstring writing output... [ 12%] user_guide/messages/convention/mixed-line-endings writing output... [ 13%] user_guide/messages/convention/multiple-imports writing output... [ 13%] user_guide/messages/convention/multiple-statements writing output... [ 13%] user_guide/messages/convention/non-ascii-module-import writing output... [ 13%] user_guide/messages/convention/non-ascii-name writing output... [ 13%] user_guide/messages/convention/old-misplaced-comparison-constant writing output... [ 14%] user_guide/messages/convention/old-non-ascii-name writing output... [ 14%] user_guide/messages/convention/single-string-used-for-slots writing output... [ 14%] user_guide/messages/convention/singleton-comparison writing output... [ 14%] user_guide/messages/convention/superfluous-parens writing output... [ 14%] user_guide/messages/convention/too-many-lines writing output... [ 14%] user_guide/messages/convention/trailing-newlines writing output... [ 15%] user_guide/messages/convention/trailing-whitespace writing output... [ 15%] user_guide/messages/convention/typevar-double-variance writing output... [ 15%] user_guide/messages/convention/typevar-name-incorrect-variance writing output... [ 15%] user_guide/messages/convention/typevar-name-mismatch writing output... [ 15%] user_guide/messages/convention/unexpected-line-ending-format writing output... [ 16%] user_guide/messages/convention/ungrouped-imports writing output... [ 16%] user_guide/messages/convention/unidiomatic-typecheck writing output... [ 16%] user_guide/messages/convention/unnecessary-direct-lambda-call writing output... [ 16%] user_guide/messages/convention/unnecessary-dunder-call writing output... [ 16%] user_guide/messages/convention/unnecessary-lambda-assignment writing output... [ 16%] user_guide/messages/convention/unneeded-not writing output... [ 17%] user_guide/messages/convention/use-implicit-booleaness-not-comparison writing output... [ 17%] user_guide/messages/convention/use-implicit-booleaness-not-len writing output... [ 17%] user_guide/messages/convention/use-maxsplit-arg writing output... [ 17%] user_guide/messages/convention/use-sequence-for-iteration writing output... [ 17%] user_guide/messages/convention/useless-import-alias writing output... [ 18%] user_guide/messages/convention/wrong-import-order writing output... [ 18%] user_guide/messages/convention/wrong-import-position writing output... [ 18%] user_guide/messages/convention/wrong-spelling-in-comment writing output... [ 18%] user_guide/messages/convention/wrong-spelling-in-docstring writing output... [ 18%] user_guide/messages/error/abstract-class-instantiated writing output... [ 18%] user_guide/messages/error/access-member-before-definition writing output... [ 19%] user_guide/messages/error/assigning-non-slot writing output... [ 19%] user_guide/messages/error/assignment-from-no-return writing output... [ 19%] user_guide/messages/error/assignment-from-none writing output... [ 19%] user_guide/messages/error/await-outside-async writing output... [ 19%] user_guide/messages/error/bad-configuration-section writing output... [ 20%] user_guide/messages/error/bad-context-manager writing output... [ 20%] user_guide/messages/error/bad-except-order writing output... [ 20%] user_guide/messages/error/bad-exception-cause writing output... [ 20%] user_guide/messages/error/bad-exception-context writing output... [ 20%] user_guide/messages/error/bad-format-character writing output... [ 20%] user_guide/messages/error/bad-option-value writing output... [ 21%] user_guide/messages/error/bad-plugin-value writing output... [ 21%] user_guide/messages/error/bad-reversed-sequence writing output... [ 21%] user_guide/messages/error/bad-str-strip-call writing output... [ 21%] user_guide/messages/error/bad-string-format-type writing output... [ 21%] user_guide/messages/error/bad-super-call writing output... [ 22%] user_guide/messages/error/bidirectional-unicode writing output... [ 22%] user_guide/messages/error/broken-collections-callable writing output... [ 22%] user_guide/messages/error/broken-noreturn writing output... [ 22%] user_guide/messages/error/catching-non-exception writing output... [ 22%] user_guide/messages/error/class-variable-slots-conflict writing output... [ 22%] user_guide/messages/error/continue-in-finally writing output... [ 23%] user_guide/messages/error/dict-iter-missing-items writing output... [ 23%] user_guide/messages/error/duplicate-argument-name writing output... [ 23%] user_guide/messages/error/duplicate-bases writing output... [ 23%] user_guide/messages/error/format-needs-mapping writing output... [ 23%] user_guide/messages/error/function-redefined writing output... [ 24%] user_guide/messages/error/import-error writing output... [ 24%] user_guide/messages/error/inconsistent-mro writing output... [ 24%] user_guide/messages/error/inherit-non-class writing output... [ 24%] user_guide/messages/error/init-is-generator writing output... [ 24%] user_guide/messages/error/invalid-all-format writing output... [ 24%] user_guide/messages/error/invalid-all-object writing output... [ 25%] user_guide/messages/error/invalid-bool-returned writing output... [ 25%] user_guide/messages/error/invalid-bytes-returned writing output... [ 25%] user_guide/messages/error/invalid-character-backspace writing output... [ 25%] user_guide/messages/error/invalid-character-carriage-return writing output... [ 25%] user_guide/messages/error/invalid-character-esc writing output... [ 25%] user_guide/messages/error/invalid-character-nul writing output... [ 26%] user_guide/messages/error/invalid-character-sub writing output... [ 26%] user_guide/messages/error/invalid-character-zero-width-space writing output... [ 26%] user_guide/messages/error/invalid-class-object writing output... [ 26%] user_guide/messages/error/invalid-enum-extension writing output... [ 26%] user_guide/messages/error/invalid-envvar-value writing output... [ 27%] user_guide/messages/error/invalid-format-returned writing output... [ 27%] user_guide/messages/error/invalid-getnewargs-ex-returned writing output... [ 27%] user_guide/messages/error/invalid-getnewargs-returned writing output... [ 27%] user_guide/messages/error/invalid-hash-returned writing output... [ 27%] user_guide/messages/error/invalid-index-returned writing output... [ 27%] user_guide/messages/error/invalid-length-hint-returned writing output... [ 28%] user_guide/messages/error/invalid-length-returned writing output... [ 28%] user_guide/messages/error/invalid-metaclass writing output... [ 28%] user_guide/messages/error/invalid-repr-returned writing output... [ 28%] user_guide/messages/error/invalid-sequence-index writing output... [ 28%] user_guide/messages/error/invalid-slice-index writing output... [ 29%] user_guide/messages/error/invalid-slots writing output... [ 29%] user_guide/messages/error/invalid-slots-object writing output... [ 29%] user_guide/messages/error/invalid-star-assignment-target writing output... [ 29%] user_guide/messages/error/invalid-str-returned writing output... [ 29%] user_guide/messages/error/invalid-unary-operand-type writing output... [ 29%] user_guide/messages/error/invalid-unicode-codec writing output... [ 30%] user_guide/messages/error/logging-format-truncated writing output... [ 30%] user_guide/messages/error/logging-too-few-args writing output... [ 30%] user_guide/messages/error/logging-too-many-args writing output... [ 30%] user_guide/messages/error/logging-unsupported-format writing output... [ 30%] user_guide/messages/error/maybe-no-member writing output... [ 31%] user_guide/messages/error/method-hidden writing output... [ 31%] user_guide/messages/error/misplaced-bare-raise writing output... [ 31%] user_guide/messages/error/misplaced-format-function writing output... [ 31%] user_guide/messages/error/missing-format-string-key writing output... [ 31%] user_guide/messages/error/missing-kwoa writing output... [ 31%] user_guide/messages/error/mixed-format-string writing output... [ 32%] user_guide/messages/error/modified-iterating-dict writing output... [ 32%] user_guide/messages/error/modified-iterating-set writing output... [ 32%] user_guide/messages/error/no-member writing output... [ 32%] user_guide/messages/error/no-method-argument writing output... [ 32%] user_guide/messages/error/no-name-in-module writing output... [ 33%] user_guide/messages/error/no-self-argument writing output... [ 33%] user_guide/messages/error/no-value-for-parameter writing output... [ 33%] user_guide/messages/error/non-iterator-returned writing output... [ 33%] user_guide/messages/error/nonexistent-operator writing output... [ 33%] user_guide/messages/error/nonlocal-and-global writing output... [ 33%] user_guide/messages/error/nonlocal-without-binding writing output... [ 34%] user_guide/messages/error/not-a-mapping writing output... [ 34%] user_guide/messages/error/not-an-iterable writing output... [ 34%] user_guide/messages/error/not-async-context-manager writing output... [ 34%] user_guide/messages/error/not-callable writing output... [ 34%] user_guide/messages/error/not-context-manager writing output... [ 35%] user_guide/messages/error/not-in-loop writing output... [ 35%] user_guide/messages/error/notimplemented-raised writing output... [ 35%] user_guide/messages/error/old-non-iterator-returned-2 writing output... [ 35%] user_guide/messages/error/old-unbalanced-tuple-unpacking writing output... [ 35%] user_guide/messages/error/potential-index-error writing output... [ 35%] user_guide/messages/error/raising-bad-type writing output... [ 36%] user_guide/messages/error/raising-non-exception writing output... [ 36%] user_guide/messages/error/redundant-keyword-arg writing output... [ 36%] user_guide/messages/error/relative-beyond-top-level writing output... [ 36%] user_guide/messages/error/repeated-keyword writing output... [ 36%] user_guide/messages/error/return-arg-in-generator writing output... [ 37%] user_guide/messages/error/return-in-init writing output... [ 37%] user_guide/messages/error/return-outside-function writing output... [ 37%] user_guide/messages/error/star-needs-assignment-target writing output... [ 37%] user_guide/messages/error/syntax-error writing output... [ 37%] user_guide/messages/error/too-few-format-args writing output... [ 37%] user_guide/messages/error/too-many-format-args writing output... [ 38%] user_guide/messages/error/too-many-function-args writing output... [ 38%] user_guide/messages/error/too-many-star-expressions writing output... [ 38%] user_guide/messages/error/truncated-format-string writing output... [ 38%] user_guide/messages/error/undefined-all-variable writing output... [ 38%] user_guide/messages/error/undefined-variable writing output... [ 38%] user_guide/messages/error/unexpected-keyword-arg writing output... [ 39%] user_guide/messages/error/unexpected-special-method-signature writing output... [ 39%] user_guide/messages/error/unhashable-dict-key writing output... [ 39%] user_guide/messages/error/unhashable-member writing output... [ 39%] user_guide/messages/error/unpacking-non-sequence writing output... [ 39%] user_guide/messages/error/unrecognized-inline-option writing output... [ 40%] user_guide/messages/error/unrecognized-option writing output... [ 40%] user_guide/messages/error/unsubscriptable-object writing output... [ 40%] user_guide/messages/error/unsupported-assignment-operation writing output... [ 40%] user_guide/messages/error/unsupported-binary-operation writing output... [ 40%] user_guide/messages/error/unsupported-delete-operation writing output... [ 40%] user_guide/messages/error/unsupported-membership-test writing output... [ 41%] user_guide/messages/error/used-before-assignment writing output... [ 41%] user_guide/messages/error/used-prior-global-declaration writing output... [ 41%] user_guide/messages/error/yield-inside-async-function writing output... [ 41%] user_guide/messages/error/yield-outside-function writing output... [ 41%] user_guide/messages/fatal/astroid-error writing output... [ 42%] user_guide/messages/fatal/config-parse-error writing output... [ 42%] user_guide/messages/fatal/fatal writing output... [ 42%] user_guide/messages/fatal/method-check-failed writing output... [ 42%] user_guide/messages/fatal/old-import-error writing output... [ 42%] user_guide/messages/fatal/parse-error writing output... [ 42%] user_guide/messages/index writing output... [ 43%] user_guide/messages/information/bad-inline-option writing output... [ 43%] user_guide/messages/information/c-extension-no-member writing output... [ 43%] user_guide/messages/information/deprecated-disable-all writing output... [ 43%] user_guide/messages/information/deprecated-pragma writing output... [ 43%] user_guide/messages/information/file-ignored writing output... [ 44%] user_guide/messages/information/locally-disabled writing output... [ 44%] user_guide/messages/information/raw-checker-failed writing output... [ 44%] user_guide/messages/information/suppressed-message writing output... [ 44%] user_guide/messages/information/use-symbolic-message-instead writing output... [ 44%] user_guide/messages/information/useless-suppression writing output... [ 44%] user_guide/messages/message_control writing output... [ 45%] user_guide/messages/messages_overview writing output... [ 45%] user_guide/messages/refactor/chained-comparison writing output... [ 45%] user_guide/messages/refactor/comparison-of-constants writing output... [ 45%] user_guide/messages/refactor/comparison-with-itself writing output... [ 45%] user_guide/messages/refactor/condition-evals-to-constant writing output... [ 46%] user_guide/messages/refactor/confusing-consecutive-elif writing output... [ 46%] user_guide/messages/refactor/consider-alternative-union-syntax writing output... [ 46%] user_guide/messages/refactor/consider-merging-isinstance writing output... [ 46%] user_guide/messages/refactor/consider-swap-variables writing output... [ 46%] user_guide/messages/refactor/consider-using-alias writing output... [ 46%] user_guide/messages/refactor/consider-using-assignment-expr writing output... [ 47%] user_guide/messages/refactor/consider-using-dict-comprehension writing output... [ 47%] user_guide/messages/refactor/consider-using-from-import writing output... [ 47%] user_guide/messages/refactor/consider-using-generator writing output... [ 47%] user_guide/messages/refactor/consider-using-get writing output... [ 47%] user_guide/messages/refactor/consider-using-in writing output... [ 48%] user_guide/messages/refactor/consider-using-join writing output... [ 48%] user_guide/messages/refactor/consider-using-max-builtin writing output... [ 48%] user_guide/messages/refactor/consider-using-min-builtin writing output... [ 48%] user_guide/messages/refactor/consider-using-namedtuple-or-dataclass writing output... [ 48%] user_guide/messages/refactor/consider-using-set-comprehension writing output... [ 48%] user_guide/messages/refactor/consider-using-sys-exit writing output... [ 49%] user_guide/messages/refactor/consider-using-ternary writing output... [ 49%] user_guide/messages/refactor/consider-using-tuple writing output... [ 49%] user_guide/messages/refactor/consider-using-with writing output... [ 49%] user_guide/messages/refactor/cyclic-import writing output... [ 49%] user_guide/messages/refactor/duplicate-code writing output... [ 50%] user_guide/messages/refactor/else-if-used writing output... [ 50%] user_guide/messages/refactor/empty-comment writing output... [ 50%] user_guide/messages/refactor/inconsistent-return-statements writing output... [ 50%] user_guide/messages/refactor/literal-comparison writing output... [ 50%] user_guide/messages/refactor/no-classmethod-decorator writing output... [ 50%] user_guide/messages/refactor/no-else-break writing output... [ 51%] user_guide/messages/refactor/no-else-continue writing output... [ 51%] user_guide/messages/refactor/no-else-raise writing output... [ 51%] user_guide/messages/refactor/no-else-return writing output... [ 51%] user_guide/messages/refactor/no-self-use writing output... [ 51%] user_guide/messages/refactor/no-staticmethod-decorator writing output... [ 51%] user_guide/messages/refactor/old-no-self-use writing output... [ 52%] user_guide/messages/refactor/old-simplifiable-if-statement writing output... [ 52%] user_guide/messages/refactor/old-too-many-nested-blocks writing output... [ 52%] user_guide/messages/refactor/property-with-parameters writing output... [ 52%] user_guide/messages/refactor/redefined-argument-from-local writing output... [ 52%] user_guide/messages/refactor/redefined-variable-type writing output... [ 53%] user_guide/messages/refactor/simplifiable-condition writing output... [ 53%] user_guide/messages/refactor/simplifiable-if-expression writing output... [ 53%] user_guide/messages/refactor/simplifiable-if-statement writing output... [ 53%] user_guide/messages/refactor/simplify-boolean-expression writing output... [ 53%] user_guide/messages/refactor/stop-iteration-return writing output... [ 53%] user_guide/messages/refactor/super-with-arguments writing output... [ 54%] user_guide/messages/refactor/too-complex writing output... [ 54%] user_guide/messages/refactor/too-few-public-methods writing output... [ 54%] user_guide/messages/refactor/too-many-ancestors writing output... [ 54%] user_guide/messages/refactor/too-many-arguments writing output... [ 54%] user_guide/messages/refactor/too-many-boolean-expressions writing output... [ 55%] user_guide/messages/refactor/too-many-branches writing output... [ 55%] user_guide/messages/refactor/too-many-instance-attributes writing output... [ 55%] user_guide/messages/refactor/too-many-locals writing output... [ 55%] user_guide/messages/refactor/too-many-nested-blocks writing output... [ 55%] user_guide/messages/refactor/too-many-public-methods writing output... [ 55%] user_guide/messages/refactor/too-many-return-statements writing output... [ 56%] user_guide/messages/refactor/too-many-statements writing output... [ 56%] user_guide/messages/refactor/trailing-comma-tuple writing output... [ 56%] user_guide/messages/refactor/unnecessary-comprehension writing output... [ 56%] user_guide/messages/refactor/unnecessary-dict-index-lookup writing output... [ 56%] user_guide/messages/refactor/unnecessary-list-index-lookup writing output... [ 57%] user_guide/messages/refactor/use-a-generator writing output... [ 57%] user_guide/messages/refactor/use-dict-literal writing output... [ 57%] user_guide/messages/refactor/use-list-literal writing output... [ 57%] user_guide/messages/refactor/use-set-for-membership writing output... [ 57%] user_guide/messages/refactor/useless-object-inheritance writing output... [ 57%] user_guide/messages/refactor/useless-option-value writing output... [ 58%] user_guide/messages/refactor/useless-return writing output... [ 58%] user_guide/messages/warning/abstract-method writing output... [ 58%] user_guide/messages/warning/anomalous-backslash-in-string writing output... [ 58%] user_guide/messages/warning/anomalous-unicode-escape-in-string writing output... [ 58%] user_guide/messages/warning/arguments-differ writing output... [ 59%] user_guide/messages/warning/arguments-out-of-order writing output... [ 59%] user_guide/messages/warning/arguments-renamed writing output... [ 59%] user_guide/messages/warning/assert-on-string-literal writing output... [ 59%] user_guide/messages/warning/assert-on-tuple writing output... [ 59%] user_guide/messages/warning/attribute-defined-outside-init writing output... [ 59%] user_guide/messages/warning/bad-builtin writing output... [ 60%] user_guide/messages/warning/bad-format-string writing output... [ 60%] user_guide/messages/warning/bad-format-string-key writing output... [ 60%] user_guide/messages/warning/bad-indentation writing output... [ 60%] user_guide/messages/warning/bad-open-mode writing output... [ 60%] user_guide/messages/warning/bad-staticmethod-argument writing output... [ 61%] user_guide/messages/warning/bad-thread-instantiation writing output... [ 61%] user_guide/messages/warning/bare-except writing output... [ 61%] user_guide/messages/warning/binary-op-exception writing output... [ 61%] user_guide/messages/warning/boolean-datetime writing output... [ 61%] user_guide/messages/warning/broad-except writing output... [ 61%] user_guide/messages/warning/cache-max-size-none writing output... [ 62%] user_guide/messages/warning/cell-var-from-loop writing output... [ 62%] user_guide/messages/warning/comparison-with-callable writing output... [ 62%] user_guide/messages/warning/confusing-with-statement writing output... [ 62%] user_guide/messages/warning/consider-ternary-expression writing output... [ 62%] user_guide/messages/warning/dangerous-default-value writing output... [ 62%] user_guide/messages/warning/deprecated-argument writing output... [ 63%] user_guide/messages/warning/deprecated-class writing output... [ 63%] user_guide/messages/warning/deprecated-decorator writing output... [ 63%] user_guide/messages/warning/deprecated-method writing output... [ 63%] user_guide/messages/warning/deprecated-module writing output... [ 63%] user_guide/messages/warning/deprecated-typing-alias writing output... [ 64%] user_guide/messages/warning/differing-param-doc writing output... [ 64%] user_guide/messages/warning/differing-type-doc writing output... [ 64%] user_guide/messages/warning/duplicate-except writing output... [ 64%] user_guide/messages/warning/duplicate-key writing output... [ 64%] user_guide/messages/warning/duplicate-string-formatting-argument writing output... [ 64%] user_guide/messages/warning/duplicate-value writing output... [ 65%] user_guide/messages/warning/eq-without-hash writing output... [ 65%] user_guide/messages/warning/eval-used writing output... [ 65%] user_guide/messages/warning/exec-used writing output... [ 65%] user_guide/messages/warning/expression-not-assigned writing output... [ 65%] user_guide/messages/warning/f-string-without-interpolation writing output... [ 66%] user_guide/messages/warning/fixme writing output... [ 66%] user_guide/messages/warning/forgotten-debug-statement writing output... [ 66%] user_guide/messages/warning/format-combined-specification writing output... [ 66%] user_guide/messages/warning/format-string-without-interpolation writing output... [ 66%] user_guide/messages/warning/global-at-module-level writing output... [ 66%] user_guide/messages/warning/global-statement writing output... [ 67%] user_guide/messages/warning/global-variable-not-assigned writing output... [ 67%] user_guide/messages/warning/global-variable-undefined writing output... [ 67%] user_guide/messages/warning/implicit-str-concat writing output... [ 67%] user_guide/messages/warning/implicit-str-concat-in-sequence writing output... [ 67%] user_guide/messages/warning/import-self writing output... [ 68%] user_guide/messages/warning/inconsistent-quotes writing output... [ 68%] user_guide/messages/warning/invalid-envvar-default writing output... [ 68%] user_guide/messages/warning/invalid-format-index writing output... [ 68%] user_guide/messages/warning/invalid-overridden-method writing output... [ 68%] user_guide/messages/warning/isinstance-second-argument-not-valid-type writing output... [ 68%] user_guide/messages/warning/keyword-arg-before-vararg writing output... [ 69%] user_guide/messages/warning/logging-format-interpolation writing output... [ 69%] user_guide/messages/warning/logging-fstring-interpolation writing output... [ 69%] user_guide/messages/warning/logging-not-lazy writing output... [ 69%] user_guide/messages/warning/lost-exception writing output... [ 69%] user_guide/messages/warning/lru-cache-decorating-method writing output... [ 70%] user_guide/messages/warning/method-cache-max-size-none writing output... [ 70%] user_guide/messages/warning/misplaced-future writing output... [ 70%] user_guide/messages/warning/missing-any-param-doc writing output... [ 70%] user_guide/messages/warning/missing-format-argument-key writing output... [ 70%] user_guide/messages/warning/missing-format-attribute writing output... [ 70%] user_guide/messages/warning/missing-param-doc writing output... [ 71%] user_guide/messages/warning/missing-parentheses-for-call-in-test writing output... [ 71%] user_guide/messages/warning/missing-raises-doc writing output... [ 71%] user_guide/messages/warning/missing-return-doc writing output... [ 71%] user_guide/messages/warning/missing-return-type-doc writing output... [ 71%] user_guide/messages/warning/missing-timeout writing output... [ 72%] user_guide/messages/warning/missing-type-doc writing output... [ 72%] user_guide/messages/warning/missing-yield-doc writing output... [ 72%] user_guide/messages/warning/missing-yield-type-doc writing output... [ 72%] user_guide/messages/warning/modified-iterating-list writing output... [ 72%] user_guide/messages/warning/multiple-constructor-doc writing output... [ 72%] user_guide/messages/warning/nan-comparison writing output... [ 73%] user_guide/messages/warning/non-ascii-file-name writing output... [ 73%] user_guide/messages/warning/non-parent-init-called writing output... [ 73%] user_guide/messages/warning/non-str-assignment-to-dunder-name writing output... [ 73%] user_guide/messages/warning/old-assignment-from-none writing output... [ 73%] user_guide/messages/warning/old-deprecated-argument writing output... [ 74%] user_guide/messages/warning/old-deprecated-class writing output... [ 74%] user_guide/messages/warning/old-deprecated-decorator writing output... [ 74%] user_guide/messages/warning/old-deprecated-method writing output... [ 74%] user_guide/messages/warning/old-deprecated-module writing output... [ 74%] user_guide/messages/warning/old-empty-docstring writing output... [ 74%] user_guide/messages/warning/old-missing-param-doc writing output... [ 75%] user_guide/messages/warning/old-missing-returns-doc writing output... [ 75%] user_guide/messages/warning/old-missing-type-doc writing output... [ 75%] user_guide/messages/warning/old-missing-yields-doc writing output... [ 75%] user_guide/messages/warning/old-non-iterator-returned-1 writing output... [ 75%] user_guide/messages/warning/old-unidiomatic-typecheck writing output... [ 75%] user_guide/messages/warning/old-unpacking-non-sequence writing output... [ 76%] user_guide/messages/warning/overlapping-except writing output... [ 76%] user_guide/messages/warning/overridden-final-method writing output... [ 76%] user_guide/messages/warning/pointless-statement writing output... [ 76%] user_guide/messages/warning/pointless-string-statement writing output... [ 76%] user_guide/messages/warning/possibly-unused-variable writing output... [ 77%] user_guide/messages/warning/preferred-module writing output... [ 77%] user_guide/messages/warning/protected-access writing output... [ 77%] user_guide/messages/warning/raise-missing-from writing output... [ 77%] user_guide/messages/warning/raising-format-tuple writing output... [ 77%] user_guide/messages/warning/redeclared-assigned-name writing output... [ 77%] user_guide/messages/warning/redefined-builtin writing output... [ 78%] user_guide/messages/warning/redefined-loop-name writing output... [ 78%] user_guide/messages/warning/redefined-outer-name writing output... [ 78%] user_guide/messages/warning/redefined-slots-in-subclass writing output... [ 78%] user_guide/messages/warning/redundant-returns-doc writing output... [ 78%] user_guide/messages/warning/redundant-u-string-prefix writing output... [ 79%] user_guide/messages/warning/redundant-unittest-assert writing output... [ 79%] user_guide/messages/warning/redundant-yields-doc writing output... [ 79%] user_guide/messages/warning/reimported writing output... [ 79%] user_guide/messages/warning/self-assigning-variable writing output... [ 79%] user_guide/messages/warning/self-cls-assignment writing output... [ 79%] user_guide/messages/warning/shallow-copy-environ writing output... [ 80%] user_guide/messages/warning/signature-differs writing output... [ 80%] user_guide/messages/warning/subclassed-final-class writing output... [ 80%] user_guide/messages/warning/subprocess-popen-preexec-fn writing output... [ 80%] user_guide/messages/warning/subprocess-run-check writing output... [ 80%] user_guide/messages/warning/super-init-not-called writing output... [ 81%] user_guide/messages/warning/super-without-brackets writing output... [ 81%] user_guide/messages/warning/too-many-try-statements writing output... [ 81%] user_guide/messages/warning/try-except-raise writing output... [ 81%] user_guide/messages/warning/unbalanced-tuple-unpacking writing output... [ 81%] user_guide/messages/warning/undefined-loop-variable writing output... [ 81%] user_guide/messages/warning/unknown-option-value writing output... [ 82%] user_guide/messages/warning/unnecessary-ellipsis writing output... [ 82%] user_guide/messages/warning/unnecessary-lambda writing output... [ 82%] user_guide/messages/warning/unnecessary-pass writing output... [ 82%] user_guide/messages/warning/unnecessary-semicolon writing output... [ 82%] user_guide/messages/warning/unreachable writing output... [ 83%] user_guide/messages/warning/unspecified-encoding writing output... [ 83%] user_guide/messages/warning/unused-argument writing output... [ 83%] user_guide/messages/warning/unused-format-string-argument writing output... [ 83%] user_guide/messages/warning/unused-format-string-key writing output... [ 83%] user_guide/messages/warning/unused-import writing output... [ 83%] user_guide/messages/warning/unused-private-member writing output... [ 84%] user_guide/messages/warning/unused-variable writing output... [ 84%] user_guide/messages/warning/unused-wildcard-import writing output... [ 84%] user_guide/messages/warning/useless-else-on-loop writing output... [ 84%] user_guide/messages/warning/useless-param-doc writing output... [ 84%] user_guide/messages/warning/useless-parent-delegation writing output... [ 85%] user_guide/messages/warning/useless-super-delegation writing output... [ 85%] user_guide/messages/warning/useless-type-doc writing output... [ 85%] user_guide/messages/warning/useless-with-lock writing output... [ 85%] user_guide/messages/warning/using-constant-test writing output... [ 85%] user_guide/messages/warning/using-f-string-in-unsupported-version writing output... [ 85%] user_guide/messages/warning/using-final-decorator-in-unsupported-version writing output... [ 86%] user_guide/messages/warning/while-used writing output... [ 86%] user_guide/messages/warning/wildcard-import writing output... [ 86%] user_guide/messages/warning/wrong-exception-operation writing output... [ 86%] user_guide/usage/index writing output... [ 86%] user_guide/usage/output writing output... [ 87%] user_guide/usage/run writing output... [ 87%] whatsnew/0/0.x writing output... [ 87%] whatsnew/0/index writing output... [ 87%] whatsnew/1/1.0 writing output... [ 87%] whatsnew/1/1.1 writing output... [ 87%] whatsnew/1/1.2 writing output... [ 88%] whatsnew/1/1.3 writing output... [ 88%] whatsnew/1/1.4 writing output... [ 88%] whatsnew/1/1.5 writing output... [ 88%] whatsnew/1/1.6/full writing output... [ 88%] whatsnew/1/1.6/index writing output... [ 88%] whatsnew/1/1.6/summary writing output... [ 89%] whatsnew/1/1.7/full writing output... [ 89%] whatsnew/1/1.7/index writing output... [ 89%] whatsnew/1/1.7/summary writing output... [ 89%] whatsnew/1/1.8/full writing output... [ 89%] whatsnew/1/1.8/index writing output... [ 90%] whatsnew/1/1.8/summary writing output... [ 90%] whatsnew/1/1.9/full writing output... [ 90%] whatsnew/1/1.9/index writing output... [ 90%] whatsnew/1/1.9/summary writing output... [ 90%] whatsnew/1/index writing output... [ 90%] whatsnew/2/2.0/full writing output... [ 91%] whatsnew/2/2.0/index writing output... [ 91%] whatsnew/2/2.0/summary writing output... [ 91%] whatsnew/2/2.1/full writing output... [ 91%] whatsnew/2/2.1/index writing output... [ 91%] whatsnew/2/2.1/summary writing output... [ 92%] whatsnew/2/2.10/full writing output... [ 92%] whatsnew/2/2.10/index writing output... [ 92%] whatsnew/2/2.10/summary writing output... [ 92%] whatsnew/2/2.11/full writing output... [ 92%] whatsnew/2/2.11/index writing output... [ 92%] whatsnew/2/2.11/summary writing output... [ 93%] whatsnew/2/2.12/full writing output... [ 93%] whatsnew/2/2.12/index writing output... [ 93%] whatsnew/2/2.12/summary writing output... [ 93%] whatsnew/2/2.13/full writing output... [ 93%] whatsnew/2/2.13/index writing output... [ 94%] whatsnew/2/2.13/summary writing output... [ 94%] whatsnew/2/2.14/full writing output... [ 94%] whatsnew/2/2.14/index writing output... [ 94%] whatsnew/2/2.14/summary writing output... [ 94%] whatsnew/2/2.15/index writing output... [ 94%] whatsnew/2/2.16/index writing output... [ 95%] whatsnew/2/2.2/full writing output... [ 95%] whatsnew/2/2.2/index writing output... [ 95%] whatsnew/2/2.2/summary writing output... [ 95%] whatsnew/2/2.3/full writing output... [ 95%] whatsnew/2/2.3/index writing output... [ 96%] whatsnew/2/2.3/summary writing output... [ 96%] whatsnew/2/2.4/full writing output... [ 96%] whatsnew/2/2.4/index writing output... [ 96%] whatsnew/2/2.4/summary writing output... [ 96%] whatsnew/2/2.5/full writing output... [ 96%] whatsnew/2/2.5/index writing output... [ 97%] whatsnew/2/2.5/summary writing output... [ 97%] whatsnew/2/2.6/full writing output... [ 97%] whatsnew/2/2.6/index writing output... [ 97%] whatsnew/2/2.6/summary writing output... [ 97%] whatsnew/2/2.7/full writing output... [ 98%] whatsnew/2/2.7/index writing output... [ 98%] whatsnew/2/2.7/summary writing output... [ 98%] whatsnew/2/2.8/full writing output... [ 98%] whatsnew/2/2.8/index writing output... [ 98%] whatsnew/2/2.8/summary writing output... [ 98%] whatsnew/2/2.9/full writing output... [ 99%] whatsnew/2/2.9/index writing output... [ 99%] whatsnew/2/2.9/summary writing output... [ 99%] whatsnew/2/index writing output... [ 99%] whatsnew/full_changelog_explanation writing output... [ 99%] whatsnew/index writing output... [100%] whatsnew/summary_explanation generating indices... genindex done Creating redirect file 'additional_commands/index.html' pointing to '../index.html'. Creating redirect file 'development_guide/index.html' pointing to 'api/index.html'. Creating redirect file 'development_guide/contribute.html' pointing to '../development_guide/contributor_guide/index.html'. Creating redirect file 'development_guide/contributor_guide.html' pointing to 'contributor_guide/index.html'. Creating redirect file 'development_guide/profiling.html' pointing to '../development_guide/contributor_guide/profiling.html'. Creating redirect file 'development_guide/tests/index.html' pointing to '../contributor_guide/tests/index.html'. Creating redirect file 'development_guide/tests/install.html' pointing to '../contributor_guide/tests/install.html'. Creating redirect file 'development_guide/tests/launching_test.html' pointing to '../contributor_guide/tests/launching_test.html'. Creating redirect file 'development_guide/tests/writting_test.html' pointing to '../contributor_guide/tests/writing_test.html'. Creating redirect file 'development/testing.html' pointing to 'tests/index.html'. Creating redirect file 'how_tos/custom_checkers.html' pointing to '../development_guide/how_tos/custom_checkers.html'. Creating redirect file 'how_tos/index.html' pointing to '../development_guide/how_tos/index.html'. Creating redirect file 'how_tos/plugins.html' pointing to '../development_guide/how_tos/plugins.html'. Creating redirect file 'how_tos/transform_plugins.html' pointing to '../development_guide/how_tos/transform_plugins.html'. Creating redirect file 'intro.html' pointing to 'index.html'. Creating redirect file 'messages/messages_introduction.html' pointing to '../user_guide/messages/index.html'. Creating redirect file 'messages/messages_list.html' pointing to '../user_guide/messages/messages_overview.html'. Creating redirect file 'support.html' pointing to 'contact.html'. Creating redirect file 'technical_reference/c_extensions.html' pointing to '../user_guide/messages/error/no-member.html'. Creating redirect file 'technical_reference/extensions.html' pointing to '../user_guide/checkers/extensions.html'. Creating redirect file 'technical_reference/checkers.html' pointing to '../development_guide/technical_reference/checkers.html'. Creating redirect file 'technical_reference/features.html' pointing to '../user_guide/checkers/features.html'. Creating redirect file 'technical_reference/index.html' pointing to '../development_guide/technical_reference/index.html'. Creating redirect file 'technical_reference/startup.html' pointing to '../development_guide/technical_reference/startup.html'. Creating redirect file 'user_guide/configuration/naming-styles.html' pointing to '../user_guide/messages/convention/invalid-name.html'. Creating redirect file 'user_guide/ide_integration/flymake-emacs.html' pointing to '../installation/ide_integration/flymake-emacs.html'. Creating redirect file 'user_guide/ide_integration/ide-integration.html' pointing to '../installation/ide_integration/index.html'. Creating redirect file 'user_guide/ide-integration.html' pointing to 'installation.html'. Creating redirect file 'user_guide/ide_integration/textmate.html' pointing to '../installation/ide_integration/textmate.html'. Creating redirect file 'user_guide/index.html' pointing to 'installation/index.html'. Creating redirect file 'user_guide/message-control.html' pointing to 'messages/message_control.html'. Creating redirect file 'user_guide/options.html' pointing to 'configuration/all-options.html'. Creating redirect file 'user_guide/output.html' pointing to 'usage/output.html'. Creating redirect file 'user_guide/pre-commit-integration.html' pointing to 'installation/pre-commit-integration.html'. Creating redirect file 'user_guide/run.html' pointing to 'usage/run.html'. writing additional pages... search done copying images... [ 25%] media/Tidelift_Logos_RGB_Tidelift_Shorthand_On-White.png copying images... [ 50%] media/pyreverse_example_classes.png copying images... [ 75%] media/pyreverse_example_packages.png copying images... [100%] media/ClassChecker_diagram.png copying static files... done copying extra files... done dumping search index in English (code: en)... done dumping object inventory... done build finished with problems, 2 warnings. make: *** [Makefile:49: build-html] Error 1 make: Leaving directory '/tmp/B.f0kk72b1/BUILD/pylint-2.15.2/doc' error: Bad exit status from /tmp/B.f0kk72b1/BUILD/tmp/rpm-tmp.ibamnr (%build) RPM build errors: Bad exit status from /tmp/B.f0kk72b1/BUILD/tmp/rpm-tmp.ibamnr (%build) ended at: Sun Sep 18 15:16:38 2022, done in 0:05:47.816206 error: No files produced. + chmod -R u+rwX /tmp/B.f0kk72b1/BUILD + rm -rf /tmp/B.f0kk72b1/tmp /tmp/B.f0kk72b1/BUILD + rm -rf /tmp/B.f0kk72b1 Begin-PLD-Builder-Info Build-Time: user:355.96s sys:3.80s real:372.33s (faults io:22 non-io:447519) End-PLD-Builder-Info
[Back to list of logs] [View rpm -qa of builder]