FailedOk

th/SRPMS[OK]
th/x32[OK]
th/i686[OK]
th/x86_64[OK]

ac/SRPMS[OK]
ac/i386[OK]
ac/i586[OK]
ac/i686[OK]
ac/alpha[OK]
ac/amd64[OK]
ac/athlon[OK]
ac/ppc[OK]
ac/sparc[OK]
ac/sparc64[OK]

Advanced Search
main()
Powered by PLD Linux
(c) 2002-2021 PLD Team
$Revision: 1.37 $
Powered by power.
Your IP: 34.207.230.188

python-billiard 8a49281d-0517-4ee8-99ef-d9319de44eab

Status:Failed
Source URL:https://buildlogs.pld-linux.org/pld/th/x32/FAIL/python-billiard,8a49281d-0517-4ee8-99ef-d9319de44eab.bz2
text/plain URL:View!
rpm -qa of builder:View!
Date:2021/11/21 03:50:12
Runtime:0:00:07.453517

Toc:

  • prep
  • Executing(%prep): /bin/sh -e /tmp/B.t18zrnpu/BUILD/tmp/rpm-tmp.N2OcZe
  • build
  • Executing(%build): /bin/sh -e /tmp/B.t18zrnpu/BUILD/tmp/rpm-tmp.5snWe1
  • error 1
  • E TypeError: fork_exec() takes exactly 21 arguments (17 given)
  • error 2
  • FAILED t/unit/test_spawn.py::test_spawn::test_start - TypeError: fork_exec() ...
  • error 3
  • error: Bad exit status from /tmp/B.t18zrnpu/BUILD/tmp/rpm-tmp.5snWe1 (%build)
  • error 4
  • RPM build errors:
  • error 5
  • error: No files produced.

Content:

request from: baggins
checking if we should skip the build
started at: Sun Nov 21 03:50:03 2021
killing old processes on a builder
sending signal 9 to pid -1
cleaning up /tmp
fetching https://srcbuilder.pld-linux.org/th//srpms/8a49281d-0517-4ee8-99ef-d9319de44eab/python-billiard-3.6.3.0-3.src.rpm
fetched 166645 bytes, 565.9 K/s
installing srpm: python-billiard-3.6.3.0-3.src.rpm
+ install -d /tmp/B.t18zrnpu/BUILD /tmp/B.t18zrnpu/RPMS
+ LC_ALL=en_US.UTF-8
+ rpm -qp --changelog python-billiard-3.6.3.0-3.src.rpm
* Sat Nov 20 2021 PLD Linux Team <feedback@pld-linux.org>
- For complete changelog see: http://git.pld-linux.org/?p=packages/python-billiard.git;a=log;h=master
* Sat Nov 20 2021 Jan Rękorajski <baggins@pld-linux.org> 01bfbc2
- rebuild with separate debuginfo build-ids * Sun Mar 07 2021 Jan Rękorajski <baggins@pld-linux.org> cd4df65
- unconditional noarch subpackages * Sat Feb 27 2021 Jan Rękorajski <baggins@pld-linux.org> a2f3b60
- release 2 (by relup.sh) * Thu Jan 28 2021 Jakub Bogusz <qboosh@pld-linux.org> 5a836b5
- updated to 3.6.3.0 * Mon Feb 17 2020 Arkadiusz Miśkiewicz <arekm@maven.pl> c13aee0
- up to 3.6.2.0 * Mon Oct 28 2019 Jan Rękorajski <baggins@pld-linux.org> f69e2b7
- rebuild with python 3.8 - release 2 (by relup.sh) * Wed Sep 26 2018 Jacek Konieczny <j.konieczny@eggsoft.pl> 9f3d244
- Version: 3.5.0.4 * Sun Jul 01 2018 Arkadiusz Miśkiewicz <arekm@maven.pl> b93f58c
- python 3.7 rebuild - release 6 (by relup.sh) * Thu Dec 29 2016 Arkadiusz Miśkiewicz <arekm@maven.pl> f56307d
- python 3.6 - release 5 (by relup.sh) * Fri Apr 29 2016 Elan Ruusamäe <glen@delfi.ee> af8f28b
- noarch apidocs * Mon Nov 30 2015 Jacek Konieczny <jajcus@jajcus.net> 885a85c
- release 3 (by relup.sh) * Sun Nov 29 2015 Jacek Konieczny <jajcus@jajcus.net> eabe653
- BR: rpmbuild(macros) >= 1.710 * Sat Nov 28 2015 Jacek Konieczny <jajcus@jajcus.net> 02c0605
- release 2 (by relup.sh) * Sat Nov 28 2015 Jacek Konieczny <jajcus@jajcus.net> 747a9fb
- automatic change: use py_build/py_install macros * Tue Nov 17 2015 Jacek Konieczny <j.konieczny@eggsoft.pl> 0c138da
- python-devel dep fixed (epoch was missing) * Tue Nov 17 2015 Jacek Konieczny <j.konieczny@eggsoft.pl> bf2b284
- Release: 1 * Tue Nov 17 2015 Jacek Konieczny <j.konieczny@eggsoft.pl> 365e651
- new spec + rpm -Uhv --nodeps --define '_topdir /tmp/B.t18zrnpu' --define '_specdir %{_topdir}' --define '_sourcedir %{_specdir}' --define '_rpmdir %{_topdir}/RPMS' --define '_builddir %{_topdir}/BUILD' python-billiard-3.6.3.0-3.src.rpm Updating / installing... python-billiard-3.6.3.0-3 ######################################## + rm -f python-billiard-3.6.3.0-3.src.rpm + install -m 700 -d /tmp/B.t18zrnpu/BUILD/tmp + TMPDIR=/tmp/B.t18zrnpu/BUILD/tmp + exec nice -n 0 rpmbuild -bp --short-circuit --nodeps --define '_topdir /tmp/B.t18zrnpu' --define '_specdir %{_topdir}' --define '_sourcedir %{_specdir}' --define '_rpmdir %{_topdir}/RPMS' --define '_builddir %{_topdir}/BUILD' --target x32-pld-linux --define 'prep exit 0' /tmp/B.t18zrnpu/python-billiard.spec Building target platforms: x32-pld-linux Building for target x32-pld-linux checking BuildConflict-ing packages rpm: Building target platforms: x32-pld-linux rpm: Building for target x32-pld-linux no BuildConflicts found checking BR rpm: Building target platforms: x32-pld-linux rpm: Building for target x32-pld-linux no BR needed building RPM using: set -ex; : build-id: 8a49281d-0517-4ee8-99ef-d9319de44eab; TMPDIR=/tmp/B.t18zrnpu/BUILD/tmp exec nice -n 0 rpmbuild -bb --define '_smp_mflags -j9' --define '_make_opts -Otarget' --define '_pld_builder 1' --define '_topdir /tmp/B.t18zrnpu' --define '_specdir %{_topdir}' --define '_sourcedir %{_specdir}' --define '_rpmdir %{_topdir}/RPMS' --define '_builddir %{_topdir}/BUILD' --target x32-pld-linux /tmp/B.t18zrnpu/python-billiard.spec + : build-id: 8a49281d-0517-4ee8-99ef-d9319de44eab + TMPDIR=/tmp/B.t18zrnpu/BUILD/tmp + exec nice -n 0 rpmbuild -bb --define '_smp_mflags -j9' --define '_make_opts -Otarget' --define '_pld_builder 1' --define '_topdir /tmp/B.t18zrnpu' --define '_specdir %{_topdir}' --define '_sourcedir %{_specdir}' --define '_rpmdir %{_topdir}/RPMS' --define '_builddir %{_topdir}/BUILD' --target x32-pld-linux /tmp/B.t18zrnpu/python-billiard.spec Building target platforms: x32-pld-linux Building for target x32-pld-linux Executing(%prep): /bin/sh -e /tmp/B.t18zrnpu/BUILD/tmp/rpm-tmp.N2OcZe + umask 022 + cd /tmp/B.t18zrnpu/BUILD + cd /tmp/B.t18zrnpu/BUILD + rm -rf billiard-3.6.3.0 + /bin/gzip -dc /tmp/B.t18zrnpu/billiard-3.6.3.0.tar.gz + /bin/tar -xof - + STATUS=0 + '[' 0 -ne 0 ']' + cd billiard-3.6.3.0 + /bin/chmod -Rf a+rX,u+w,g-w,o-w . + RPM_EC=0 + jobs -p + exit 0 Executing(%build): /bin/sh -e /tmp/B.t18zrnpu/BUILD/tmp/rpm-tmp.5snWe1 HOME=/home/users/builder PATH=/home/users/builder/GNUstep/Tools:/bin:/usr/bin:/usr/local/bin TMPDIR=/tmp/B.t18zrnpu/BUILD/tmp + umask 022 + cd /tmp/B.t18zrnpu/BUILD + cd billiard-3.6.3.0 + LDFLAGS='-Wl,--as-needed -Wl,--no-copy-dt-needed-entries -Wl,-z,relro -Wl,-z,combreloc ' + export LDFLAGS + CFLAGS=' -O2 -fwrapv -pipe -Wformat -Werror=format-security -gdwarf-4 -fno-debug-types-section -fvar-tracking-assignments -g2 -Wp,-D_FORTIFY_SOURCE=2 -fstack-protector-strong --param=ssp-buffer-size=4 -Werror=trampolines -fPIC -mtune=generic -march=x86-64 -gdwarf-4 -fno-debug-types-section -fvar-tracking-assignments -g2 ' + export CFLAGS + CXXFLAGS=' -O2 -fwrapv -pipe -Wformat -Werror=format-security -gdwarf-4 -fno-debug-types-section -fvar-tracking-assignments -g2 -Wp,-D_FORTIFY_SOURCE=2 -fstack-protector-strong --param=ssp-buffer-size=4 -Werror=trampolines -fPIC -mtune=generic -march=x86-64 -gdwarf-4 -fno-debug-types-section -fvar-tracking-assignments -g2 ' + export CXXFLAGS + CC=x86_64-pld-linux-gnux32-gcc + export CC + CXX=x86_64-pld-linux-gnux32-g++ + export CXX + /usr/bin/python2 setup.py build '--build-base=build-2' running build running build_py creating build-2 creating build-2/lib.linux-x86_64-2.7 creating build-2/lib.linux-x86_64-2.7/billiard copying billiard/__init__.py -> build-2/lib.linux-x86_64-2.7/billiard copying billiard/_ext.py -> build-2/lib.linux-x86_64-2.7/billiard copying billiard/_win.py -> build-2/lib.linux-x86_64-2.7/billiard copying billiard/common.py -> build-2/lib.linux-x86_64-2.7/billiard copying billiard/compat.py -> build-2/lib.linux-x86_64-2.7/billiard copying billiard/connection.py -> build-2/lib.linux-x86_64-2.7/billiard copying billiard/context.py -> build-2/lib.linux-x86_64-2.7/billiard copying billiard/einfo.py -> build-2/lib.linux-x86_64-2.7/billiard copying billiard/exceptions.py -> build-2/lib.linux-x86_64-2.7/billiard copying billiard/five.py -> build-2/lib.linux-x86_64-2.7/billiard copying billiard/forkserver.py -> build-2/lib.linux-x86_64-2.7/billiard copying billiard/heap.py -> build-2/lib.linux-x86_64-2.7/billiard copying billiard/managers.py -> build-2/lib.linux-x86_64-2.7/billiard copying billiard/pool.py -> build-2/lib.linux-x86_64-2.7/billiard copying billiard/popen_fork.py -> build-2/lib.linux-x86_64-2.7/billiard copying billiard/popen_forkserver.py -> build-2/lib.linux-x86_64-2.7/billiard copying billiard/popen_spawn_posix.py -> build-2/lib.linux-x86_64-2.7/billiard copying billiard/popen_spawn_win32.py -> build-2/lib.linux-x86_64-2.7/billiard copying billiard/process.py -> build-2/lib.linux-x86_64-2.7/billiard copying billiard/queues.py -> build-2/lib.linux-x86_64-2.7/billiard copying billiard/reduction.py -> build-2/lib.linux-x86_64-2.7/billiard copying billiard/resource_sharer.py -> build-2/lib.linux-x86_64-2.7/billiard copying billiard/semaphore_tracker.py -> build-2/lib.linux-x86_64-2.7/billiard copying billiard/sharedctypes.py -> build-2/lib.linux-x86_64-2.7/billiard copying billiard/spawn.py -> build-2/lib.linux-x86_64-2.7/billiard copying billiard/synchronize.py -> build-2/lib.linux-x86_64-2.7/billiard copying billiard/util.py -> build-2/lib.linux-x86_64-2.7/billiard creating build-2/lib.linux-x86_64-2.7/billiard/dummy copying billiard/dummy/__init__.py -> build-2/lib.linux-x86_64-2.7/billiard/dummy copying billiard/dummy/connection.py -> build-2/lib.linux-x86_64-2.7/billiard/dummy running build_ext building '_billiard' extension creating build-2/temp.linux-x86_64-2.7 creating build-2/temp.linux-x86_64-2.7/Modules creating build-2/temp.linux-x86_64-2.7/Modules/_billiard x86_64-pld-linux-gnux32-gcc -fno-strict-aliasing -O2 -fwrapv -pipe -Wformat -Werror=format-security -gdwarf-4 -fno-debug-types-section -fvar-tracking-assignments -g2 -Wp,-D_FORTIFY_SOURCE=2 -fstack-protector-strong --param=ssp-buffer-size=4 -Werror=trampolines -fPIC -mtune=generic -march=x86-64 -gdwarf-4 -fno-debug-types-section -fvar-tracking-assignments -g2 -DNDEBUG -O2 -fwrapv -pipe -Wformat -Werror=format-security -gdwarf-4 -fno-debug-types-section -fvar-tracking-assignments -g2 -Wp,-D_FORTIFY_SOURCE=2 -fstack-protector-strong --param=ssp-buffer-size=4 -Werror=trampolines -fPIC -mtune=generic -march=x86-64 -gdwarf-4 -fno-debug-types-section -fvar-tracking-assignments -g2 -O2 -fwrapv -pipe -Wformat -Werror=format-security -gdwarf-4 -fno-debug-types-section -fvar-tracking-assignments -g2 -Wp,-D_FORTIFY_SOURCE=2 -fstack-protector-strong --param=ssp-buffer-size=4 -Werror=trampolines -fPIC -mtune=generic -march=x86-64 -gdwarf-4 -fno-debug-types-section -fvar-tracking-assignments -g2 -fPIC -DHAVE_SEM_OPEN=1 -DHAVE_FD_TRANSFER=1 -DHAVE_SEM_TIMEDWAIT=1 -IModules/_billiard -I/usr/include/python2.7 -c Modules/_billiard/multiprocessing.c -o build-2/temp.linux-x86_64-2.7/Modules/_billiard/multiprocessing.o x86_64-pld-linux-gnux32-gcc -fno-strict-aliasing -O2 -fwrapv -pipe -Wformat -Werror=format-security -gdwarf-4 -fno-debug-types-section -fvar-tracking-assignments -g2 -Wp,-D_FORTIFY_SOURCE=2 -fstack-protector-strong --param=ssp-buffer-size=4 -Werror=trampolines -fPIC -mtune=generic -march=x86-64 -gdwarf-4 -fno-debug-types-section -fvar-tracking-assignments -g2 -DNDEBUG -O2 -fwrapv -pipe -Wformat -Werror=format-security -gdwarf-4 -fno-debug-types-section -fvar-tracking-assignments -g2 -Wp,-D_FORTIFY_SOURCE=2 -fstack-protector-strong --param=ssp-buffer-size=4 -Werror=trampolines -fPIC -mtune=generic -march=x86-64 -gdwarf-4 -fno-debug-types-section -fvar-tracking-assignments -g2 -O2 -fwrapv -pipe -Wformat -Werror=format-security -gdwarf-4 -fno-debug-types-section -fvar-tracking-assignments -g2 -Wp,-D_FORTIFY_SOURCE=2 -fstack-protector-strong --param=ssp-buffer-size=4 -Werror=trampolines -fPIC -mtune=generic -march=x86-64 -gdwarf-4 -fno-debug-types-section -fvar-tracking-assignments -g2 -fPIC -DHAVE_SEM_OPEN=1 -DHAVE_FD_TRANSFER=1 -DHAVE_SEM_TIMEDWAIT=1 -IModules/_billiard -I/usr/include/python2.7 -c Modules/_billiard/semaphore.c -o build-2/temp.linux-x86_64-2.7/Modules/_billiard/semaphore.o x86_64-pld-linux-gnux32-gcc -shared -Wl,--as-needed -Wl,--no-copy-dt-needed-entries -Wl,-z,relro -Wl,-z,combreloc -Wl,--as-needed -Wl,--no-copy-dt-needed-entries -Wl,-z,relro -Wl,-z,combreloc -O2 -fwrapv -pipe -Wformat -Werror=format-security -gdwarf-4 -fno-debug-types-section -fvar-tracking-assignments -g2 -Wp,-D_FORTIFY_SOURCE=2 -fstack-protector-strong --param=ssp-buffer-size=4 -Werror=trampolines -fPIC -mtune=generic -march=x86-64 -gdwarf-4 -fno-debug-types-section -fvar-tracking-assignments -g2 build-2/temp.linux-x86_64-2.7/Modules/_billiard/multiprocessing.o build-2/temp.linux-x86_64-2.7/Modules/_billiard/semaphore.o -L/usr/libx32 -lrt -lpython2.7 -o build-2/lib.linux-x86_64-2.7/_billiard.so + PYTEST_DISABLE_PLUGIN_AUTOLOAD=1 /usr/bin/python2 -m pytest t/unit ============================= test session starts ============================== platform linux2 -- Python 2.7.18, pytest-4.6.11, py-1.10.0, pluggy-0.13.1 rootdir: /tmp/B.t18zrnpu/BUILD/billiard-3.6.3.0, inifile: setup.cfg collected 70 items t/unit/test_common.py ........ [ 11%] t/unit/test_dummy.py . [ 12%] t/unit/test_package.py . [ 14%] t/unit/test_pool.py .. [ 17%] t/unit/test_spawn.py ... [ 21%] t/unit/test_values.py .... [ 27%] t/unit/test_win32.py sssssssssssssssssssssssssssssssssssssssssssssssssss [100%] ==================== 19 passed, 51 skipped in 2.38 seconds ===================== + LDFLAGS='-Wl,--as-needed -Wl,--no-copy-dt-needed-entries -Wl,-z,relro -Wl,-z,combreloc ' + export LDFLAGS + CFLAGS=' -O2 -fwrapv -pipe -Wformat -Werror=format-security -gdwarf-4 -fno-debug-types-section -fvar-tracking-assignments -g2 -Wp,-D_FORTIFY_SOURCE=2 -fstack-protector-strong --param=ssp-buffer-size=4 -Werror=trampolines -fPIC -mtune=generic -march=x86-64 -gdwarf-4 -fno-debug-types-section -fvar-tracking-assignments -g2 ' + export CFLAGS + CXXFLAGS=' -O2 -fwrapv -pipe -Wformat -Werror=format-security -gdwarf-4 -fno-debug-types-section -fvar-tracking-assignments -g2 -Wp,-D_FORTIFY_SOURCE=2 -fstack-protector-strong --param=ssp-buffer-size=4 -Werror=trampolines -fPIC -mtune=generic -march=x86-64 -gdwarf-4 -fno-debug-types-section -fvar-tracking-assignments -g2 ' + export CXXFLAGS + CC=x86_64-pld-linux-gnux32-gcc + export CC + CXX=x86_64-pld-linux-gnux32-g++ + export CXX + /usr/bin/python3 setup.py build '--build-base=build-3' running build running build_py creating build-3 creating build-3/lib creating build-3/lib/billiard copying billiard/__init__.py -> build-3/lib/billiard copying billiard/_ext.py -> build-3/lib/billiard copying billiard/_win.py -> build-3/lib/billiard copying billiard/common.py -> build-3/lib/billiard copying billiard/compat.py -> build-3/lib/billiard copying billiard/connection.py -> build-3/lib/billiard copying billiard/context.py -> build-3/lib/billiard copying billiard/einfo.py -> build-3/lib/billiard copying billiard/exceptions.py -> build-3/lib/billiard copying billiard/five.py -> build-3/lib/billiard copying billiard/forkserver.py -> build-3/lib/billiard copying billiard/heap.py -> build-3/lib/billiard copying billiard/managers.py -> build-3/lib/billiard copying billiard/pool.py -> build-3/lib/billiard copying billiard/popen_fork.py -> build-3/lib/billiard copying billiard/popen_forkserver.py -> build-3/lib/billiard copying billiard/popen_spawn_posix.py -> build-3/lib/billiard copying billiard/popen_spawn_win32.py -> build-3/lib/billiard copying billiard/process.py -> build-3/lib/billiard copying billiard/queues.py -> build-3/lib/billiard copying billiard/reduction.py -> build-3/lib/billiard copying billiard/resource_sharer.py -> build-3/lib/billiard copying billiard/semaphore_tracker.py -> build-3/lib/billiard copying billiard/sharedctypes.py -> build-3/lib/billiard copying billiard/spawn.py -> build-3/lib/billiard copying billiard/synchronize.py -> build-3/lib/billiard copying billiard/util.py -> build-3/lib/billiard creating build-3/lib/billiard/dummy copying billiard/dummy/__init__.py -> build-3/lib/billiard/dummy copying billiard/dummy/connection.py -> build-3/lib/billiard/dummy + PYTEST_DISABLE_PLUGIN_AUTOLOAD=1 /usr/bin/python3 -m pytest t/unit ============================= test session starts ============================== platform linux -- Python 3.9.8, pytest-6.2.2, py-1.10.0, pluggy-0.13.1 rootdir: /tmp/B.t18zrnpu/BUILD/billiard-3.6.3.0, configfile: setup.cfg collected 70 items t/unit/test_common.py ........ [ 11%] t/unit/test_dummy.py . [ 12%] t/unit/test_package.py . [ 14%] t/unit/test_pool.py .. [ 17%] t/unit/test_spawn.py F.. [ 21%] t/unit/test_values.py .... [ 27%] t/unit/test_win32.py sssssssssssssssssssssssssssssssssssssssssssssssssss [100%] =================================== FAILURES =================================== ____________________________ test_spawn.test_start _____________________________ self = <t.unit.test_spawn.test_spawn object at 0xf656df70> def test_start(self): ctx = get_context('spawn') p = ctx.Process(target=task_from_process, args=('opa',)) > p.start() t/unit/test_spawn.py:17: _ _ _ _ _ _ _ _ _ _ _ _ _ _ _ _ _ _ _ _ _ _ _ _ _ _ _ _ _ _ _ _ _ _ _ _ _ _ _ _ billiard/process.py:124: in start self._popen = self._Popen(self) billiard/context.py:341: in _Popen return Popen(process_obj) billiard/popen_spawn_posix.py:39: in __init__ super(Popen, self).__init__(process_obj) billiard/popen_fork.py:24: in __init__ self._launch(process_obj) billiard/popen_spawn_posix.py:49: in _launch tracker_fd = semaphore_tracker.getfd() billiard/semaphore_tracker.py:38: in getfd self.ensure_running() billiard/semaphore_tracker.py:62: in ensure_running spawnv_passfds(exe, args, fds_to_pass) _ _ _ _ _ _ _ _ _ _ _ _ _ _ _ _ _ _ _ _ _ _ _ _ _ _ _ _ _ _ _ _ _ _ _ _ _ _ _ _ path = '/usr/bin/python3' args = ['/usr/bin/python3', '-c', 'from billiard.semaphore_tracker import main;main(32)'] passfds = [8, 32] def spawnv_passfds(path, args, passfds): passfds = sorted(passfds) errpipe_read, errpipe_write = os.pipe() try: > return _posixsubprocess.fork_exec( args, [fsencode(path)], True, tuple(passfds), None, None, -1, -1, -1, -1, -1, -1, errpipe_read, errpipe_write, False, False, None) E TypeError: fork_exec() takes exactly 21 arguments (17 given) billiard/compat.py:223: TypeError =============================== warnings summary =============================== ../../../../usr/share/python3.9/site-packages/nose/importer.py:12 /usr/share/python3.9/site-packages/nose/importer.py:12: DeprecationWarning: the imp module is deprecated in favour of importlib; see the module's documentation for alternative uses from imp import find_module, load_module, acquire_lock, release_lock -- Docs: https://docs.pytest.org/en/stable/warnings.html =========================== short test summary info ============================ FAILED t/unit/test_spawn.py::test_spawn::test_start - TypeError: fork_exec() ... ============= 1 failed, 18 passed, 51 skipped, 1 warning in 2.02s ============== error: Bad exit status from /tmp/B.t18zrnpu/BUILD/tmp/rpm-tmp.5snWe1 (%build) RPM build errors: Bad exit status from /tmp/B.t18zrnpu/BUILD/tmp/rpm-tmp.5snWe1 (%build) ended at: Sun Nov 21 03:50:12 2021, done in 0:00:07.453517 error: No files produced. + chmod -R u+rwX /tmp/B.t18zrnpu/BUILD + rm -rf /tmp/B.t18zrnpu/tmp /tmp/B.t18zrnpu/BUILD + rm -rf /tmp/B.t18zrnpu Begin-PLD-Builder-Info Build-Time: user:6.22s sys:1.69s real:9.71s (faults io:12 non-io:239731) End-PLD-Builder-Info
[Back to list of logs] [View rpm -qa of builder]