FailedOk

th/SRPMS[OK]
th/x32[OK]
th/i686[OK]
th/x86_64[OK]

ac/SRPMS[OK]
ac/i386[OK]
ac/i586[OK]
ac/i686[OK]
ac/alpha[OK]
ac/amd64[OK]
ac/athlon[OK]
ac/ppc[OK]
ac/sparc[OK]
ac/sparc64[OK]

Advanced Search
main()
Powered by PLD Linux
(c) 2002-2021 PLD Team
$Revision: 1.37 $
Powered by Linus.
Your IP: 52.23.219.12

python-billiard 8a49281d-0517-4ee8-99ef-d9319de44eab

Status:Failed
Source URL:https://buildlogs.pld-linux.org/pld/th/x32/FAIL/python-billiard,8a49281d-0517-4ee8-99ef-d9319de44eab.bz2
text/plain URL:View!
full text:View!
rpm -qa of builder:View!
Date:2021/11/21 03:50:12
Runtime:0:00:07.453517

Toc:

  • error 1
  • E TypeError: fork_exec() takes exactly 21 arguments (17 given)
  • error 2
  • FAILED t/unit/test_spawn.py::test_spawn::test_start - TypeError: fork_exec() ...
  • error 3
  • error: Bad exit status from /tmp/B.t18zrnpu/BUILD/tmp/rpm-tmp.5snWe1 (%build)
  • error 4
  • RPM build errors:
  • error 5
  • error: No files produced.

Content:

+ CFLAGS=' -O2 -fwrapv -pipe -Wformat -Werror=format-security -gdwarf-4 -fno-debug-types-section -fvar-tracking-assignments -g2 -Wp,-D_FORTIFY_SOURCE=2 -fstack-protector-strong --param=ssp-buffer-size=4 -Werror=trampolines -fPIC -mtune=generic -march=x86-64 -gdwarf-4 -fno-debug-types-section -fvar-tracking-assignments -g2 ' 
+ export CFLAGS
+ CXXFLAGS=' -O2 -fwrapv -pipe -Wformat -Werror=format-security -gdwarf-4 -fno-debug-types-section -fvar-tracking-assignments -g2 -Wp,-D_FORTIFY_SOURCE=2 -fstack-protector-strong --param=ssp-buffer-size=4 -Werror=trampolines -fPIC -mtune=generic -march=x86-64 -gdwarf-4 -fno-debug-types-section -fvar-tracking-assignments -g2 ' 
+ export CXXFLAGS
+ CC=x86_64-pld-linux-gnux32-gcc 
+ export CC
+ CXX=x86_64-pld-linux-gnux32-g++ 
+ export CXX
+ /usr/bin/python3 setup.py build '--build-base=build-3'
running build
running build_py
creating build-3
creating build-3/lib
creating build-3/lib/billiard
copying billiard/__init__.py -> build-3/lib/billiard
copying billiard/_ext.py -> build-3/lib/billiard
copying billiard/_win.py -> build-3/lib/billiard
copying billiard/common.py -> build-3/lib/billiard
copying billiard/compat.py -> build-3/lib/billiard
copying billiard/connection.py -> build-3/lib/billiard
copying billiard/context.py -> build-3/lib/billiard
copying billiard/einfo.py -> build-3/lib/billiard
copying billiard/exceptions.py -> build-3/lib/billiard
copying billiard/five.py -> build-3/lib/billiard
copying billiard/forkserver.py -> build-3/lib/billiard
copying billiard/heap.py -> build-3/lib/billiard
copying billiard/managers.py -> build-3/lib/billiard
copying billiard/pool.py -> build-3/lib/billiard
copying billiard/popen_fork.py -> build-3/lib/billiard
copying billiard/popen_forkserver.py -> build-3/lib/billiard
copying billiard/popen_spawn_posix.py -> build-3/lib/billiard
copying billiard/popen_spawn_win32.py -> build-3/lib/billiard
copying billiard/process.py -> build-3/lib/billiard
copying billiard/queues.py -> build-3/lib/billiard
copying billiard/reduction.py -> build-3/lib/billiard
copying billiard/resource_sharer.py -> build-3/lib/billiard
copying billiard/semaphore_tracker.py -> build-3/lib/billiard
copying billiard/sharedctypes.py -> build-3/lib/billiard
copying billiard/spawn.py -> build-3/lib/billiard
copying billiard/synchronize.py -> build-3/lib/billiard
copying billiard/util.py -> build-3/lib/billiard
creating build-3/lib/billiard/dummy
copying billiard/dummy/__init__.py -> build-3/lib/billiard/dummy
copying billiard/dummy/connection.py -> build-3/lib/billiard/dummy
+ PYTEST_DISABLE_PLUGIN_AUTOLOAD=1 /usr/bin/python3 -m pytest t/unit
============================= test session starts ==============================
platform linux -- Python 3.9.8, pytest-6.2.2, py-1.10.0, pluggy-0.13.1
rootdir: /tmp/B.t18zrnpu/BUILD/billiard-3.6.3.0, configfile: setup.cfg
collected 70 items

t/unit/test_common.py ........                                           [ 11%]
t/unit/test_dummy.py .                                                   [ 12%]
t/unit/test_package.py .                                                 [ 14%]
t/unit/test_pool.py ..                                                   [ 17%]
t/unit/test_spawn.py F..                                                 [ 21%]
t/unit/test_values.py ....                                               [ 27%]
t/unit/test_win32.py sssssssssssssssssssssssssssssssssssssssssssssssssss [100%]

=================================== FAILURES ===================================
____________________________ test_spawn.test_start _____________________________

self = <t.unit.test_spawn.test_spawn object at 0xf656df70>

    def test_start(self):
        ctx = get_context('spawn')
    
        p = ctx.Process(target=task_from_process, args=('opa',))
>       p.start()

t/unit/test_spawn.py:17: 
_ _ _ _ _ _ _ _ _ _ _ _ _ _ _ _ _ _ _ _ _ _ _ _ _ _ _ _ _ _ _ _ _ _ _ _ _ _ _ _ 
billiard/process.py:124: in start
    self._popen = self._Popen(self)
billiard/context.py:341: in _Popen
    return Popen(process_obj)
billiard/popen_spawn_posix.py:39: in __init__
    super(Popen, self).__init__(process_obj)
billiard/popen_fork.py:24: in __init__
    self._launch(process_obj)
billiard/popen_spawn_posix.py:49: in _launch
    tracker_fd = semaphore_tracker.getfd()
billiard/semaphore_tracker.py:38: in getfd
    self.ensure_running()
billiard/semaphore_tracker.py:62: in ensure_running
    spawnv_passfds(exe, args, fds_to_pass)
_ _ _ _ _ _ _ _ _ _ _ _ _ _ _ _ _ _ _ _ _ _ _ _ _ _ _ _ _ _ _ _ _ _ _ _ _ _ _ _ 

path = '/usr/bin/python3'
args = ['/usr/bin/python3', '-c', 'from billiard.semaphore_tracker import main;main(32)']
passfds = [8, 32]

    def spawnv_passfds(path, args, passfds):
        passfds = sorted(passfds)
        errpipe_read, errpipe_write = os.pipe()
        try:
>           return _posixsubprocess.fork_exec(
                args, [fsencode(path)], True, tuple(passfds), None, None,
                -1, -1, -1, -1, -1, -1, errpipe_read, errpipe_write,
                False, False, None)
E               TypeError: fork_exec() takes exactly 21 arguments (17 given)

billiard/compat.py:223: TypeError
=============================== warnings summary ===============================
../../../../usr/share/python3.9/site-packages/nose/importer.py:12
  /usr/share/python3.9/site-packages/nose/importer.py:12: DeprecationWarning: the imp module is deprecated in favour of importlib; see the module's documentation for alternative uses
    from imp import find_module, load_module, acquire_lock, release_lock

-- Docs: https://docs.pytest.org/en/stable/warnings.html
=========================== short test summary info ============================
FAILED t/unit/test_spawn.py::test_spawn::test_start - TypeError: fork_exec() ...
============= 1 failed, 18 passed, 51 skipped, 1 warning in 2.02s ==============
error: Bad exit status from /tmp/B.t18zrnpu/BUILD/tmp/rpm-tmp.5snWe1 (%build)


RPM build errors:
    Bad exit status from /tmp/B.t18zrnpu/BUILD/tmp/rpm-tmp.5snWe1 (%build)
ended at: Sun Nov 21 03:50:12 2021, done in 0:00:07.453517
error: No files produced.
+ chmod -R u+rwX /tmp/B.t18zrnpu/BUILD
+ rm -rf /tmp/B.t18zrnpu/tmp /tmp/B.t18zrnpu/BUILD
+ rm -rf /tmp/B.t18zrnpu
Begin-PLD-Builder-Info
Build-Time: user:6.22s sys:1.69s real:9.71s (faults io:12 non-io:239731)

End-PLD-Builder-Info
[Back to list of logs] [View rpm -qa of builder]