FailedOk

th/SRPMS[OK]
th/x32[OK]
th/i686[OK]
th/x86_64[OK]

ac/SRPMS[OK]
ac/i386[OK]
ac/i586[OK]
ac/i686[OK]
ac/alpha[OK]
ac/amd64[OK]
ac/athlon[OK]
ac/ppc[OK]
ac/sparc[OK]
ac/sparc64[OK]

Advanced Search
main()
Powered by PLD Linux
(c) 2002-2022 PLD Team
$Revision: 1.37 $
Powered by sqlite3.
Your IP: 54.80.252.84

python-pyicu 6ec31888-aad5-48f1-bd6f-2efa9cf86ff5

Status:Failed
Source URL:https://buildlogs.pld-linux.org/pld/th/x32/FAIL/python-pyicu,6ec31888-aad5-48f1-bd6f-2efa9cf86ff5.bz2
text/plain URL:View!
full text:View!
rpm -qa of builder:View!
Date:2022/01/14 20:13:35
Runtime:0:01:21.834615

Toc:

  • error 1
  • FAIL: testGetBestPattern (test_DateTimeParserGenerator.TestDateTimePatternGenerator)
  • error 2
  • AssertionError: u'17:30' != u'\u4e0b\u53485:30'
  • error 3
  • FAIL: testTransition (test_TimeZone.TestTimeZone)
  • error 4
  • AssertionError: datetime.datetime(2022, 11, 13, 2, 0, tzinfo=<ICUtzinfo: Pacific/Fiji>) != datetime.datetime(2021, 11, 14, 2, 0, tzinfo=<ICUtzinfo: Pacific/Fiji>)
  • error 5
  • error: Bad exit status from /tmp/B.v804apff/BUILD/tmp/rpm-tmp.IFPKZA (%build)
  • error 6
  • RPM build errors:
  • error 7
  • error: No files produced.

Content:

/usr/include/features.h:290: note: this is the location of the previous definition
  290 | # define _POSIX_C_SOURCE        200809L
      | 
In file included from /usr/include/python2.7/pyconfig.h:4,
                 from /usr/include/python2.7/Python.h:8,
                 from common.h:44,
                 from locale.cpp:35:
/usr/libx32/python2.7/config/pyconfig.h:1245: warning: "_XOPEN_SOURCE" redefined
 1245 | #define _XOPEN_SOURCE 600
      | 
In file included from /usr/include/c++/11.2.0/x86_64-pld-linux-gnux32/bits/os_defines.h:39,
                 from /usr/include/c++/11.2.0/x86_64-pld-linux-gnux32/bits/c++config.h:586,
                 from /usr/include/c++/11.2.0/cstdlib:41,
                 from /usr/include/c++/11.2.0/stdlib.h:36,
                 from locale.cpp:24:
/usr/include/features.h:214: note: this is the location of the previous definition
  214 | # define _XOPEN_SOURCE  700
      | 
x86_64-pld-linux-gnux32-gcc -fno-strict-aliasing -O2 -fwrapv -pipe -Wformat -Werror=format-security -gdwarf-4 -fno-debug-types-section -fvar-tracking-assignments -g2 -Wp,-D_FORTIFY_SOURCE=2 -fstack-protector-strong --param=ssp-buffer-size=4 -Werror=trampolines -fPIC -mtune=generic -march=x86-64 -gdwarf-4 -fno-debug-types-section -fvar-tracking-assignments -g2 -DNDEBUG -O2 -fwrapv -pipe -Wformat -Werror=format-security -gdwarf-4 -fno-debug-types-section -fvar-tracking-assignments -g2 -Wp,-D_FORTIFY_SOURCE=2 -fstack-protector-strong --param=ssp-buffer-size=4 -Werror=trampolines -fPIC -mtune=generic -march=x86-64 -gdwarf-4 -fno-debug-types-section -fvar-tracking-assignments -g2 -O2 -fwrapv -pipe -Wformat -Werror=format-security -gdwarf-4 -fno-debug-types-section -fvar-tracking-assignments -g2 -Wp,-D_FORTIFY_SOURCE=2 -fstack-protector-strong --param=ssp-buffer-size=4 -Werror=trampolines -fPIC -mtune=generic -march=x86-64 -gdwarf-4 -fno-debug-types-section -fvar-tracking-assignments -g2 -std=c++11 -fPIC -I/usr/include/python2.7 -c measureunit.cpp -o build-2/temp.linux-x86_64-2.7/measureunit.o -std=c++11 -I/usr/include -DPYICU_VER="2.7.4" -DPYICU_ICU_MAX_VER="69"
x86_64-pld-linux-gnux32-gcc -fno-strict-aliasing -O2 -fwrapv -pipe -Wformat -Werror=format-security -gdwarf-4 -fno-debug-types-section -fvar-tracking-assignments -g2 -Wp,-D_FORTIFY_SOURCE=2 -fstack-protector-strong --param=ssp-buffer-size=4 -Werror=trampolines -fPIC -mtune=generic -march=x86-64 -gdwarf-4 -fno-debug-types-section -fvar-tracking-assignments -g2 -DNDEBUG -O2 -fwrapv -pipe -Wformat -Werror=format-security -gdwarf-4 -fno-debug-types-section -fvar-tracking-assignments -g2 -Wp,-D_FORTIFY_SOURCE=2 -fstack-protector-strong --param=ssp-buffer-size=4 -Werror=trampolines -fPIC -mtune=generic -march=x86-64 -gdwarf-4 -fno-debug-types-section -fvar-tracking-assignments -g2 -O2 -fwrapv -pipe -Wformat -Werror=format-security -gdwarf-4 -fno-debug-types-section -fvar-tracking-assignments -g2 -Wp,-D_FORTIFY_SOURCE=2 -fstack-protector-strong --param=ssp-buffer-size=4 -Werror=trampolines -fPIC -mtune=generic -march=x86-64 -gdwarf-4 -fno-debug-types-section -fvar-tracking-assignments -g2 -std=c++11 -fPIC -I/usr/include/python2.7 -c messagepattern.cpp -o build-2/temp.linux-x86_64-2.7/messagepattern.o -std=c++11 -I/usr/include -DPYICU_VER="2.7.4" -DPYICU_ICU_MAX_VER="69"
x86_64-pld-linux-gnux32-gcc -fno-strict-aliasing -O2 -fwrapv -pipe -Wformat -Werror=format-security -gdwarf-4 -fno-debug-types-section -fvar-tracking-assignments -g2 -Wp,-D_FORTIFY_SOURCE=2 -fstack-protector-strong --param=ssp-buffer-size=4 -Werror=trampolines -fPIC -mtune=generic -march=x86-64 -gdwarf-4 -fno-debug-types-section -fvar-tracking-assignments -g2 -DNDEBUG -O2 -fwrapv -pipe -Wformat -Werror=format-security -gdwarf-4 -fno-debug-types-section -fvar-tracking-assignments -g2 -Wp,-D_FORTIFY_SOURCE=2 -fstack-protector-strong --param=ssp-buffer-size=4 -Werror=trampolines -fPIC -mtune=generic -march=x86-64 -gdwarf-4 -fno-debug-types-section -fvar-tracking-assignments -g2 -O2 -fwrapv -pipe -Wformat -Werror=format-security -gdwarf-4 -fno-debug-types-section -fvar-tracking-assignments -g2 -Wp,-D_FORTIFY_SOURCE=2 -fstack-protector-strong --param=ssp-buffer-size=4 -Werror=trampolines -fPIC -mtune=generic -march=x86-64 -gdwarf-4 -fno-debug-types-section -fvar-tracking-assignments -g2 -std=c++11 -fPIC -I/usr/include/python2.7 -c normalizer.cpp -o build-2/temp.linux-x86_64-2.7/normalizer.o -std=c++11 -I/usr/include -DPYICU_VER="2.7.4" -DPYICU_ICU_MAX_VER="69"
x86_64-pld-linux-gnux32-gcc -fno-strict-aliasing -O2 -fwrapv -pipe -Wformat -Werror=format-security -gdwarf-4 -fno-debug-types-section -fvar-tracking-assignments -g2 -Wp,-D_FORTIFY_SOURCE=2 -fstack-protector-strong --param=ssp-buffer-size=4 -Werror=trampolines -fPIC -mtune=generic -march=x86-64 -gdwarf-4 -fno-debug-types-section -fvar-tracking-assignments -g2 -DNDEBUG -O2 -fwrapv -pipe -Wformat -Werror=format-security -gdwarf-4 -fno-debug-types-section -fvar-tracking-assignments -g2 -Wp,-D_FORTIFY_SOURCE=2 -fstack-protector-strong --param=ssp-buffer-size=4 -Werror=trampolines -fPIC -mtune=generic -march=x86-64 -gdwarf-4 -fno-debug-types-section -fvar-tracking-assignments -g2 -O2 -fwrapv -pipe -Wformat -Werror=format-security -gdwarf-4 -fno-debug-types-section -fvar-tracking-assignments -g2 -Wp,-D_FORTIFY_SOURCE=2 -fstack-protector-strong --param=ssp-buffer-size=4 -Werror=trampolines -fPIC -mtune=generic -march=x86-64 -gdwarf-4 -fno-debug-types-section -fvar-tracking-assignments -g2 -std=c++11 -fPIC -I/usr/include/python2.7 -c numberformat.cpp -o build-2/temp.linux-x86_64-2.7/numberformat.o -std=c++11 -I/usr/include -DPYICU_VER="2.7.4" -DPYICU_ICU_MAX_VER="69"
x86_64-pld-linux-gnux32-gcc -fno-strict-aliasing -O2 -fwrapv -pipe -Wformat -Werror=format-security -gdwarf-4 -fno-debug-types-section -fvar-tracking-assignments -g2 -Wp,-D_FORTIFY_SOURCE=2 -fstack-protector-strong --param=ssp-buffer-size=4 -Werror=trampolines -fPIC -mtune=generic -march=x86-64 -gdwarf-4 -fno-debug-types-section -fvar-tracking-assignments -g2 -DNDEBUG -O2 -fwrapv -pipe -Wformat -Werror=format-security -gdwarf-4 -fno-debug-types-section -fvar-tracking-assignments -g2 -Wp,-D_FORTIFY_SOURCE=2 -fstack-protector-strong --param=ssp-buffer-size=4 -Werror=trampolines -fPIC -mtune=generic -march=x86-64 -gdwarf-4 -fno-debug-types-section -fvar-tracking-assignments -g2 -O2 -fwrapv -pipe -Wformat -Werror=format-security -gdwarf-4 -fno-debug-types-section -fvar-tracking-assignments -g2 -Wp,-D_FORTIFY_SOURCE=2 -fstack-protector-strong --param=ssp-buffer-size=4 -Werror=trampolines -fPIC -mtune=generic -march=x86-64 -gdwarf-4 -fno-debug-types-section -fvar-tracking-assignments -g2 -std=c++11 -fPIC -I/usr/include/python2.7 -c regex.cpp -o build-2/temp.linux-x86_64-2.7/regex.o -std=c++11 -I/usr/include -DPYICU_VER="2.7.4" -DPYICU_ICU_MAX_VER="69"
x86_64-pld-linux-gnux32-gcc -fno-strict-aliasing -O2 -fwrapv -pipe -Wformat -Werror=format-security -gdwarf-4 -fno-debug-types-section -fvar-tracking-assignments -g2 -Wp,-D_FORTIFY_SOURCE=2 -fstack-protector-strong --param=ssp-buffer-size=4 -Werror=trampolines -fPIC -mtune=generic -march=x86-64 -gdwarf-4 -fno-debug-types-section -fvar-tracking-assignments -g2 -DNDEBUG -O2 -fwrapv -pipe -Wformat -Werror=format-security -gdwarf-4 -fno-debug-types-section -fvar-tracking-assignments -g2 -Wp,-D_FORTIFY_SOURCE=2 -fstack-protector-strong --param=ssp-buffer-size=4 -Werror=trampolines -fPIC -mtune=generic -march=x86-64 -gdwarf-4 -fno-debug-types-section -fvar-tracking-assignments -g2 -O2 -fwrapv -pipe -Wformat -Werror=format-security -gdwarf-4 -fno-debug-types-section -fvar-tracking-assignments -g2 -Wp,-D_FORTIFY_SOURCE=2 -fstack-protector-strong --param=ssp-buffer-size=4 -Werror=trampolines -fPIC -mtune=generic -march=x86-64 -gdwarf-4 -fno-debug-types-section -fvar-tracking-assignments -g2 -std=c++11 -fPIC -I/usr/include/python2.7 -c script.cpp -o build-2/temp.linux-x86_64-2.7/script.o -std=c++11 -I/usr/include -DPYICU_VER="2.7.4" -DPYICU_ICU_MAX_VER="69"
In file included from /usr/include/python2.7/pyconfig.h:4,
                 from /usr/include/python2.7/Python.h:8,
                 from common.h:44,
                 from script.cpp:27:
/usr/libx32/python2.7/config/pyconfig.h:1223: warning: "_POSIX_C_SOURCE" redefined
 1223 | #define _POSIX_C_SOURCE 200112L
      | 
In file included from /usr/include/c++/11.2.0/x86_64-pld-linux-gnux32/bits/os_defines.h:39,
                 from /usr/include/c++/11.2.0/x86_64-pld-linux-gnux32/bits/c++config.h:586,
                 from /usr/include/c++/11.2.0/cstdlib:41,
                 from /usr/include/c++/11.2.0/stdlib.h:36,
                 from script.cpp:24:
/usr/include/features.h:290: note: this is the location of the previous definition
  290 | # define _POSIX_C_SOURCE        200809L
      | 
In file included from /usr/include/python2.7/pyconfig.h:4,
                 from /usr/include/python2.7/Python.h:8,
                 from common.h:44,
                 from script.cpp:27:
/usr/libx32/python2.7/config/pyconfig.h:1245: warning: "_XOPEN_SOURCE" redefined
 1245 | #define _XOPEN_SOURCE 600
      | 
In file included from /usr/include/c++/11.2.0/x86_64-pld-linux-gnux32/bits/os_defines.h:39,
                 from /usr/include/c++/11.2.0/x86_64-pld-linux-gnux32/bits/c++config.h:586,
                 from /usr/include/c++/11.2.0/cstdlib:41,
                 from /usr/include/c++/11.2.0/stdlib.h:36,
                 from script.cpp:24:
/usr/include/features.h:214: note: this is the location of the previous definition
  214 | # define _XOPEN_SOURCE  700
      | 
x86_64-pld-linux-gnux32-gcc -fno-strict-aliasing -O2 -fwrapv -pipe -Wformat -Werror=format-security -gdwarf-4 -fno-debug-types-section -fvar-tracking-assignments -g2 -Wp,-D_FORTIFY_SOURCE=2 -fstack-protector-strong --param=ssp-buffer-size=4 -Werror=trampolines -fPIC -mtune=generic -march=x86-64 -gdwarf-4 -fno-debug-types-section -fvar-tracking-assignments -g2 -DNDEBUG -O2 -fwrapv -pipe -Wformat -Werror=format-security -gdwarf-4 -fno-debug-types-section -fvar-tracking-assignments -g2 -Wp,-D_FORTIFY_SOURCE=2 -fstack-protector-strong --param=ssp-buffer-size=4 -Werror=trampolines -fPIC -mtune=generic -march=x86-64 -gdwarf-4 -fno-debug-types-section -fvar-tracking-assignments -g2 -O2 -fwrapv -pipe -Wformat -Werror=format-security -gdwarf-4 -fno-debug-types-section -fvar-tracking-assignments -g2 -Wp,-D_FORTIFY_SOURCE=2 -fstack-protector-strong --param=ssp-buffer-size=4 -Werror=trampolines -fPIC -mtune=generic -march=x86-64 -gdwarf-4 -fno-debug-types-section -fvar-tracking-assignments -g2 -std=c++11 -fPIC -I/usr/include/python2.7 -c search.cpp -o build-2/temp.linux-x86_64-2.7/search.o -std=c++11 -I/usr/include -DPYICU_VER="2.7.4" -DPYICU_ICU_MAX_VER="69"
x86_64-pld-linux-gnux32-gcc -fno-strict-aliasing -O2 -fwrapv -pipe -Wformat -Werror=format-security -gdwarf-4 -fno-debug-types-section -fvar-tracking-assignments -g2 -Wp,-D_FORTIFY_SOURCE=2 -fstack-protector-strong --param=ssp-buffer-size=4 -Werror=trampolines -fPIC -mtune=generic -march=x86-64 -gdwarf-4 -fno-debug-types-section -fvar-tracking-assignments -g2 -DNDEBUG -O2 -fwrapv -pipe -Wformat -Werror=format-security -gdwarf-4 -fno-debug-types-section -fvar-tracking-assignments -g2 -Wp,-D_FORTIFY_SOURCE=2 -fstack-protector-strong --param=ssp-buffer-size=4 -Werror=trampolines -fPIC -mtune=generic -march=x86-64 -gdwarf-4 -fno-debug-types-section -fvar-tracking-assignments -g2 -O2 -fwrapv -pipe -Wformat -Werror=format-security -gdwarf-4 -fno-debug-types-section -fvar-tracking-assignments -g2 -Wp,-D_FORTIFY_SOURCE=2 -fstack-protector-strong --param=ssp-buffer-size=4 -Werror=trampolines -fPIC -mtune=generic -march=x86-64 -gdwarf-4 -fno-debug-types-section -fvar-tracking-assignments -g2 -std=c++11 -fPIC -I/usr/include/python2.7 -c shape.cpp -o build-2/temp.linux-x86_64-2.7/shape.o -std=c++11 -I/usr/include -DPYICU_VER="2.7.4" -DPYICU_ICU_MAX_VER="69"
In file included from /usr/include/python2.7/pyconfig.h:4,
                 from /usr/include/python2.7/Python.h:8,
                 from common.h:44,
                 from shape.cpp:27:
/usr/libx32/python2.7/config/pyconfig.h:1223: warning: "_POSIX_C_SOURCE" redefined
 1223 | #define _POSIX_C_SOURCE 200112L
      | 
In file included from /usr/include/c++/11.2.0/x86_64-pld-linux-gnux32/bits/os_defines.h:39,
                 from /usr/include/c++/11.2.0/x86_64-pld-linux-gnux32/bits/c++config.h:586,
                 from /usr/include/c++/11.2.0/cstdlib:41,
                 from /usr/include/c++/11.2.0/stdlib.h:36,
                 from shape.cpp:24:
/usr/include/features.h:290: note: this is the location of the previous definition
  290 | # define _POSIX_C_SOURCE        200809L
      | 
In file included from /usr/include/python2.7/pyconfig.h:4,
                 from /usr/include/python2.7/Python.h:8,
                 from common.h:44,
                 from shape.cpp:27:
/usr/libx32/python2.7/config/pyconfig.h:1245: warning: "_XOPEN_SOURCE" redefined
 1245 | #define _XOPEN_SOURCE 600
      | 
In file included from /usr/include/c++/11.2.0/x86_64-pld-linux-gnux32/bits/os_defines.h:39,
                 from /usr/include/c++/11.2.0/x86_64-pld-linux-gnux32/bits/c++config.h:586,
                 from /usr/include/c++/11.2.0/cstdlib:41,
                 from /usr/include/c++/11.2.0/stdlib.h:36,
                 from shape.cpp:24:
/usr/include/features.h:214: note: this is the location of the previous definition
  214 | # define _XOPEN_SOURCE  700
      | 
x86_64-pld-linux-gnux32-gcc -fno-strict-aliasing -O2 -fwrapv -pipe -Wformat -Werror=format-security -gdwarf-4 -fno-debug-types-section -fvar-tracking-assignments -g2 -Wp,-D_FORTIFY_SOURCE=2 -fstack-protector-strong --param=ssp-buffer-size=4 -Werror=trampolines -fPIC -mtune=generic -march=x86-64 -gdwarf-4 -fno-debug-types-section -fvar-tracking-assignments -g2 -DNDEBUG -O2 -fwrapv -pipe -Wformat -Werror=format-security -gdwarf-4 -fno-debug-types-section -fvar-tracking-assignments -g2 -Wp,-D_FORTIFY_SOURCE=2 -fstack-protector-strong --param=ssp-buffer-size=4 -Werror=trampolines -fPIC -mtune=generic -march=x86-64 -gdwarf-4 -fno-debug-types-section -fvar-tracking-assignments -g2 -O2 -fwrapv -pipe -Wformat -Werror=format-security -gdwarf-4 -fno-debug-types-section -fvar-tracking-assignments -g2 -Wp,-D_FORTIFY_SOURCE=2 -fstack-protector-strong --param=ssp-buffer-size=4 -Werror=trampolines -fPIC -mtune=generic -march=x86-64 -gdwarf-4 -fno-debug-types-section -fvar-tracking-assignments -g2 -std=c++11 -fPIC -I/usr/include/python2.7 -c spoof.cpp -o build-2/temp.linux-x86_64-2.7/spoof.o -std=c++11 -I/usr/include -DPYICU_VER="2.7.4" -DPYICU_ICU_MAX_VER="69"
x86_64-pld-linux-gnux32-gcc -fno-strict-aliasing -O2 -fwrapv -pipe -Wformat -Werror=format-security -gdwarf-4 -fno-debug-types-section -fvar-tracking-assignments -g2 -Wp,-D_FORTIFY_SOURCE=2 -fstack-protector-strong --param=ssp-buffer-size=4 -Werror=trampolines -fPIC -mtune=generic -march=x86-64 -gdwarf-4 -fno-debug-types-section -fvar-tracking-assignments -g2 -DNDEBUG -O2 -fwrapv -pipe -Wformat -Werror=format-security -gdwarf-4 -fno-debug-types-section -fvar-tracking-assignments -g2 -Wp,-D_FORTIFY_SOURCE=2 -fstack-protector-strong --param=ssp-buffer-size=4 -Werror=trampolines -fPIC -mtune=generic -march=x86-64 -gdwarf-4 -fno-debug-types-section -fvar-tracking-assignments -g2 -O2 -fwrapv -pipe -Wformat -Werror=format-security -gdwarf-4 -fno-debug-types-section -fvar-tracking-assignments -g2 -Wp,-D_FORTIFY_SOURCE=2 -fstack-protector-strong --param=ssp-buffer-size=4 -Werror=trampolines -fPIC -mtune=generic -march=x86-64 -gdwarf-4 -fno-debug-types-section -fvar-tracking-assignments -g2 -std=c++11 -fPIC -I/usr/include/python2.7 -c timezone.cpp -o build-2/temp.linux-x86_64-2.7/timezone.o -std=c++11 -I/usr/include -DPYICU_VER="2.7.4" -DPYICU_ICU_MAX_VER="69"
x86_64-pld-linux-gnux32-gcc -fno-strict-aliasing -O2 -fwrapv -pipe -Wformat -Werror=format-security -gdwarf-4 -fno-debug-types-section -fvar-tracking-assignments -g2 -Wp,-D_FORTIFY_SOURCE=2 -fstack-protector-strong --param=ssp-buffer-size=4 -Werror=trampolines -fPIC -mtune=generic -march=x86-64 -gdwarf-4 -fno-debug-types-section -fvar-tracking-assignments -g2 -DNDEBUG -O2 -fwrapv -pipe -Wformat -Werror=format-security -gdwarf-4 -fno-debug-types-section -fvar-tracking-assignments -g2 -Wp,-D_FORTIFY_SOURCE=2 -fstack-protector-strong --param=ssp-buffer-size=4 -Werror=trampolines -fPIC -mtune=generic -march=x86-64 -gdwarf-4 -fno-debug-types-section -fvar-tracking-assignments -g2 -O2 -fwrapv -pipe -Wformat -Werror=format-security -gdwarf-4 -fno-debug-types-section -fvar-tracking-assignments -g2 -Wp,-D_FORTIFY_SOURCE=2 -fstack-protector-strong --param=ssp-buffer-size=4 -Werror=trampolines -fPIC -mtune=generic -march=x86-64 -gdwarf-4 -fno-debug-types-section -fvar-tracking-assignments -g2 -std=c++11 -fPIC -I/usr/include/python2.7 -c transliterator.cpp -o build-2/temp.linux-x86_64-2.7/transliterator.o -std=c++11 -I/usr/include -DPYICU_VER="2.7.4" -DPYICU_ICU_MAX_VER="69"
x86_64-pld-linux-gnux32-gcc -fno-strict-aliasing -O2 -fwrapv -pipe -Wformat -Werror=format-security -gdwarf-4 -fno-debug-types-section -fvar-tracking-assignments -g2 -Wp,-D_FORTIFY_SOURCE=2 -fstack-protector-strong --param=ssp-buffer-size=4 -Werror=trampolines -fPIC -mtune=generic -march=x86-64 -gdwarf-4 -fno-debug-types-section -fvar-tracking-assignments -g2 -DNDEBUG -O2 -fwrapv -pipe -Wformat -Werror=format-security -gdwarf-4 -fno-debug-types-section -fvar-tracking-assignments -g2 -Wp,-D_FORTIFY_SOURCE=2 -fstack-protector-strong --param=ssp-buffer-size=4 -Werror=trampolines -fPIC -mtune=generic -march=x86-64 -gdwarf-4 -fno-debug-types-section -fvar-tracking-assignments -g2 -O2 -fwrapv -pipe -Wformat -Werror=format-security -gdwarf-4 -fno-debug-types-section -fvar-tracking-assignments -g2 -Wp,-D_FORTIFY_SOURCE=2 -fstack-protector-strong --param=ssp-buffer-size=4 -Werror=trampolines -fPIC -mtune=generic -march=x86-64 -gdwarf-4 -fno-debug-types-section -fvar-tracking-assignments -g2 -std=c++11 -fPIC -I/usr/include/python2.7 -c tries.cpp -o build-2/temp.linux-x86_64-2.7/tries.o -std=c++11 -I/usr/include -DPYICU_VER="2.7.4" -DPYICU_ICU_MAX_VER="69"
x86_64-pld-linux-gnux32-gcc -fno-strict-aliasing -O2 -fwrapv -pipe -Wformat -Werror=format-security -gdwarf-4 -fno-debug-types-section -fvar-tracking-assignments -g2 -Wp,-D_FORTIFY_SOURCE=2 -fstack-protector-strong --param=ssp-buffer-size=4 -Werror=trampolines -fPIC -mtune=generic -march=x86-64 -gdwarf-4 -fno-debug-types-section -fvar-tracking-assignments -g2 -DNDEBUG -O2 -fwrapv -pipe -Wformat -Werror=format-security -gdwarf-4 -fno-debug-types-section -fvar-tracking-assignments -g2 -Wp,-D_FORTIFY_SOURCE=2 -fstack-protector-strong --param=ssp-buffer-size=4 -Werror=trampolines -fPIC -mtune=generic -march=x86-64 -gdwarf-4 -fno-debug-types-section -fvar-tracking-assignments -g2 -O2 -fwrapv -pipe -Wformat -Werror=format-security -gdwarf-4 -fno-debug-types-section -fvar-tracking-assignments -g2 -Wp,-D_FORTIFY_SOURCE=2 -fstack-protector-strong --param=ssp-buffer-size=4 -Werror=trampolines -fPIC -mtune=generic -march=x86-64 -gdwarf-4 -fno-debug-types-section -fvar-tracking-assignments -g2 -std=c++11 -fPIC -I/usr/include/python2.7 -c tzinfo.cpp -o build-2/temp.linux-x86_64-2.7/tzinfo.o -std=c++11 -I/usr/include -DPYICU_VER="2.7.4" -DPYICU_ICU_MAX_VER="69"
x86_64-pld-linux-gnux32-gcc -fno-strict-aliasing -O2 -fwrapv -pipe -Wformat -Werror=format-security -gdwarf-4 -fno-debug-types-section -fvar-tracking-assignments -g2 -Wp,-D_FORTIFY_SOURCE=2 -fstack-protector-strong --param=ssp-buffer-size=4 -Werror=trampolines -fPIC -mtune=generic -march=x86-64 -gdwarf-4 -fno-debug-types-section -fvar-tracking-assignments -g2 -DNDEBUG -O2 -fwrapv -pipe -Wformat -Werror=format-security -gdwarf-4 -fno-debug-types-section -fvar-tracking-assignments -g2 -Wp,-D_FORTIFY_SOURCE=2 -fstack-protector-strong --param=ssp-buffer-size=4 -Werror=trampolines -fPIC -mtune=generic -march=x86-64 -gdwarf-4 -fno-debug-types-section -fvar-tracking-assignments -g2 -O2 -fwrapv -pipe -Wformat -Werror=format-security -gdwarf-4 -fno-debug-types-section -fvar-tracking-assignments -g2 -Wp,-D_FORTIFY_SOURCE=2 -fstack-protector-strong --param=ssp-buffer-size=4 -Werror=trampolines -fPIC -mtune=generic -march=x86-64 -gdwarf-4 -fno-debug-types-section -fvar-tracking-assignments -g2 -std=c++11 -fPIC -I/usr/include/python2.7 -c unicodeset.cpp -o build-2/temp.linux-x86_64-2.7/unicodeset.o -std=c++11 -I/usr/include -DPYICU_VER="2.7.4" -DPYICU_ICU_MAX_VER="69"
x86_64-pld-linux-gnux32-g++ -shared -Wl,--as-needed -Wl,--no-copy-dt-needed-entries -Wl,-z,relro -Wl,-z,combreloc -Wl,--as-needed -Wl,--no-copy-dt-needed-entries -Wl,-z,relro -Wl,-z,combreloc -O2 -fwrapv -pipe -Wformat -Werror=format-security -gdwarf-4 -fno-debug-types-section -fvar-tracking-assignments -g2 -Wp,-D_FORTIFY_SOURCE=2 -fstack-protector-strong --param=ssp-buffer-size=4 -Werror=trampolines -fPIC -mtune=generic -march=x86-64 -gdwarf-4 -fno-debug-types-section -fvar-tracking-assignments -g2 -std=c++11 build-2/temp.linux-x86_64-2.7/_icu.o build-2/temp.linux-x86_64-2.7/bases.o build-2/temp.linux-x86_64-2.7/bidi.o build-2/temp.linux-x86_64-2.7/calendar.o build-2/temp.linux-x86_64-2.7/casemap.o build-2/temp.linux-x86_64-2.7/char.o build-2/temp.linux-x86_64-2.7/charset.o build-2/temp.linux-x86_64-2.7/collator.o build-2/temp.linux-x86_64-2.7/common.o build-2/temp.linux-x86_64-2.7/dateformat.o build-2/temp.linux-x86_64-2.7/errors.o build-2/temp.linux-x86_64-2.7/format.o build-2/temp.linux-x86_64-2.7/gender.o build-2/temp.linux-x86_64-2.7/idna.o build-2/temp.linux-x86_64-2.7/iterators.o build-2/temp.linux-x86_64-2.7/layoutengine.o build-2/temp.linux-x86_64-2.7/locale.o build-2/temp.linux-x86_64-2.7/measureunit.o build-2/temp.linux-x86_64-2.7/messagepattern.o build-2/temp.linux-x86_64-2.7/normalizer.o build-2/temp.linux-x86_64-2.7/numberformat.o build-2/temp.linux-x86_64-2.7/regex.o build-2/temp.linux-x86_64-2.7/script.o build-2/temp.linux-x86_64-2.7/search.o build-2/temp.linux-x86_64-2.7/shape.o build-2/temp.linux-x86_64-2.7/spoof.o build-2/temp.linux-x86_64-2.7/timezone.o build-2/temp.linux-x86_64-2.7/transliterator.o build-2/temp.linux-x86_64-2.7/tries.o build-2/temp.linux-x86_64-2.7/tzinfo.o build-2/temp.linux-x86_64-2.7/unicodeset.o -L/usr/libx32 -lpython2.7 -o build-2/lib.linux-x86_64-2.7/_icu.so -L/usr/libx32 -licui18n -licuuc -licudata
+ pwd
+ echo build-2/lib.linux-x86_64-2.7
+ PYTHONPATH=/tmp/B.v804apff/BUILD/PyICU-2.7.4/build-2/lib.linux-x86_64-2.7 /usr/bin/python2 -m unittest discover -s test

LayoutEngine not available in ICU 70.1..................F............................................F.........
======================================================================
FAIL: testGetBestPattern (test_DateTimeParserGenerator.TestDateTimePatternGenerator)
Test a few different languages and common patterns.
----------------------------------------------------------------------
Traceback (most recent call last):
  File "/tmp/B.v804apff/BUILD/PyICU-2.7.4/test/test_DateTimeParserGenerator.py", line 86, in testGetBestPattern
    self.assertEqual(sdf.format(self.date), locale_data[index])
AssertionError: u'17:30' != u'\u4e0b\u53485:30'
- 17:30
+ \u4e0b\u53485:30


======================================================================
FAIL: testTransition (test_TimeZone.TestTimeZone)
----------------------------------------------------------------------
Traceback (most recent call last):
  File "/tmp/B.v804apff/BUILD/PyICU-2.7.4/test/test_TimeZone.py", line 78, in testTransition
    datetime.datetime(2021, 11, 14, 2, 0, tzinfo=pytz))
AssertionError: datetime.datetime(2022, 11, 13, 2, 0, tzinfo=<ICUtzinfo: Pacific/Fiji>) != datetime.datetime(2021, 11, 14, 2, 0, tzinfo=<ICUtzinfo: Pacific/Fiji>)

----------------------------------------------------------------------
Ran 73 tests in 0.643s

FAILED (failures=2)
error: Bad exit status from /tmp/B.v804apff/BUILD/tmp/rpm-tmp.IFPKZA (%build)


RPM build errors:
    Bad exit status from /tmp/B.v804apff/BUILD/tmp/rpm-tmp.IFPKZA (%build)
ended at: Fri Jan 14 20:13:35 2022, done in 0:01:21.834615
error: No files produced.
+ chmod -R u+rwX /tmp/B.v804apff/BUILD
+ rm -rf /tmp/B.v804apff/tmp /tmp/B.v804apff/BUILD
+ rm -rf /tmp/B.v804apff
Begin-PLD-Builder-Info
Build-Time: user:79.13s sys:6.04s real:84.26s (faults io:2 non-io:1216086)

End-PLD-Builder-Info
[Back to list of logs] [View rpm -qa of builder]