FailedOk

th/SRPMS[OK]
th/x32[OK]
th/i686[OK]
th/x86_64[OK]

ac/SRPMS[OK]
ac/i386[OK]
ac/i586[OK]
ac/i686[OK]
ac/alpha[OK]
ac/amd64[OK]
ac/athlon[OK]
ac/ppc[OK]
ac/sparc[OK]
ac/sparc64[OK]

Advanced Search
main()
Powered by PLD Linux
(c) 2002-2021 PLD Team
$Revision: 1.37 $
Powered by penguin.
Your IP: 3.235.223.5

rpm 932137ac-81ff-4771-8f47-83b564ba54bd

Status:Failed
Source URL:https://buildlogs.pld-linux.org/pld/th/x32/FAIL/rpm,932137ac-81ff-4771-8f47-83b564ba54bd.bz2
text/plain URL:View!
full text:View!
rpm -qa of builder:View!
Date:2021/05/29 07:48:01
Runtime:0:00:51.870821

Toc:

  • error 1
  • error: No files produced.
  • error 2
  • make[2]: *** No rule to make target 'Makefile.am', needed by 'Makefile.in'. Stop.
  • error 3
  • make[2]: *** [Makefile:513: .deps/fts.Plo] Error 1
  • error 4
  • make[2]: *** [Makefile:513: .deps/stpncpy.Plo] Error 1
  • error 5
  • make[2]: *** [Makefile:513: .deps/stpcpy.Plo] Error 1
  • error 6
  • make[2]: *** [Makefile:513: .deps/fnmatch.Plo] Error 1
  • error 7
  • make[1]: *** [Makefile:1372: install-recursive] Error 1

Content:

make: Entering directory '/tmp/B.NHRZ_f/BUILD/rpm-4.16.1.3/po'
rm -f ms.gmo && /usr/bin/msgfmt -c --statistics --verbose -o ms.gmo ms.po
ms.po:8: warning: header field 'Project-Id-Version' still has the initial default value
ms.po: 37 translated messages, 12 fuzzy translations, 841 untranslated messages.
make: Leaving directory '/tmp/B.NHRZ_f/BUILD/rpm-4.16.1.3/po'
make: Entering directory '/tmp/B.NHRZ_f/BUILD/rpm-4.16.1.3/po'
rm -f nl.gmo && /usr/bin/msgfmt -c --statistics --verbose -o nl.gmo nl.po
nl.po:8: warning: header field 'Project-Id-Version' still has the initial default value
nl.po: 57 translated messages, 9 fuzzy translations, 824 untranslated messages.
make: Leaving directory '/tmp/B.NHRZ_f/BUILD/rpm-4.16.1.3/po'
+ cd python
+ LDFLAGS='-Wl,--as-needed -Wl,--no-copy-dt-needed-entries -Wl,-z,relro -Wl,-z,combreloc ' 
+ export LDFLAGS
+ CFLAGS=' -O2 -fwrapv -pipe -Wformat -Werror=format-security -gdwarf-4 -fno-debug-types-section -fvar-tracking-assignments -g2 -Wp,-D_FORTIFY_SOURCE=2 -fstack-protector-strong --param=ssp-buffer-size=4 -Werror=trampolines -fPIC -mtune=generic -march=x86-64 -gdwarf-4 -fno-debug-types-section -fvar-tracking-assignments -g2 ' 
+ export CFLAGS
+ CXXFLAGS=' -O2 -fwrapv -pipe -Wformat -Werror=format-security -gdwarf-4 -fno-debug-types-section -fvar-tracking-assignments -g2 -Wp,-D_FORTIFY_SOURCE=2 -fstack-protector-strong --param=ssp-buffer-size=4 -Werror=trampolines -fPIC -mtune=generic -march=x86-64 -gdwarf-4 -fno-debug-types-section -fvar-tracking-assignments -g2 ' 
+ export CXXFLAGS
+ CC=x86_64-pld-linux-gnux32-gcc 
+ export CC
+ CXX=x86_64-pld-linux-gnux32-g++ 
+ export CXX
+ /usr/bin/python3 setup.py build '--build-base=build-3'
running build
running build_py
creating build-3
creating build-3/lib.linux-x86_64-3.9
creating build-3/lib.linux-x86_64-3.9/rpm
copying rpm/transaction.py -> build-3/lib.linux-x86_64-3.9/rpm
copying rpm/__init__.py -> build-3/lib.linux-x86_64-3.9/rpm
running build_ext
building 'rpm._rpm' extension
creating build-3/temp.linux-x86_64-3.9
x86_64-pld-linux-gnux32-gcc -Wno-unused-result -Wsign-compare -DNDEBUG -O2 -fwrapv -pipe -Wformat -Werror=format-security -gdwarf-4 -fno-debug-types-section -fvar-tracking-assignments -g2 -Wp,-D_FORTIFY_SOURCE=2 -fstack-protector-strong --param=ssp-buffer-size=4 -Werror=trampolines -fPIC -mtune=generic -march=x86-64 -gdwarf-4 -fno-debug-types-section -fvar-tracking-assignments -g2 -O2 -fwrapv -pipe -Wformat -Werror=format-security -gdwarf-4 -fno-debug-types-section -fvar-tracking-assignments -g2 -Wp,-D_FORTIFY_SOURCE=2 -fstack-protector-strong --param=ssp-buffer-size=4 -Werror=trampolines -fPIC -mtune=generic -march=x86-64 -gdwarf-4 -fno-debug-types-section -fvar-tracking-assignments -g2 -O2 -fwrapv -pipe -Wformat -Werror=format-security -gdwarf-4 -fno-debug-types-section -fvar-tracking-assignments -g2 -Wp,-D_FORTIFY_SOURCE=2 -fstack-protector-strong --param=ssp-buffer-size=4 -Werror=trampolines -fPIC -mtune=generic -march=x86-64 -gdwarf-4 -fno-debug-types-section -fvar-tracking-assignments -g2 -fPIC -I/usr/include/python3.9 -c header-py.c -o build-3/temp.linux-x86_64-3.9/header-py.o -std=c99 -Wno-strict-aliasing -I../include
header-py.c:743:9: warning: initialization of 'Py_hash_t (*)(PyObject *)' {aka 'int (*)(struct _object *)'} from incompatible pointer type 'long int (*)(PyObject *)' {aka 'long int (*)(struct _object *)'} [-Wincompatible-pointer-types]
  743 |         hdr_hash,                       /* tp_hash */
      |         ^~~~~~~~
header-py.c:743:9: note: (near initialization for 'hdr_Type.tp_hash')
x86_64-pld-linux-gnux32-gcc -Wno-unused-result -Wsign-compare -DNDEBUG -O2 -fwrapv -pipe -Wformat -Werror=format-security -gdwarf-4 -fno-debug-types-section -fvar-tracking-assignments -g2 -Wp,-D_FORTIFY_SOURCE=2 -fstack-protector-strong --param=ssp-buffer-size=4 -Werror=trampolines -fPIC -mtune=generic -march=x86-64 -gdwarf-4 -fno-debug-types-section -fvar-tracking-assignments -g2 -O2 -fwrapv -pipe -Wformat -Werror=format-security -gdwarf-4 -fno-debug-types-section -fvar-tracking-assignments -g2 -Wp,-D_FORTIFY_SOURCE=2 -fstack-protector-strong --param=ssp-buffer-size=4 -Werror=trampolines -fPIC -mtune=generic -march=x86-64 -gdwarf-4 -fno-debug-types-section -fvar-tracking-assignments -g2 -O2 -fwrapv -pipe -Wformat -Werror=format-security -gdwarf-4 -fno-debug-types-section -fvar-tracking-assignments -g2 -Wp,-D_FORTIFY_SOURCE=2 -fstack-protector-strong --param=ssp-buffer-size=4 -Werror=trampolines -fPIC -mtune=generic -march=x86-64 -gdwarf-4 -fno-debug-types-section -fvar-tracking-assignments -g2 -fPIC -I/usr/include/python3.9 -c rpmarchive-py.c -o build-3/temp.linux-x86_64-3.9/rpmarchive-py.o -std=c99 -Wno-strict-aliasing -I../include
x86_64-pld-linux-gnux32-gcc -Wno-unused-result -Wsign-compare -DNDEBUG -O2 -fwrapv -pipe -Wformat -Werror=format-security -gdwarf-4 -fno-debug-types-section -fvar-tracking-assignments -g2 -Wp,-D_FORTIFY_SOURCE=2 -fstack-protector-strong --param=ssp-buffer-size=4 -Werror=trampolines -fPIC -mtune=generic -march=x86-64 -gdwarf-4 -fno-debug-types-section -fvar-tracking-assignments -g2 -O2 -fwrapv -pipe -Wformat -Werror=format-security -gdwarf-4 -fno-debug-types-section -fvar-tracking-assignments -g2 -Wp,-D_FORTIFY_SOURCE=2 -fstack-protector-strong --param=ssp-buffer-size=4 -Werror=trampolines -fPIC -mtune=generic -march=x86-64 -gdwarf-4 -fno-debug-types-section -fvar-tracking-assignments -g2 -O2 -fwrapv -pipe -Wformat -Werror=format-security -gdwarf-4 -fno-debug-types-section -fvar-tracking-assignments -g2 -Wp,-D_FORTIFY_SOURCE=2 -fstack-protector-strong --param=ssp-buffer-size=4 -Werror=trampolines -fPIC -mtune=generic -march=x86-64 -gdwarf-4 -fno-debug-types-section -fvar-tracking-assignments -g2 -fPIC -I/usr/include/python3.9 -c rpmds-py.c -o build-3/temp.linux-x86_64-3.9/rpmds-py.o -std=c99 -Wno-strict-aliasing -I../include
x86_64-pld-linux-gnux32-gcc -Wno-unused-result -Wsign-compare -DNDEBUG -O2 -fwrapv -pipe -Wformat -Werror=format-security -gdwarf-4 -fno-debug-types-section -fvar-tracking-assignments -g2 -Wp,-D_FORTIFY_SOURCE=2 -fstack-protector-strong --param=ssp-buffer-size=4 -Werror=trampolines -fPIC -mtune=generic -march=x86-64 -gdwarf-4 -fno-debug-types-section -fvar-tracking-assignments -g2 -O2 -fwrapv -pipe -Wformat -Werror=format-security -gdwarf-4 -fno-debug-types-section -fvar-tracking-assignments -g2 -Wp,-D_FORTIFY_SOURCE=2 -fstack-protector-strong --param=ssp-buffer-size=4 -Werror=trampolines -fPIC -mtune=generic -march=x86-64 -gdwarf-4 -fno-debug-types-section -fvar-tracking-assignments -g2 -O2 -fwrapv -pipe -Wformat -Werror=format-security -gdwarf-4 -fno-debug-types-section -fvar-tracking-assignments -g2 -Wp,-D_FORTIFY_SOURCE=2 -fstack-protector-strong --param=ssp-buffer-size=4 -Werror=trampolines -fPIC -mtune=generic -march=x86-64 -gdwarf-4 -fno-debug-types-section -fvar-tracking-assignments -g2 -fPIC -I/usr/include/python3.9 -c rpmfd-py.c -o build-3/temp.linux-x86_64-3.9/rpmfd-py.o -std=c99 -Wno-strict-aliasing -I../include
x86_64-pld-linux-gnux32-gcc -Wno-unused-result -Wsign-compare -DNDEBUG -O2 -fwrapv -pipe -Wformat -Werror=format-security -gdwarf-4 -fno-debug-types-section -fvar-tracking-assignments -g2 -Wp,-D_FORTIFY_SOURCE=2 -fstack-protector-strong --param=ssp-buffer-size=4 -Werror=trampolines -fPIC -mtune=generic -march=x86-64 -gdwarf-4 -fno-debug-types-section -fvar-tracking-assignments -g2 -O2 -fwrapv -pipe -Wformat -Werror=format-security -gdwarf-4 -fno-debug-types-section -fvar-tracking-assignments -g2 -Wp,-D_FORTIFY_SOURCE=2 -fstack-protector-strong --param=ssp-buffer-size=4 -Werror=trampolines -fPIC -mtune=generic -march=x86-64 -gdwarf-4 -fno-debug-types-section -fvar-tracking-assignments -g2 -O2 -fwrapv -pipe -Wformat -Werror=format-security -gdwarf-4 -fno-debug-types-section -fvar-tracking-assignments -g2 -Wp,-D_FORTIFY_SOURCE=2 -fstack-protector-strong --param=ssp-buffer-size=4 -Werror=trampolines -fPIC -mtune=generic -march=x86-64 -gdwarf-4 -fno-debug-types-section -fvar-tracking-assignments -g2 -fPIC -I/usr/include/python3.9 -c rpmfi-py.c -o build-3/temp.linux-x86_64-3.9/rpmfi-py.o -std=c99 -Wno-strict-aliasing -I../include
x86_64-pld-linux-gnux32-gcc -Wno-unused-result -Wsign-compare -DNDEBUG -O2 -fwrapv -pipe -Wformat -Werror=format-security -gdwarf-4 -fno-debug-types-section -fvar-tracking-assignments -g2 -Wp,-D_FORTIFY_SOURCE=2 -fstack-protector-strong --param=ssp-buffer-size=4 -Werror=trampolines -fPIC -mtune=generic -march=x86-64 -gdwarf-4 -fno-debug-types-section -fvar-tracking-assignments -g2 -O2 -fwrapv -pipe -Wformat -Werror=format-security -gdwarf-4 -fno-debug-types-section -fvar-tracking-assignments -g2 -Wp,-D_FORTIFY_SOURCE=2 -fstack-protector-strong --param=ssp-buffer-size=4 -Werror=trampolines -fPIC -mtune=generic -march=x86-64 -gdwarf-4 -fno-debug-types-section -fvar-tracking-assignments -g2 -O2 -fwrapv -pipe -Wformat -Werror=format-security -gdwarf-4 -fno-debug-types-section -fvar-tracking-assignments -g2 -Wp,-D_FORTIFY_SOURCE=2 -fstack-protector-strong --param=ssp-buffer-size=4 -Werror=trampolines -fPIC -mtune=generic -march=x86-64 -gdwarf-4 -fno-debug-types-section -fvar-tracking-assignments -g2 -fPIC -I/usr/include/python3.9 -c rpmfiles-py.c -o build-3/temp.linux-x86_64-3.9/rpmfiles-py.o -std=c99 -Wno-strict-aliasing -I../include
rpmfiles-py.c: In function 'rpmfiles_getitem':
rpmfiles-py.c:391:23: warning: comparison of integer expressions of different signedness: 'Py_ssize_t' {aka 'int'} and 'rpm_count_t' {aka 'unsigned int'} [-Wsign-compare]
  391 |     if (ix >= 0 && ix < rpmfilesFC(s->files))
      |                       ^
x86_64-pld-linux-gnux32-gcc -Wno-unused-result -Wsign-compare -DNDEBUG -O2 -fwrapv -pipe -Wformat -Werror=format-security -gdwarf-4 -fno-debug-types-section -fvar-tracking-assignments -g2 -Wp,-D_FORTIFY_SOURCE=2 -fstack-protector-strong --param=ssp-buffer-size=4 -Werror=trampolines -fPIC -mtune=generic -march=x86-64 -gdwarf-4 -fno-debug-types-section -fvar-tracking-assignments -g2 -O2 -fwrapv -pipe -Wformat -Werror=format-security -gdwarf-4 -fno-debug-types-section -fvar-tracking-assignments -g2 -Wp,-D_FORTIFY_SOURCE=2 -fstack-protector-strong --param=ssp-buffer-size=4 -Werror=trampolines -fPIC -mtune=generic -march=x86-64 -gdwarf-4 -fno-debug-types-section -fvar-tracking-assignments -g2 -O2 -fwrapv -pipe -Wformat -Werror=format-security -gdwarf-4 -fno-debug-types-section -fvar-tracking-assignments -g2 -Wp,-D_FORTIFY_SOURCE=2 -fstack-protector-strong --param=ssp-buffer-size=4 -Werror=trampolines -fPIC -mtune=generic -march=x86-64 -gdwarf-4 -fno-debug-types-section -fvar-tracking-assignments -g2 -fPIC -I/usr/include/python3.9 -c rpmii-py.c -o build-3/temp.linux-x86_64-3.9/rpmii-py.o -std=c99 -Wno-strict-aliasing -I../include
x86_64-pld-linux-gnux32-gcc -Wno-unused-result -Wsign-compare -DNDEBUG -O2 -fwrapv -pipe -Wformat -Werror=format-security -gdwarf-4 -fno-debug-types-section -fvar-tracking-assignments -g2 -Wp,-D_FORTIFY_SOURCE=2 -fstack-protector-strong --param=ssp-buffer-size=4 -Werror=trampolines -fPIC -mtune=generic -march=x86-64 -gdwarf-4 -fno-debug-types-section -fvar-tracking-assignments -g2 -O2 -fwrapv -pipe -Wformat -Werror=format-security -gdwarf-4 -fno-debug-types-section -fvar-tracking-assignments -g2 -Wp,-D_FORTIFY_SOURCE=2 -fstack-protector-strong --param=ssp-buffer-size=4 -Werror=trampolines -fPIC -mtune=generic -march=x86-64 -gdwarf-4 -fno-debug-types-section -fvar-tracking-assignments -g2 -O2 -fwrapv -pipe -Wformat -Werror=format-security -gdwarf-4 -fno-debug-types-section -fvar-tracking-assignments -g2 -Wp,-D_FORTIFY_SOURCE=2 -fstack-protector-strong --param=ssp-buffer-size=4 -Werror=trampolines -fPIC -mtune=generic -march=x86-64 -gdwarf-4 -fno-debug-types-section -fvar-tracking-assignments -g2 -fPIC -I/usr/include/python3.9 -c rpmkeyring-py.c -o build-3/temp.linux-x86_64-3.9/rpmkeyring-py.o -std=c99 -Wno-strict-aliasing -I../include
x86_64-pld-linux-gnux32-gcc -Wno-unused-result -Wsign-compare -DNDEBUG -O2 -fwrapv -pipe -Wformat -Werror=format-security -gdwarf-4 -fno-debug-types-section -fvar-tracking-assignments -g2 -Wp,-D_FORTIFY_SOURCE=2 -fstack-protector-strong --param=ssp-buffer-size=4 -Werror=trampolines -fPIC -mtune=generic -march=x86-64 -gdwarf-4 -fno-debug-types-section -fvar-tracking-assignments -g2 -O2 -fwrapv -pipe -Wformat -Werror=format-security -gdwarf-4 -fno-debug-types-section -fvar-tracking-assignments -g2 -Wp,-D_FORTIFY_SOURCE=2 -fstack-protector-strong --param=ssp-buffer-size=4 -Werror=trampolines -fPIC -mtune=generic -march=x86-64 -gdwarf-4 -fno-debug-types-section -fvar-tracking-assignments -g2 -O2 -fwrapv -pipe -Wformat -Werror=format-security -gdwarf-4 -fno-debug-types-section -fvar-tracking-assignments -g2 -Wp,-D_FORTIFY_SOURCE=2 -fstack-protector-strong --param=ssp-buffer-size=4 -Werror=trampolines -fPIC -mtune=generic -march=x86-64 -gdwarf-4 -fno-debug-types-section -fvar-tracking-assignments -g2 -fPIC -I/usr/include/python3.9 -c rpmmacro-py.c -o build-3/temp.linux-x86_64-3.9/rpmmacro-py.o -std=c99 -Wno-strict-aliasing -I../include
x86_64-pld-linux-gnux32-gcc -Wno-unused-result -Wsign-compare -DNDEBUG -O2 -fwrapv -pipe -Wformat -Werror=format-security -gdwarf-4 -fno-debug-types-section -fvar-tracking-assignments -g2 -Wp,-D_FORTIFY_SOURCE=2 -fstack-protector-strong --param=ssp-buffer-size=4 -Werror=trampolines -fPIC -mtune=generic -march=x86-64 -gdwarf-4 -fno-debug-types-section -fvar-tracking-assignments -g2 -O2 -fwrapv -pipe -Wformat -Werror=format-security -gdwarf-4 -fno-debug-types-section -fvar-tracking-assignments -g2 -Wp,-D_FORTIFY_SOURCE=2 -fstack-protector-strong --param=ssp-buffer-size=4 -Werror=trampolines -fPIC -mtune=generic -march=x86-64 -gdwarf-4 -fno-debug-types-section -fvar-tracking-assignments -g2 -O2 -fwrapv -pipe -Wformat -Werror=format-security -gdwarf-4 -fno-debug-types-section -fvar-tracking-assignments -g2 -Wp,-D_FORTIFY_SOURCE=2 -fstack-protector-strong --param=ssp-buffer-size=4 -Werror=trampolines -fPIC -mtune=generic -march=x86-64 -gdwarf-4 -fno-debug-types-section -fvar-tracking-assignments -g2 -fPIC -I/usr/include/python3.9 -c rpmmi-py.c -o build-3/temp.linux-x86_64-3.9/rpmmi-py.o -std=c99 -Wno-strict-aliasing -I../include
x86_64-pld-linux-gnux32-gcc -Wno-unused-result -Wsign-compare -DNDEBUG -O2 -fwrapv -pipe -Wformat -Werror=format-security -gdwarf-4 -fno-debug-types-section -fvar-tracking-assignments -g2 -Wp,-D_FORTIFY_SOURCE=2 -fstack-protector-strong --param=ssp-buffer-size=4 -Werror=trampolines -fPIC -mtune=generic -march=x86-64 -gdwarf-4 -fno-debug-types-section -fvar-tracking-assignments -g2 -O2 -fwrapv -pipe -Wformat -Werror=format-security -gdwarf-4 -fno-debug-types-section -fvar-tracking-assignments -g2 -Wp,-D_FORTIFY_SOURCE=2 -fstack-protector-strong --param=ssp-buffer-size=4 -Werror=trampolines -fPIC -mtune=generic -march=x86-64 -gdwarf-4 -fno-debug-types-section -fvar-tracking-assignments -g2 -O2 -fwrapv -pipe -Wformat -Werror=format-security -gdwarf-4 -fno-debug-types-section -fvar-tracking-assignments -g2 -Wp,-D_FORTIFY_SOURCE=2 -fstack-protector-strong --param=ssp-buffer-size=4 -Werror=trampolines -fPIC -mtune=generic -march=x86-64 -gdwarf-4 -fno-debug-types-section -fvar-tracking-assignments -g2 -fPIC -I/usr/include/python3.9 -c rpmmodule.c -o build-3/temp.linux-x86_64-3.9/rpmmodule.o -std=c99 -Wno-strict-aliasing -I../include
x86_64-pld-linux-gnux32-gcc -Wno-unused-result -Wsign-compare -DNDEBUG -O2 -fwrapv -pipe -Wformat -Werror=format-security -gdwarf-4 -fno-debug-types-section -fvar-tracking-assignments -g2 -Wp,-D_FORTIFY_SOURCE=2 -fstack-protector-strong --param=ssp-buffer-size=4 -Werror=trampolines -fPIC -mtune=generic -march=x86-64 -gdwarf-4 -fno-debug-types-section -fvar-tracking-assignments -g2 -O2 -fwrapv -pipe -Wformat -Werror=format-security -gdwarf-4 -fno-debug-types-section -fvar-tracking-assignments -g2 -Wp,-D_FORTIFY_SOURCE=2 -fstack-protector-strong --param=ssp-buffer-size=4 -Werror=trampolines -fPIC -mtune=generic -march=x86-64 -gdwarf-4 -fno-debug-types-section -fvar-tracking-assignments -g2 -O2 -fwrapv -pipe -Wformat -Werror=format-security -gdwarf-4 -fno-debug-types-section -fvar-tracking-assignments -g2 -Wp,-D_FORTIFY_SOURCE=2 -fstack-protector-strong --param=ssp-buffer-size=4 -Werror=trampolines -fPIC -mtune=generic -march=x86-64 -gdwarf-4 -fno-debug-types-section -fvar-tracking-assignments -g2 -fPIC -I/usr/include/python3.9 -c rpmps-py.c -o build-3/temp.linux-x86_64-3.9/rpmps-py.o -std=c99 -Wno-strict-aliasing -I../include
x86_64-pld-linux-gnux32-gcc -Wno-unused-result -Wsign-compare -DNDEBUG -O2 -fwrapv -pipe -Wformat -Werror=format-security -gdwarf-4 -fno-debug-types-section -fvar-tracking-assignments -g2 -Wp,-D_FORTIFY_SOURCE=2 -fstack-protector-strong --param=ssp-buffer-size=4 -Werror=trampolines -fPIC -mtune=generic -march=x86-64 -gdwarf-4 -fno-debug-types-section -fvar-tracking-assignments -g2 -O2 -fwrapv -pipe -Wformat -Werror=format-security -gdwarf-4 -fno-debug-types-section -fvar-tracking-assignments -g2 -Wp,-D_FORTIFY_SOURCE=2 -fstack-protector-strong --param=ssp-buffer-size=4 -Werror=trampolines -fPIC -mtune=generic -march=x86-64 -gdwarf-4 -fno-debug-types-section -fvar-tracking-assignments -g2 -O2 -fwrapv -pipe -Wformat -Werror=format-security -gdwarf-4 -fno-debug-types-section -fvar-tracking-assignments -g2 -Wp,-D_FORTIFY_SOURCE=2 -fstack-protector-strong --param=ssp-buffer-size=4 -Werror=trampolines -fPIC -mtune=generic -march=x86-64 -gdwarf-4 -fno-debug-types-section -fvar-tracking-assignments -g2 -fPIC -I/usr/include/python3.9 -c rpmstrpool-py.c -o build-3/temp.linux-x86_64-3.9/rpmstrpool-py.o -std=c99 -Wno-strict-aliasing -I../include
x86_64-pld-linux-gnux32-gcc -Wno-unused-result -Wsign-compare -DNDEBUG -O2 -fwrapv -pipe -Wformat -Werror=format-security -gdwarf-4 -fno-debug-types-section -fvar-tracking-assignments -g2 -Wp,-D_FORTIFY_SOURCE=2 -fstack-protector-strong --param=ssp-buffer-size=4 -Werror=trampolines -fPIC -mtune=generic -march=x86-64 -gdwarf-4 -fno-debug-types-section -fvar-tracking-assignments -g2 -O2 -fwrapv -pipe -Wformat -Werror=format-security -gdwarf-4 -fno-debug-types-section -fvar-tracking-assignments -g2 -Wp,-D_FORTIFY_SOURCE=2 -fstack-protector-strong --param=ssp-buffer-size=4 -Werror=trampolines -fPIC -mtune=generic -march=x86-64 -gdwarf-4 -fno-debug-types-section -fvar-tracking-assignments -g2 -O2 -fwrapv -pipe -Wformat -Werror=format-security -gdwarf-4 -fno-debug-types-section -fvar-tracking-assignments -g2 -Wp,-D_FORTIFY_SOURCE=2 -fstack-protector-strong --param=ssp-buffer-size=4 -Werror=trampolines -fPIC -mtune=generic -march=x86-64 -gdwarf-4 -fno-debug-types-section -fvar-tracking-assignments -g2 -fPIC -I/usr/include/python3.9 -c rpmtd-py.c -o build-3/temp.linux-x86_64-3.9/rpmtd-py.o -std=c99 -Wno-strict-aliasing -I../include
x86_64-pld-linux-gnux32-gcc -Wno-unused-result -Wsign-compare -DNDEBUG -O2 -fwrapv -pipe -Wformat -Werror=format-security -gdwarf-4 -fno-debug-types-section -fvar-tracking-assignments -g2 -Wp,-D_FORTIFY_SOURCE=2 -fstack-protector-strong --param=ssp-buffer-size=4 -Werror=trampolines -fPIC -mtune=generic -march=x86-64 -gdwarf-4 -fno-debug-types-section -fvar-tracking-assignments -g2 -O2 -fwrapv -pipe -Wformat -Werror=format-security -gdwarf-4 -fno-debug-types-section -fvar-tracking-assignments -g2 -Wp,-D_FORTIFY_SOURCE=2 -fstack-protector-strong --param=ssp-buffer-size=4 -Werror=trampolines -fPIC -mtune=generic -march=x86-64 -gdwarf-4 -fno-debug-types-section -fvar-tracking-assignments -g2 -O2 -fwrapv -pipe -Wformat -Werror=format-security -gdwarf-4 -fno-debug-types-section -fvar-tracking-assignments -g2 -Wp,-D_FORTIFY_SOURCE=2 -fstack-protector-strong --param=ssp-buffer-size=4 -Werror=trampolines -fPIC -mtune=generic -march=x86-64 -gdwarf-4 -fno-debug-types-section -fvar-tracking-assignments -g2 -fPIC -I/usr/include/python3.9 -c rpmte-py.c -o build-3/temp.linux-x86_64-3.9/rpmte-py.o -std=c99 -Wno-strict-aliasing -I../include
x86_64-pld-linux-gnux32-gcc -Wno-unused-result -Wsign-compare -DNDEBUG -O2 -fwrapv -pipe -Wformat -Werror=format-security -gdwarf-4 -fno-debug-types-section -fvar-tracking-assignments -g2 -Wp,-D_FORTIFY_SOURCE=2 -fstack-protector-strong --param=ssp-buffer-size=4 -Werror=trampolines -fPIC -mtune=generic -march=x86-64 -gdwarf-4 -fno-debug-types-section -fvar-tracking-assignments -g2 -O2 -fwrapv -pipe -Wformat -Werror=format-security -gdwarf-4 -fno-debug-types-section -fvar-tracking-assignments -g2 -Wp,-D_FORTIFY_SOURCE=2 -fstack-protector-strong --param=ssp-buffer-size=4 -Werror=trampolines -fPIC -mtune=generic -march=x86-64 -gdwarf-4 -fno-debug-types-section -fvar-tracking-assignments -g2 -O2 -fwrapv -pipe -Wformat -Werror=format-security -gdwarf-4 -fno-debug-types-section -fvar-tracking-assignments -g2 -Wp,-D_FORTIFY_SOURCE=2 -fstack-protector-strong --param=ssp-buffer-size=4 -Werror=trampolines -fPIC -mtune=generic -march=x86-64 -gdwarf-4 -fno-debug-types-section -fvar-tracking-assignments -g2 -fPIC -I/usr/include/python3.9 -c rpmts-py.c -o build-3/temp.linux-x86_64-3.9/rpmts-py.o -std=c99 -Wno-strict-aliasing -I../include
rpmts-py.c: In function 'rpmts_SolveCallback':
rpmts-py.c:247:5: warning: 'PyEval_CallObjectWithKeywords' is deprecated [-Wdeprecated-declarations]
  247 |     result = PyEval_CallObject(cbInfo->cb, args);
      |     ^~~~~~
In file included from /usr/include/python3.9/Python.h:145,
                 from rpmsystem-py.h:9,
                 from rpmts-py.c:1:
/usr/include/python3.9/ceval.h:17:43: note: declared here
   17 | Py_DEPRECATED(3.9) PyAPI_FUNC(PyObject *) PyEval_CallObjectWithKeywords(
      |                                           ^~~~~~~~~~~~~~~~~~~~~~~~~~~~~
rpmts-py.c: In function 'rpmtsCallback':
rpmts-py.c:539:5: warning: 'PyEval_CallObjectWithKeywords' is deprecated [-Wdeprecated-declarations]
  539 |     result = PyEval_CallObject(cbInfo->cb, args);
      |     ^~~~~~
In file included from /usr/include/python3.9/Python.h:145,
                 from rpmsystem-py.h:9,
                 from rpmts-py.c:1:
/usr/include/python3.9/ceval.h:17:43: note: declared here
   17 | Py_DEPRECATED(3.9) PyAPI_FUNC(PyObject *) PyEval_CallObjectWithKeywords(
      |                                           ^~~~~~~~~~~~~~~~~~~~~~~~~~~~~
x86_64-pld-linux-gnux32-gcc -Wno-unused-result -Wsign-compare -DNDEBUG -O2 -fwrapv -pipe -Wformat -Werror=format-security -gdwarf-4 -fno-debug-types-section -fvar-tracking-assignments -g2 -Wp,-D_FORTIFY_SOURCE=2 -fstack-protector-strong --param=ssp-buffer-size=4 -Werror=trampolines -fPIC -mtune=generic -march=x86-64 -gdwarf-4 -fno-debug-types-section -fvar-tracking-assignments -g2 -O2 -fwrapv -pipe -Wformat -Werror=format-security -gdwarf-4 -fno-debug-types-section -fvar-tracking-assignments -g2 -Wp,-D_FORTIFY_SOURCE=2 -fstack-protector-strong --param=ssp-buffer-size=4 -Werror=trampolines -fPIC -mtune=generic -march=x86-64 -gdwarf-4 -fno-debug-types-section -fvar-tracking-assignments -g2 -O2 -fwrapv -pipe -Wformat -Werror=format-security -gdwarf-4 -fno-debug-types-section -fvar-tracking-assignments -g2 -Wp,-D_FORTIFY_SOURCE=2 -fstack-protector-strong --param=ssp-buffer-size=4 -Werror=trampolines -fPIC -mtune=generic -march=x86-64 -gdwarf-4 -fno-debug-types-section -fvar-tracking-assignments -g2 -fPIC -I/usr/include/python3.9 -c rpmver-py.c -o build-3/temp.linux-x86_64-3.9/rpmver-py.o -std=c99 -Wno-strict-aliasing -I../include
x86_64-pld-linux-gnux32-gcc -Wno-unused-result -Wsign-compare -DNDEBUG -O2 -fwrapv -pipe -Wformat -Werror=format-security -gdwarf-4 -fno-debug-types-section -fvar-tracking-assignments -g2 -Wp,-D_FORTIFY_SOURCE=2 -fstack-protector-strong --param=ssp-buffer-size=4 -Werror=trampolines -fPIC -mtune=generic -march=x86-64 -gdwarf-4 -fno-debug-types-section -fvar-tracking-assignments -g2 -O2 -fwrapv -pipe -Wformat -Werror=format-security -gdwarf-4 -fno-debug-types-section -fvar-tracking-assignments -g2 -Wp,-D_FORTIFY_SOURCE=2 -fstack-protector-strong --param=ssp-buffer-size=4 -Werror=trampolines -fPIC -mtune=generic -march=x86-64 -gdwarf-4 -fno-debug-types-section -fvar-tracking-assignments -g2 -O2 -fwrapv -pipe -Wformat -Werror=format-security -gdwarf-4 -fno-debug-types-section -fvar-tracking-assignments -g2 -Wp,-D_FORTIFY_SOURCE=2 -fstack-protector-strong --param=ssp-buffer-size=4 -Werror=trampolines -fPIC -mtune=generic -march=x86-64 -gdwarf-4 -fno-debug-types-section -fvar-tracking-assignments -g2 -fPIC -I/usr/include/python3.9 -c spec-py.c -o build-3/temp.linux-x86_64-3.9/spec-py.o -std=c99 -Wno-strict-aliasing -I../include
x86_64-pld-linux-gnux32-gcc -pthread -shared -Wl,--as-needed -Wl,--no-copy-dt-needed-entries -Wl,-z,relro -Wl,-z,combreloc -Wl,--as-needed -Wl,--no-copy-dt-needed-entries -Wl,-z,relro -Wl,-z,combreloc -O2 -fwrapv -pipe -Wformat -Werror=format-security -gdwarf-4 -fno-debug-types-section -fvar-tracking-assignments -g2 -Wp,-D_FORTIFY_SOURCE=2 -fstack-protector-strong --param=ssp-buffer-size=4 -Werror=trampolines -fPIC -mtune=generic -march=x86-64 -gdwarf-4 -fno-debug-types-section -fvar-tracking-assignments -g2 build-3/temp.linux-x86_64-3.9/header-py.o build-3/temp.linux-x86_64-3.9/rpmarchive-py.o build-3/temp.linux-x86_64-3.9/rpmds-py.o build-3/temp.linux-x86_64-3.9/rpmfd-py.o build-3/temp.linux-x86_64-3.9/rpmfi-py.o build-3/temp.linux-x86_64-3.9/rpmfiles-py.o build-3/temp.linux-x86_64-3.9/rpmii-py.o build-3/temp.linux-x86_64-3.9/rpmkeyring-py.o build-3/temp.linux-x86_64-3.9/rpmmacro-py.o build-3/temp.linux-x86_64-3.9/rpmmi-py.o build-3/temp.linux-x86_64-3.9/rpmmodule.o build-3/temp.linux-x86_64-3.9/rpmps-py.o build-3/temp.linux-x86_64-3.9/rpmstrpool-py.o build-3/temp.linux-x86_64-3.9/rpmtd-py.o build-3/temp.linux-x86_64-3.9/rpmte-py.o build-3/temp.linux-x86_64-3.9/rpmts-py.o build-3/temp.linux-x86_64-3.9/rpmver-py.o build-3/temp.linux-x86_64-3.9/spec-py.o -L../rpmio/.libs -L../lib/.libs -L../build/.libs -L../sign/.libs -L/usr/libx32 -lrpm -lrpmio -lrpmbuild -lrpmbuild -lrpmsign -o build-3/lib.linux-x86_64-3.9/rpm/_rpm.cpython-39-x86_64-linux-gnux32.so
+ RPM_EC=0 
+ jobs -p
+ exit 0
Executing(%install): /bin/sh -e /tmp/B.NHRZ_f/BUILD/tmp/rpm-tmp.7RoXnS
HOME=/home/users/builder
PATH=/home/users/builder/GNUstep/Tools:/bin:/usr/bin:/usr/local/bin
TMPDIR=/tmp/B.NHRZ_f/BUILD/tmp
+ umask 022
+ cd /tmp/B.NHRZ_f/BUILD
+ /bin/rm '--interactive=never' -rf /tmp/B.NHRZ_f/BUILD/tmp/rpm-4.16.1.3-x32-root-builder
+ /bin/mkdir -p /tmp/B.NHRZ_f/BUILD/tmp/rpm-4.16.1.3-x32-root-builder
+ cd rpm-4.16.1.3
+ rm -rf /tmp/B.NHRZ_f/BUILD/tmp/rpm-4.16.1.3-x32-root-builder
+ install -d /tmp/B.NHRZ_f/BUILD/tmp/rpm-4.16.1.3-x32-root-builder/bin /tmp/B.NHRZ_f/BUILD/tmp/rpm-4.16.1.3-x32-root-builder/libx32 /tmp/B.NHRZ_f/BUILD/tmp/rpm-4.16.1.3-x32-root-builder/etc/sysconfig /tmp/B.NHRZ_f/BUILD/tmp/rpm-4.16.1.3-x32-root-builder/etc/rpm /tmp/B.NHRZ_f/BUILD/tmp/rpm-4.16.1.3-x32-root-builder/etc/pki/rpm-gpg /tmp/B.NHRZ_f/BUILD/tmp/rpm-4.16.1.3-x32-root-builder/var/lib/banner /tmp/B.NHRZ_f/BUILD/tmp/rpm-4.16.1.3-x32-root-builder/var/lib/rpm /tmp/B.NHRZ_f/BUILD/tmp/rpm-4.16.1.3-x32-root-builder/usr/lib/.build-id
+ cp -p /tmp/B.NHRZ_f/PLD-3.0-Th-GPG-key.asc /tmp/B.NHRZ_f/BUILD/tmp/rpm-4.16.1.3-x32-root-builder/etc/pki/rpm-gpg/PLD-3.0-Th-GPG-key.asc
+ /usr/bin/make -Otarget -j9 install 'pkgconfigdir=/usr/libx32/pkgconfig' 'DESTDIR=/tmp/B.NHRZ_f/BUILD/tmp/rpm-4.16.1.3-x32-root-builder'
/usr/bin/make  install-recursive
Making install in po
Terminated
ended at: Sat May 29 07:48:01 2021, done in 0:00:51.870821
error: No files produced.
+ chmod -R u+rwX /tmp/B.NHRZ_f/BUILD
+ rm -rf /tmp/B.NHRZ_f/tmp /tmp/B.NHRZ_f/BUILD
rm: cannot remove '/tmp/B.NHRZ_f/BUILD/tmp/rpm-4.16.1.3-x32-root-builder/usr/share/locale': Directory not empty
make[2]: Entering directory '/tmp/B.NHRZ_f/BUILD/rpm-4.16.1.3/po'
installing ar.gmo as /tmp/B.NHRZ_f/BUILD/tmp/rpm-4.16.1.3-x32-root-builder/usr/share/locale/ar/LC_MESSAGES/rpm.mo
installing br.gmo as /tmp/B.NHRZ_f/BUILD/tmp/rpm-4.16.1.3-x32-root-builder/usr/share/locale/br/LC_MESSAGES/rpm.mo
installing ca.gmo as /tmp/B.NHRZ_f/BUILD/tmp/rpm-4.16.1.3-x32-root-builder/usr/share/locale/ca/LC_MESSAGES/rpm.mo
installing cmn.gmo as /tmp/B.NHRZ_f/BUILD/tmp/rpm-4.16.1.3-x32-root-builder/usr/share/locale/cmn/LC_MESSAGES/rpm.mo
installing cs.gmo as /tmp/B.NHRZ_f/BUILD/tmp/rpm-4.16.1.3-x32-root-builder/usr/share/locale/cs/LC_MESSAGES/rpm.mo
installing da.gmo as /tmp/B.NHRZ_f/BUILD/tmp/rpm-4.16.1.3-x32-root-builder/usr/share/locale/da/LC_MESSAGES/rpm.mo
installing de.gmo as /tmp/B.NHRZ_f/BUILD/tmp/rpm-4.16.1.3-x32-root-builder/usr/share/locale/de/LC_MESSAGES/rpm.mo
installing el.gmo as /tmp/B.NHRZ_f/BUILD/tmp/rpm-4.16.1.3-x32-root-builder/usr/share/locale/el/LC_MESSAGES/rpm.mo
installing eo.gmo as /tmp/B.NHRZ_f/BUILD/tmp/rpm-4.16.1.3-x32-root-builder/usr/share/locale/eo/LC_MESSAGES/rpm.mo
installing es.gmo as /tmp/B.NHRZ_f/BUILD/tmp/rpm-4.16.1.3-x32-root-builder/usr/share/locale/es/LC_MESSAGES/rpm.mo
installing fi.gmo as /tmp/B.NHRZ_f/BUILD/tmp/rpm-4.16.1.3-x32-root-builder/usr/share/locale/fi/LC_MESSAGES/rpm.mo
installing fr.gmo as /tmp/B.NHRZ_f/BUILD/tmp/rpm-4.16.1.3-x32-root-builder/usr/share/locale/fr/LC_MESSAGES/rpm.mo
installing id.gmo as /tmp/B.NHRZ_f/BUILD/tmp/rpm-4.16.1.3-x32-root-builder/usr/share/locale/id/LC_MESSAGES/rpm.mo
installing is.gmo as /tmp/B.NHRZ_f/BUILD/tmp/rpm-4.16.1.3-x32-root-builder/usr/share/locale/is/LC_MESSAGES/rpm.mo
installing it.gmo as /tmp/B.NHRZ_f/BUILD/tmp/rpm-4.16.1.3-x32-root-builder/usr/share/locale/it/LC_MESSAGES/rpm.mo
installing ja.gmo as /tmp/B.NHRZ_f/BUILD/tmp/rpm-4.16.1.3-x32-root-builder/usr/share/locale/ja/LC_MESSAGES/rpm.mo
installing ko.gmo as /tmp/B.NHRZ_f/BUILD/tmp/rpm-4.16.1.3-x32-root-builder/usr/share/locale/ko/LC_MESSAGES/rpm.mo
installing ms.gmo as /tmp/B.NHRZ_f/BUILD/tmp/rpm-4.16.1.3-x32-root-builder/usr/share/locale/ms/LC_MESSAGES/rpm.mo
installing nb.gmo as /tmp/B.NHRZ_f/BUILD/tmp/rpm-4.16.1.3-x32-root-builder/usr/share/locale/nb/LC_MESSAGES/rpm.mo
installing nl.gmo as /tmp/B.NHRZ_f/BUILD/tmp/rpm-4.16.1.3-x32-root-builder/usr/share/locale/nl/LC_MESSAGES/rpm.mo
installing pl.gmo as /tmp/B.NHRZ_f/BUILD/tmp/rpm-4.16.1.3-x32-root-builder/usr/share/locale/pl/LC_MESSAGES/rpm.mo
installing pt.gmo as /tmp/B.NHRZ_f/BUILD/tmp/rpm-4.16.1.3-x32-root-builder/usr/share/locale/pt/LC_MESSAGES/rpm.mo
installing pt_BR.gmo as /tmp/B.NHRZ_f/BUILD/tmp/rpm-4.16.1.3-x32-root-builder/usr/share/locale/pt_BR/LC_MESSAGES/rpm.mo
installing ru.gmo as /tmp/B.NHRZ_f/BUILD/tmp/rpm-4.16.1.3-x32-root-builder/usr/share/locale/ru/LC_MESSAGES/rpm.mo
installing sk.gmo as /tmp/B.NHRZ_f/BUILD/tmp/rpm-4.16.1.3-x32-root-builder/usr/share/locale/sk/LC_MESSAGES/rpm.mo
installing sl.gmo as /tmp/B.NHRZ_f/BUILD/tmp/rpm-4.16.1.3-x32-root-builder/usr/share/locale/sl/LC_MESSAGES/rpm.mo
/usr/bin/install: cannot stat './sr.gmo': No such file or directory
installing ./sr.gmo as /tmp/B.NHRZ_f/BUILD/tmp/rpm-4.16.1.3-x32-root-builder/usr/share/locale/sr/LC_MESSAGES/rpm.mo
/usr/bin/install: cannot stat './sr@latin.gmo': No such file or directory
installing ./sr@latin.gmo as /tmp/B.NHRZ_f/BUILD/tmp/rpm-4.16.1.3-x32-root-builder/usr/share/locale/sr@latin/LC_MESSAGES/rpm.mo
/usr/bin/install: cannot stat './sv.gmo': No such file or directory
installing ./sv.gmo as /tmp/B.NHRZ_f/BUILD/tmp/rpm-4.16.1.3-x32-root-builder/usr/share/locale/sv/LC_MESSAGES/rpm.mo
/usr/bin/install: cannot stat './te.gmo': No such file or directory
installing ./te.gmo as /tmp/B.NHRZ_f/BUILD/tmp/rpm-4.16.1.3-x32-root-builder/usr/share/locale/te/LC_MESSAGES/rpm.mo
/usr/bin/install: cannot stat './tr.gmo': No such file or directory
installing ./tr.gmo as /tmp/B.NHRZ_f/BUILD/tmp/rpm-4.16.1.3-x32-root-builder/usr/share/locale/tr/LC_MESSAGES/rpm.mo
/usr/bin/install: cannot stat './uk.gmo': No such file or directory
installing ./uk.gmo as /tmp/B.NHRZ_f/BUILD/tmp/rpm-4.16.1.3-x32-root-builder/usr/share/locale/uk/LC_MESSAGES/rpm.mo
/usr/bin/install: cannot stat './vi.gmo': No such file or directory
installing ./vi.gmo as /tmp/B.NHRZ_f/BUILD/tmp/rpm-4.16.1.3-x32-root-builder/usr/share/locale/vi/LC_MESSAGES/rpm.mo
/usr/bin/install: cannot stat './zh_CN.gmo': No such file or directory
installing ./zh_CN.gmo as /tmp/B.NHRZ_f/BUILD/tmp/rpm-4.16.1.3-x32-root-builder/usr/share/locale/zh_CN/LC_MESSAGES/rpm.mo
/usr/bin/install: cannot stat './zh_TW.gmo': No such file or directory
installing ./zh_TW.gmo as /tmp/B.NHRZ_f/BUILD/tmp/rpm-4.16.1.3-x32-root-builder/usr/share/locale/zh_TW/LC_MESSAGES/rpm.mo
make[2]: Leaving directory '/tmp/B.NHRZ_f/BUILD/rpm-4.16.1.3/po'
make[2]: Entering directory '/tmp/B.NHRZ_f/BUILD/rpm-4.16.1.3/po'
if test "rpm" = "gettext-tools"; then \
  /bin/mkdir -p /tmp/B.NHRZ_f/BUILD/tmp/rpm-4.16.1.3-x32-root-builder/usr/share/gettext/po; \
  for file in Makefile.in.in remove-potcdate.sin quot.sed boldquot.sed en@quot.header en@boldquot.header insert-header.sin Rules-quot   Makevars.template; do \
    /usr/bin/install -c -m 644 ./$file \
		    /tmp/B.NHRZ_f/BUILD/tmp/rpm-4.16.1.3-x32-root-builder/usr/share/gettext/po/$file; \
  done; \
  for file in Makevars; do \
    rm -f /tmp/B.NHRZ_f/BUILD/tmp/rpm-4.16.1.3-x32-root-builder/usr/share/gettext/po/$file; \
  done; \
else \
  : ; \
fi
make[2]: Leaving directory '/tmp/B.NHRZ_f/BUILD/rpm-4.16.1.3/po'
Making install in misc
make[2]: *** No rule to make target 'Makefile.am', needed by 'Makefile.in'.  Stop.
make[2]: *** Waiting for unfinished jobs....
make[2]: Entering directory '/tmp/B.NHRZ_f/BUILD/rpm-4.16.1.3/misc'
/bin/mkdir: cannot create directory '.deps': No such file or directory
make[2]: *** [Makefile:513: .deps/fts.Plo] Error 1
make[2]: Leaving directory '/tmp/B.NHRZ_f/BUILD/rpm-4.16.1.3/misc'
make[2]: Entering directory '/tmp/B.NHRZ_f/BUILD/rpm-4.16.1.3/misc'
/bin/mkdir: cannot create directory '.deps': No such file or directory
make[2]: *** [Makefile:513: .deps/stpncpy.Plo] Error 1
make[2]: Leaving directory '/tmp/B.NHRZ_f/BUILD/rpm-4.16.1.3/misc'
make[2]: Entering directory '/tmp/B.NHRZ_f/BUILD/rpm-4.16.1.3/misc'
/bin/mkdir: cannot create directory '.deps': No such file or directory
make[2]: *** [Makefile:513: .deps/stpcpy.Plo] Error 1
make[2]: Leaving directory '/tmp/B.NHRZ_f/BUILD/rpm-4.16.1.3/misc'
make[2]: Entering directory '/tmp/B.NHRZ_f/BUILD/rpm-4.16.1.3/misc'
/bin/mkdir: cannot create directory '.deps': No such file or directory
make[2]: *** [Makefile:513: .deps/fnmatch.Plo] Error 1
make[2]: Leaving directory '/tmp/B.NHRZ_f/BUILD/rpm-4.16.1.3/misc'
make[1]: *** [Makefile:1372: install-recursive] Error 1
make: *** [Makefile:1681: install] Error 2
+ rm -rf /tmp/B.NHRZ_f
Begin-PLD-Builder-Info
Build-Time: user:108.66s sys:36.20s real:54.51s (faults io:505 non-io:6863684)

End-PLD-Builder-Info
[Back to list of logs] [View rpm -qa of builder]