FailedOk

th/SRPMS[OK]
th/x32[OK]
th/i686[OK]
th/x86_64[OK]

ac/SRPMS[OK]
ac/i386[OK]
ac/i586[OK]
ac/i686[OK]
ac/alpha[OK]
ac/amd64[OK]
ac/athlon[OK]
ac/ppc[OK]
ac/sparc[OK]
ac/sparc64[OK]

Advanced Search
main()
Powered by PLD Linux
(c) 2002-2021 PLD Team
$Revision: 1.37 $
Powered by overclock.
Your IP: 3.235.179.79

rust 66dc36f0-89c2-4fd9-9d9b-f1e832f4415b

Status:Failed
Source URL:https://buildlogs.pld-linux.org/pld/th/x32/FAIL/rust,66dc36f0-89c2-4fd9-9d9b-f1e832f4415b.bz2
text/plain URL:View!
full text:View!
rpm -qa of builder:View!
Date:2021/05/25 16:29:21
Runtime:1:02:31.818281

Toc:

  • error 1
  • error: linking with `cc` failed: exit code: 1
  • error 2
  • collect2: error: ld returned 1 exit status
  • error 3
  • error: aborting due to previous error
  • error 4
  • error: could not compile `cargo`
  • error 5
  • RuntimeError: failed to run: /tmp/B.XtfB3h/BUILD/rustc-1.52.0-src/build/bootstrap/debug/bootstrap dist -j 4 --verbose
  • error 6
  • error: Bad exit status from /tmp/B.XtfB3h/BUILD/tmp/rpm-tmp.cqxXv0 (%build)
  • error 7
  • RPM build errors:
  • error 8
  • error: No files produced.

Content:

        c Sysroot { compiler: Compiler { stage: 1, host: TargetSelection { triple: "x86_64-unknown-linux-gnu", file: None } } }
        c Llvm { target: TargetSelection { triple: "x86_64-unknown-linux-gnu", file: None } }
Building stage1 tool cargo (x86_64-unknown-linux-gnu)
running: "/tmp/B.XtfB3h/BUILD/rustc-1.52.0-src/rust-1.51.0-x86_64-unknown-linux-gnu/bin/cargo" "build" "--target" "x86_64-unknown-linux-gnu" "-Zbinary-dep-depinfo" "-j" "4" "--release" "--frozen" "--manifest-path" "/tmp/B.XtfB3h/BUILD/rustc-1.52.0-src/src/tools/cargo/Cargo.toml" "--message-format" "json-render-diagnostics"
   Compiling libc v0.2.88
   Compiling pkg-config v0.3.18
   Compiling syn v1.0.38
   Compiling crc32fast v1.2.0
   Compiling tinyvec v0.3.4
   Compiling matches v0.1.8
   Compiling cfg-if v0.1.10
   Compiling typenum v1.12.0
   Compiling getrandom v0.2.0
   Compiling serde_json v1.0.59
   Compiling percent-encoding v2.1.0
   Compiling anyhow v1.0.34
   Compiling curl v0.4.34
   Compiling unicode-xid v0.2.1
   Compiling openssl-probe v0.1.2
   Compiling const_fn v0.4.3
   Compiling foreign-types-shared v0.1.1
   Compiling byteorder v1.3.4
   Compiling openssl v0.10.30
   Compiling unicode-width v0.1.8
   Compiling fnv v1.0.7
   Compiling utf8parse v0.1.1
   Compiling same-file v1.0.6
   Compiling ansi_term v0.11.0
   Compiling strsim v0.8.0
   Compiling vec_map v0.8.2
   Compiling smallvec v1.6.1
   Compiling semver-parser v0.7.0
   Compiling humantime v2.0.1
   Compiling hex v0.3.2
   Compiling home v0.5.3
   Compiling opener v0.4.1
   Compiling shell-escape v0.1.5
   Compiling lazycell v1.3.0
   Compiling glob v0.3.0
   Compiling hex v0.4.2
   Compiling bytesize v1.0.1
   Compiling crossbeam-utils v0.7.2
   Compiling crossbeam-utils v0.8.0
   Compiling proc-macro2 v1.0.19
   Compiling unicode-bidi v0.3.4
   Compiling unicode-normalization v0.1.13
   Compiling foreign-types v0.3.2
   Compiling im-rc v15.0.0
   Compiling textwrap v0.11.0
   Compiling vte v0.3.3
   Compiling walkdir v2.3.1
   Compiling idna v0.2.0
   Compiling strip-ansi-escapes v0.1.0
   Compiling quote v1.0.7
   Compiling bstr v0.2.13
   Compiling jobserver v0.1.21
   Compiling filetime v0.2.12
   Compiling getrandom v0.1.14
   Compiling socket2 v0.3.16
   Compiling atty v0.2.14
   Compiling num_cpus v1.13.0
   Compiling smallvec v0.6.14
   Compiling bitmaps v2.1.0
   Compiling tar v0.4.29
   Compiling cc v1.0.60
   Compiling rand_core v0.5.1
   Compiling clap v2.33.3
   Compiling rand_core v0.6.2
   Compiling globset v0.4.5
   Compiling env_logger v0.8.1
   Compiling sized-chunks v0.6.4
   Compiling rand_chacha v0.2.2
   Compiling rand_xoshiro v0.4.0
   Compiling libz-sys v1.1.2
   Compiling openssl-sys v0.9.58
   Compiling libnghttp2-sys v0.1.4+1.41.0
   Compiling curl-sys v0.4.39+curl-7.74.0
   Compiling libssh2-sys v0.2.19
   Compiling libgit2-sys v0.12.18+1.1.0
   Compiling rand_chacha v0.3.0
   Compiling ignore v0.4.16
   Compiling serde_derive v1.0.118
   Compiling rand v0.7.3
   Compiling rand v0.8.3
   Compiling serde v1.0.118
   Compiling tempfile v3.1.0
   Compiling flate2 v1.0.16
   Compiling url v2.1.1
   Compiling semver v0.10.0
   Compiling toml v0.5.7
   Compiling cargo-platform v0.1.1 (/tmp/B.XtfB3h/BUILD/rustc-1.52.0-src/src/tools/cargo/crates/cargo-platform)
   Compiling serde_ignored v0.1.2
   Compiling cargo v0.53.0 (/tmp/B.XtfB3h/BUILD/rustc-1.52.0-src/src/tools/cargo)
   Compiling crypto-hash v0.3.4
   Compiling rustfix v0.5.1
   Compiling rustc-workspace-hack v1.0.0 (/tmp/B.XtfB3h/BUILD/rustc-1.52.0-src/src/tools/rustc-workspace-hack)
   Compiling crates-io v0.33.0 (/tmp/B.XtfB3h/BUILD/rustc-1.52.0-src/src/tools/cargo/crates/crates-io)
   Compiling git2 v0.13.17
   Compiling git2-curl v0.14.1
error: linking with `cc` failed: exit code: 1
  |
  = note: "cc" "-Wl,--as-needed" "-Wl,-z,noexecstack" "-m64" "-Wl,--eh-frame-hdr" "-L" "/tmp/B.XtfB3h/BUILD/rustc-1.52.0-src/build/x86_64-unknown-linux-gnu/stage1/lib/rustlib/x86_64-unknown-linux-gnu/lib" "/tmp/B.XtfB3h/BUILD/rustc-1.52.0-src/build/x86_64-unknown-linux-gnu/stage1-tools/x86_64-unknown-linux-gnu/release/deps/cargo-ec5e048f2e257e15.cargo.45dtyfz4-cgu.0.rcgu.o" "/tmp/B.XtfB3h/BUILD/rustc-1.52.0-src/build/x86_64-unknown-linux-gnu/stage1-tools/x86_64-unknown-linux-gnu/release/deps/cargo-ec5e048f2e257e15.cargo.45dtyfz4-cgu.1.rcgu.o" "/tmp/B.XtfB3h/BUILD/rustc-1.52.0-src/build/x86_64-unknown-linux-gnu/stage1-tools/x86_64-unknown-linux-gnu/release/deps/cargo-ec5e048f2e257e15.cargo.45dtyfz4-cgu.10.rcgu.o" "/tmp/B.XtfB3h/BUILD/rustc-1.52.0-src/build/x86_64-unknown-linux-gnu/stage1-tools/x86_64-unknown-linux-gnu/release/deps/cargo-ec5e048f2e257e15.cargo.45dtyfz4-cgu.11.rcgu.o" "/tmp/B.XtfB3h/BUILD/rustc-1.52.0-src/build/x86_64-unknown-linux-gnu/stage1-tools/x86_64-unknown-linux-gnu/release/deps/cargo-ec5e048f2e257e15.cargo.45dtyfz4-cgu.12.rcgu.o" "/tmp/B.XtfB3h/BUILD/rustc-1.52.0-src/build/x86_64-unknown-linux-gnu/stage1-tools/x86_64-unknown-linux-gnu/release/deps/cargo-ec5e048f2e257e15.cargo.45dtyfz4-cgu.13.rcgu.o" "/tmp/B.XtfB3h/BUILD/rustc-1.52.0-src/build/x86_64-unknown-linux-gnu/stage1-tools/x86_64-unknown-linux-gnu/release/deps/cargo-ec5e048f2e257e15.cargo.45dtyfz4-cgu.14.rcgu.o" "/tmp/B.XtfB3h/BUILD/rustc-1.52.0-src/build/x86_64-unknown-linux-gnu/stage1-tools/x86_64-unknown-linux-gnu/release/deps/cargo-ec5e048f2e257e15.cargo.45dtyfz4-cgu.15.rcgu.o" "/tmp/B.XtfB3h/BUILD/rustc-1.52.0-src/build/x86_64-unknown-linux-gnu/stage1-tools/x86_64-unknown-linux-gnu/release/deps/cargo-ec5e048f2e257e15.cargo.45dtyfz4-cgu.2.rcgu.o" "/tmp/B.XtfB3h/BUILD/rustc-1.52.0-src/build/x86_64-unknown-linux-gnu/stage1-tools/x86_64-unknown-linux-gnu/release/deps/cargo-ec5e048f2e257e15.cargo.45dtyfz4-cgu.3.rcgu.o" "/tmp/B.XtfB3h/BUILD/rustc-1.52.0-src/build/x86_64-unknown-linux-gnu/stage1-tools/x86_64-unknown-linux-gnu/release/deps/cargo-ec5e048f2e257e15.cargo.45dtyfz4-cgu.4.rcgu.o" "/tmp/B.XtfB3h/BUILD/rustc-1.52.0-src/build/x86_64-unknown-linux-gnu/stage1-tools/x86_64-unknown-linux-gnu/release/deps/cargo-ec5e048f2e257e15.cargo.45dtyfz4-cgu.5.rcgu.o" "/tmp/B.XtfB3h/BUILD/rustc-1.52.0-src/build/x86_64-unknown-linux-gnu/stage1-tools/x86_64-unknown-linux-gnu/release/deps/cargo-ec5e048f2e257e15.cargo.45dtyfz4-cgu.6.rcgu.o" "/tmp/B.XtfB3h/BUILD/rustc-1.52.0-src/build/x86_64-unknown-linux-gnu/stage1-tools/x86_64-unknown-linux-gnu/release/deps/cargo-ec5e048f2e257e15.cargo.45dtyfz4-cgu.7.rcgu.o" "/tmp/B.XtfB3h/BUILD/rustc-1.52.0-src/build/x86_64-unknown-linux-gnu/stage1-tools/x86_64-unknown-linux-gnu/release/deps/cargo-ec5e048f2e257e15.cargo.45dtyfz4-cgu.8.rcgu.o" "/tmp/B.XtfB3h/BUILD/rustc-1.52.0-src/build/x86_64-unknown-linux-gnu/stage1-tools/x86_64-unknown-linux-gnu/release/deps/cargo-ec5e048f2e257e15.cargo.45dtyfz4-cgu.9.rcgu.o" "-o" "/tmp/B.XtfB3h/BUILD/rustc-1.52.0-src/build/x86_64-unknown-linux-gnu/stage1-tools/x86_64-unknown-linux-gnu/release/deps/cargo-ec5e048f2e257e15" "/tmp/B.XtfB3h/BUILD/rustc-1.52.0-src/build/x86_64-unknown-linux-gnu/stage1-tools/x86_64-unknown-linux-gnu/release/deps/cargo-ec5e048f2e257e15.3c84zbm0marniqpf.rcgu.o" "-Wl,--gc-sections" "-pie" "-Wl,-zrelro" "-Wl,-znow" "-Wl,-O1" "-nodefaultlibs" "-L" "/tmp/B.XtfB3h/BUILD/rustc-1.52.0-src/build/x86_64-unknown-linux-gnu/stage1-tools/x86_64-unknown-linux-gnu/release/deps" "-L" "/tmp/B.XtfB3h/BUILD/rustc-1.52.0-src/build/x86_64-unknown-linux-gnu/stage1-tools/release/deps" "-L" "/usr/libx32" "-L" "/tmp/B.XtfB3h/BUILD/rustc-1.52.0-src/build/x86_64-unknown-linux-gnu/stage1-tools/x86_64-unknown-linux-gnu/release/build/libnghttp2-sys-4255034ac6e49b4c/out/i/lib" "-L" "/tmp/B.XtfB3h/BUILD/rustc-1.52.0-src/build/x86_64-unknown-linux-gnu/stage1-tools/x86_64-unknown-linux-gnu/release/build/libgit2-sys-4700f324ad6104cc/out/build" "-L" "/tmp/B.XtfB3h/BUILD/rustc-1.52.0-src/build/x86_64-unknown-linux-gnu/stage1-tools/x86_64-unknown-linux-gnu/release/build/libssh2-sys-7ef25151156179c1/out/build" "-L" "/tmp/B.XtfB3h/BUILD/rustc-1.52.0-src/build/x86_64-unknown-linux-gnu/stage1/lib/rustlib/x86_64-unknown-linux-gnu/lib" "-Wl,-Bstatic" "/tmp/B.XtfB3h/BUILD/rustc-1.52.0-src/build/x86_64-unknown-linux-gnu/stage1-tools/x86_64-unknown-linux-gnu/release/deps/libgit2_curl-01f68a0ee423ad7d.rlib" "/tmp/B.XtfB3h/BUILD/rustc-1.52.0-src/build/x86_64-unknown-linux-gnu/stage1-tools/x86_64-unknown-linux-gnu/release/deps/libenv_logger-d8f4338133da7c71.rlib" "/tmp/B.XtfB3h/BUILD/rustc-1.52.0-src/build/x86_64-unknown-linux-gnu/stage1-tools/x86_64-unknown-linux-gnu/release/deps/libcargo-23e8a01484eb3197.rlib" "/tmp/B.XtfB3h/BUILD/rustc-1.52.0-src/build/x86_64-unknown-linux-gnu/stage1-tools/x86_64-unknown-linux-gnu/release/deps/libhex-ea4b49ea672f1d2e.rlib" "/tmp/B.XtfB3h/BUILD/rustc-1.52.0-src/build/x86_64-unknown-linux-gnu/stage1-tools/x86_64-unknown-linux-gnu/release/deps/libhome-efb09d58dccb8961.rlib" "/tmp/B.XtfB3h/BUILD/rustc-1.52.0-src/build/x86_64-unknown-linux-gnu/stage1-tools/x86_64-unknown-linux-gnu/release/deps/libopener-77c0baa9eb7de122.rlib" "/tmp/B.XtfB3h/BUILD/rustc-1.52.0-src/build/x86_64-unknown-linux-gnu/stage1-tools/x86_64-unknown-linux-gnu/release/deps/libunicode_xid-5439b13c16948c4a.rlib" "/tmp/B.XtfB3h/BUILD/rustc-1.52.0-src/build/x86_64-unknown-linux-gnu/stage1-tools/x86_64-unknown-linux-gnu/release/deps/libim_rc-2db7390d7cecc610.rlib" "/tmp/B.XtfB3h/BUILD/rustc-1.52.0-src/build/x86_64-unknown-linux-gnu/stage1-tools/x86_64-unknown-linux-gnu/release/deps/librand_xoshiro-edc0b32eb9a0aaed.rlib" "/tmp/B.XtfB3h/BUILD/rustc-1.52.0-src/build/x86_64-unknown-linux-gnu/stage1-tools/x86_64-unknown-linux-gnu/release/deps/libsized_chunks-b3394f77b45fcc0a.rlib" "/tmp/B.XtfB3h/BUILD/rustc-1.52.0-src/build/x86_64-unknown-linux-gnu/stage1-tools/x86_64-unknown-linux-gnu/release/deps/libbitmaps-494e30ea3e8097c8.rlib" "/tmp/B.XtfB3h/BUILD/rustc-1.52.0-src/build/x86_64-unknown-linux-gnu/stage1-tools/x86_64-unknown-linux-gnu/release/deps/libtypenum-5e912f287e8ae392.rlib" "/tmp/B.XtfB3h/BUILD/rustc-1.52.0-src/build/x86_64-unknown-linux-gnu/stage1-tools/x86_64-unknown-linux-gnu/release/deps/libtoml-f8b5771e3f11c802.rlib" "/tmp/B.XtfB3h/BUILD/rustc-1.52.0-src/build/x86_64-unknown-linux-gnu/stage1-tools/x86_64-unknown-linux-gnu/release/deps/libhumantime-7f237d82b1c6a20f.rlib" "/tmp/B.XtfB3h/BUILD/rustc-1.52.0-src/build/x86_64-unknown-linux-gnu/stage1-tools/x86_64-unknown-linux-gnu/release/deps/libstrip_ansi_escapes-2ab7bf0e496f1a5c.rlib" "/tmp/B.XtfB3h/BUILD/rustc-1.52.0-src/build/x86_64-unknown-linux-gnu/stage1-tools/x86_64-unknown-linux-gnu/release/deps/libvte-8a28d28c75b995bc.rlib" "/tmp/B.XtfB3h/BUILD/rustc-1.52.0-src/build/x86_64-unknown-linux-gnu/stage1-tools/x86_64-unknown-linux-gnu/release/deps/libutf8parse-6e0aa99dea728215.rlib" "/tmp/B.XtfB3h/BUILD/rustc-1.52.0-src/build/x86_64-unknown-linux-gnu/stage1-tools/x86_64-unknown-linux-gnu/release/deps/libnum_cpus-96765d59807c1aa7.rlib" "/tmp/B.XtfB3h/BUILD/rustc-1.52.0-src/build/x86_64-unknown-linux-gnu/stage1-tools/x86_64-unknown-linux-gnu/release/deps/libserde_ignored-42b80a2c13bb5b9e.rlib" "/tmp/B.XtfB3h/BUILD/rustc-1.52.0-src/build/x86_64-unknown-linux-gnu/stage1-tools/x86_64-unknown-linux-gnu/release/deps/libcrypto_hash-1a0eef28dd744368.rlib" "/tmp/B.XtfB3h/BUILD/rustc-1.52.0-src/build/x86_64-unknown-linux-gnu/stage1-tools/x86_64-unknown-linux-gnu/release/deps/libopenssl-fb789455d54caa1a.rlib" "/tmp/B.XtfB3h/BUILD/rustc-1.52.0-src/build/x86_64-unknown-linux-gnu/stage1-tools/x86_64-unknown-linux-gnu/release/deps/libforeign_types-3247d11f58c3f4e5.rlib" "/tmp/B.XtfB3h/BUILD/rustc-1.52.0-src/build/x86_64-unknown-linux-gnu/stage1-tools/x86_64-unknown-linux-gnu/release/deps/libforeign_types_shared-e084ff8e2c257936.rlib" "/tmp/B.XtfB3h/BUILD/rustc-1.52.0-src/build/x86_64-unknown-linux-gnu/stage1-tools/x86_64-unknown-linux-gnu/release/deps/libhex-89a14664783c338d.rlib" "/tmp/B.XtfB3h/BUILD/rustc-1.52.0-src/build/x86_64-unknown-linux-gnu/stage1-tools/x86_64-unknown-linux-gnu/release/deps/libshell_escape-1f0f58c2efc26d1e.rlib" "/tmp/B.XtfB3h/BUILD/rustc-1.52.0-src/build/x86_64-unknown-linux-gnu/stage1-tools/x86_64-unknown-linux-gnu/release/deps/libclap-f4120352c0f03d1c.rlib" "/tmp/B.XtfB3h/BUILD/rustc-1.52.0-src/build/x86_64-unknown-linux-gnu/stage1-tools/x86_64-unknown-linux-gnu/release/deps/libvec_map-24986902181e3dae.rlib" "/tmp/B.XtfB3h/BUILD/rustc-1.52.0-src/build/x86_64-unknown-linux-gnu/stage1-tools/x86_64-unknown-linux-gnu/release/deps/libtextwrap-ce7cd388065f2e61.rlib" "/tmp/B.XtfB3h/BUILD/rustc-1.52.0-src/build/x86_64-unknown-linux-gnu/stage1-tools/x86_64-unknown-linux-gnu/release/deps/libunicode_width-439593cbb5adc90a.rlib" "/tmp/B.XtfB3h/BUILD/rustc-1.52.0-src/build/x86_64-unknown-linux-gnu/stage1-tools/x86_64-unknown-linux-gnu/release/deps/libstrsim-df162c3bc90c4063.rlib" "/tmp/B.XtfB3h/BUILD/rustc-1.52.0-src/build/x86_64-unknown-linux-gnu/stage1-tools/x86_64-unknown-linux-gnu/release/deps/libatty-3897dd9fc8f32f6a.rlib" "/tmp/B.XtfB3h/BUILD/rustc-1.52.0-src/build/x86_64-unknown-linux-gnu/stage1-tools/x86_64-unknown-linux-gnu/release/deps/libansi_term-635b53bef232b689.rlib" "/tmp/B.XtfB3h/BUILD/rustc-1.52.0-src/build/x86_64-unknown-linux-gnu/stage1-tools/x86_64-unknown-linux-gnu/release/deps/libignore-c8de76aba52cd4ec.rlib" "/tmp/B.XtfB3h/BUILD/rustc-1.52.0-src/build/x86_64-unknown-linux-gnu/stage1-tools/x86_64-unknown-linux-gnu/release/deps/libcrossbeam_utils-eb9a44a9f24a2517.rlib" "/tmp/B.XtfB3h/BUILD/rustc-1.52.0-src/build/x86_64-unknown-linux-gnu/stage1-tools/x86_64-unknown-linux-gnu/release/deps/libwalkdir-de79cbc5956be93e.rlib" "/tmp/B.XtfB3h/BUILD/rustc-1.52.0-src/build/x86_64-unknown-linux-gnu/stage1-tools/x86_64-unknown-linux-gnu/release/deps/libsame_file-8166268969abc34d.rlib" "/tmp/B.XtfB3h/BUILD/rustc-1.52.0-src/build/x86_64-unknown-linux-gnu/stage1-tools/x86_64-unknown-linux-gnu/release/deps/libglobset-7f60225e827d4e69.rlib" "/tmp/B.XtfB3h/BUILD/rustc-1.52.0-src/build/x86_64-unknown-linux-gnu/stage1-tools/x86_64-unknown-linux-gnu/release/deps/libregex-f5f380b1bb1822a7.rlib" "/tmp/B.XtfB3h/BUILD/rustc-1.52.0-src/build/x86_64-unknown-linux-gnu/stage1-tools/x86_64-unknown-linux-gnu/release/deps/libthread_local-4d3a6258891bc828.rlib" "/tmp/B.XtfB3h/BUILD/rustc-1.52.0-src/build/x86_64-unknown-linux-gnu/stage1-tools/x86_64-unknown-linux-gnu/release/deps/libregex_syntax-a9d82d136c9e5e83.rlib" "/tmp/B.XtfB3h/BUILD/rustc-1.52.0-src/build/x86_64-unknown-linux-gnu/stage1-tools/x86_64-unknown-linux-gnu/release/deps/libfnv-372d49c2f4732792.rlib" "/tmp/B.XtfB3h/BUILD/rustc-1.52.0-src/build/x86_64-unknown-linux-gnu/stage1-tools/x86_64-unknown-linux-gnu/release/deps/libbstr-023510baef2ddb05.rlib" "/tmp/B.XtfB3h/BUILD/rustc-1.52.0-src/build/x86_64-unknown-linux-gnu/stage1-tools/x86_64-unknown-linux-gnu/release/deps/libaho_corasick-7ba8fff2b930df27.rlib" "/tmp/B.XtfB3h/BUILD/rustc-1.52.0-src/build/x86_64-unknown-linux-gnu/stage1-tools/x86_64-unknown-linux-gnu/release/deps/libmemchr-50de0c51580ec93b.rlib" "/tmp/B.XtfB3h/BUILD/rustc-1.52.0-src/build/x86_64-unknown-linux-gnu/stage1-tools/x86_64-unknown-linux-gnu/release/deps/libcrates_io-93c08763b6f635eb.rlib" "/tmp/B.XtfB3h/BUILD/rustc-1.52.0-src/build/x86_64-unknown-linux-gnu/stage1-tools/x86_64-unknown-linux-gnu/release/deps/librustfix-0e45a65344741f3c.rlib" "/tmp/B.XtfB3h/BUILD/rustc-1.52.0-src/build/x86_64-unknown-linux-gnu/stage1-tools/x86_64-unknown-linux-gnu/release/deps/libserde_json-38f88ab48d93b79b.rlib" "/tmp/B.XtfB3h/BUILD/rustc-1.52.0-src/build/x86_64-unknown-linux-gnu/stage1-tools/x86_64-unknown-linux-gnu/release/deps/libryu-001362c8c542a8a0.rlib" "/tmp/B.XtfB3h/BUILD/rustc-1.52.0-src/build/x86_64-unknown-linux-gnu/stage1-tools/x86_64-unknown-linux-gnu/release/deps/libitoa-d700671cad81fc00.rlib" "/tmp/B.XtfB3h/BUILD/rustc-1.52.0-src/build/x86_64-unknown-linux-gnu/stage1-tools/x86_64-unknown-linux-gnu/release/deps/libtar-8a61b09719607154.rlib" "/tmp/B.XtfB3h/BUILD/rustc-1.52.0-src/build/x86_64-unknown-linux-gnu/stage1-tools/x86_64-unknown-linux-gnu/release/deps/libflate2-39eee8a87f21e719.rlib" "/tmp/B.XtfB3h/BUILD/rustc-1.52.0-src/build/x86_64-unknown-linux-gnu/stage1-tools/x86_64-unknown-linux-gnu/release/deps/libcrc32fast-4c4e8e328d349acb.rlib" "/tmp/B.XtfB3h/BUILD/rustc-1.52.0-src/build/x86_64-unknown-linux-gnu/stage1-tools/x86_64-unknown-linux-gnu/release/deps/libgit2-9654de238ee3664f.rlib" "/tmp/B.XtfB3h/BUILD/rustc-1.52.0-src/build/x86_64-unknown-linux-gnu/stage1-tools/x86_64-unknown-linux-gnu/release/deps/libopenssl_probe-ab6740c5f74a2559.rlib" "/tmp/B.XtfB3h/BUILD/rustc-1.52.0-src/build/x86_64-unknown-linux-gnu/stage1-tools/x86_64-unknown-linux-gnu/release/deps/liblibgit2_sys-63272627e32ed4c0.rlib" "/tmp/B.XtfB3h/BUILD/rustc-1.52.0-src/build/x86_64-unknown-linux-gnu/stage1-tools/x86_64-unknown-linux-gnu/release/deps/liblibssh2_sys-699968199e176b83.rlib" "/tmp/B.XtfB3h/BUILD/rustc-1.52.0-src/build/x86_64-unknown-linux-gnu/stage1-tools/x86_64-unknown-linux-gnu/release/deps/libopenssl_sys-b497b10ddd8b846b.rlib" "/tmp/B.XtfB3h/BUILD/rustc-1.52.0-src/build/x86_64-unknown-linux-gnu/stage1-tools/x86_64-unknown-linux-gnu/release/deps/liblibz_sys-ac23f756b5ec1665.rlib" "/tmp/B.XtfB3h/BUILD/rustc-1.52.0-src/build/x86_64-unknown-linux-gnu/stage1-tools/x86_64-unknown-linux-gnu/release/deps/libbitflags-eb6a6514b76de4f6.rlib" "/tmp/B.XtfB3h/BUILD/rustc-1.52.0-src/build/x86_64-unknown-linux-gnu/stage1-tools/x86_64-unknown-linux-gnu/release/deps/libtempfile-528fb5faf0bdde3e.rlib" "/tmp/B.XtfB3h/BUILD/rustc-1.52.0-src/build/x86_64-unknown-linux-gnu/stage1-tools/x86_64-unknown-linux-gnu/release/deps/librand-bd7af83a08d0b1ea.rlib" "/tmp/B.XtfB3h/BUILD/rustc-1.52.0-src/build/x86_64-unknown-linux-gnu/stage1-tools/x86_64-unknown-linux-gnu/release/deps/librand_chacha-d808428d7437cf0b.rlib" "/tmp/B.XtfB3h/BUILD/rustc-1.52.0-src/build/x86_64-unknown-linux-gnu/stage1-tools/x86_64-unknown-linux-gnu/release/deps/librand_core-09b12b4cc9eee1de.rlib" "/tmp/B.XtfB3h/BUILD/rustc-1.52.0-src/build/x86_64-unknown-linux-gnu/stage1-tools/x86_64-unknown-linux-gnu/release/deps/libgetrandom-3a39d685a42c0ff1.rlib" "/tmp/B.XtfB3h/BUILD/rustc-1.52.0-src/build/x86_64-unknown-linux-gnu/stage1-tools/x86_64-unknown-linux-gnu/release/deps/libremove_dir_all-144175bf5384425b.rlib" "/tmp/B.XtfB3h/BUILD/rustc-1.52.0-src/build/x86_64-unknown-linux-gnu/stage1-tools/x86_64-unknown-linux-gnu/release/deps/libglob-f0b6cd67f93ee5e6.rlib" "/tmp/B.XtfB3h/BUILD/rustc-1.52.0-src/build/x86_64-unknown-linux-gnu/stage1-tools/x86_64-unknown-linux-gnu/release/deps/libtermcolor-548c11073a1e26b6.rlib" "/tmp/B.XtfB3h/BUILD/rustc-1.52.0-src/build/x86_64-unknown-linux-gnu/stage1-tools/x86_64-unknown-linux-gnu/release/deps/libcurl-d9452262fac33b72.rlib" "/tmp/B.XtfB3h/BUILD/rustc-1.52.0-src/build/x86_64-unknown-linux-gnu/stage1-tools/x86_64-unknown-linux-gnu/release/deps/libsocket2-e4da95843b0109cf.rlib" "/tmp/B.XtfB3h/BUILD/rustc-1.52.0-src/build/x86_64-unknown-linux-gnu/stage1-tools/x86_64-unknown-linux-gnu/release/deps/libcurl_sys-819709d8c08d39af.rlib" "/tmp/B.XtfB3h/BUILD/rustc-1.52.0-src/build/x86_64-unknown-linux-gnu/stage1-tools/x86_64-unknown-linux-gnu/release/deps/libbytesize-4745c32745244329.rlib" "/tmp/B.XtfB3h/BUILD/rustc-1.52.0-src/build/x86_64-unknown-linux-gnu/stage1-tools/x86_64-unknown-linux-gnu/release/deps/liburl-461f760cb1d6467d.rlib" "/tmp/B.XtfB3h/BUILD/rustc-1.52.0-src/build/x86_64-unknown-linux-gnu/stage1-tools/x86_64-unknown-linux-gnu/release/deps/libpercent_encoding-0c2fe98e981e1606.rlib" "/tmp/B.XtfB3h/BUILD/rustc-1.52.0-src/build/x86_64-unknown-linux-gnu/stage1-tools/x86_64-unknown-linux-gnu/release/deps/libidna-553aa4abef346906.rlib" "/tmp/B.XtfB3h/BUILD/rustc-1.52.0-src/build/x86_64-unknown-linux-gnu/stage1-tools/x86_64-unknown-linux-gnu/release/deps/libunicode_normalization-3ef2ed64b4622ce8.rlib" "/tmp/B.XtfB3h/BUILD/rustc-1.52.0-src/build/x86_64-unknown-linux-gnu/stage1-tools/x86_64-unknown-linux-gnu/release/deps/libtinyvec-f946cd554c73f3dc.rlib" "/tmp/B.XtfB3h/BUILD/rustc-1.52.0-src/build/x86_64-unknown-linux-gnu/stage1-tools/x86_64-unknown-linux-gnu/release/deps/libunicode_bidi-ea65b18dd85f3859.rlib" "/tmp/B.XtfB3h/BUILD/rustc-1.52.0-src/build/x86_64-unknown-linux-gnu/stage1-tools/x86_64-unknown-linux-gnu/release/deps/libmatches-a9025550af4b064c.rlib" "/tmp/B.XtfB3h/BUILD/rustc-1.52.0-src/build/x86_64-unknown-linux-gnu/stage1-tools/x86_64-unknown-linux-gnu/release/deps/librand-0bdbb10616eb4376.rlib" "/tmp/B.XtfB3h/BUILD/rustc-1.52.0-src/build/x86_64-unknown-linux-gnu/stage1-tools/x86_64-unknown-linux-gnu/release/deps/librand_chacha-049ccecac5f333dc.rlib" "/tmp/B.XtfB3h/BUILD/rustc-1.52.0-src/build/x86_64-unknown-linux-gnu/stage1-tools/x86_64-unknown-linux-gnu/release/deps/libppv_lite86-af7c6e2abafe9c32.rlib" "/tmp/B.XtfB3h/BUILD/rustc-1.52.0-src/build/x86_64-unknown-linux-gnu/stage1-tools/x86_64-unknown-linux-gnu/release/deps/librand_core-4e4bcdfbd37a93f3.rlib" "/tmp/B.XtfB3h/BUILD/rustc-1.52.0-src/build/x86_64-unknown-linux-gnu/stage1-tools/x86_64-unknown-linux-gnu/release/deps/libgetrandom-33431ffacacd868a.rlib" "/tmp/B.XtfB3h/BUILD/rustc-1.52.0-src/build/x86_64-unknown-linux-gnu/stage1-tools/x86_64-unknown-linux-gnu/release/deps/libcrossbeam_utils-8b44c156e02af5de.rlib" "/tmp/B.XtfB3h/BUILD/rustc-1.52.0-src/build/x86_64-unknown-linux-gnu/stage1-tools/x86_64-unknown-linux-gnu/release/deps/liblazy_static-b63ee8f3ea109544.rlib" "/tmp/B.XtfB3h/BUILD/rustc-1.52.0-src/build/x86_64-unknown-linux-gnu/stage1-tools/x86_64-unknown-linux-gnu/release/deps/libcfg_if-d58e48e96540b267.rlib" "/tmp/B.XtfB3h/BUILD/rustc-1.52.0-src/build/x86_64-unknown-linux-gnu/stage1-tools/x86_64-unknown-linux-gnu/release/deps/liblazycell-0f574e6fccdb1b9a.rlib" "/tmp/B.XtfB3h/BUILD/rustc-1.52.0-src/build/x86_64-unknown-linux-gnu/stage1-tools/x86_64-unknown-linux-gnu/release/deps/libjobserver-5613003565be7348.rlib" "/tmp/B.XtfB3h/BUILD/rustc-1.52.0-src/build/x86_64-unknown-linux-gnu/stage1-tools/x86_64-unknown-linux-gnu/release/deps/libfiletime-bf31ebc6294611ef.rlib" "/tmp/B.XtfB3h/BUILD/rustc-1.52.0-src/build/x86_64-unknown-linux-gnu/stage1-tools/x86_64-unknown-linux-gnu/release/deps/liblibc-c7f33d1ff880face.rlib" "/tmp/B.XtfB3h/BUILD/rustc-1.52.0-src/build/x86_64-unknown-linux-gnu/stage1-tools/x86_64-unknown-linux-gnu/release/deps/libsemver-def375c7fc0fe4e4.rlib" "/tmp/B.XtfB3h/BUILD/rustc-1.52.0-src/build/x86_64-unknown-linux-gnu/stage1-tools/x86_64-unknown-linux-gnu/release/deps/libsemver_parser-d33525dd2c990e23.rlib" "/tmp/B.XtfB3h/BUILD/rustc-1.52.0-src/build/x86_64-unknown-linux-gnu/stage1-tools/x86_64-unknown-linux-gnu/release/deps/libcargo_platform-eeb8902723416fad.rlib" "/tmp/B.XtfB3h/BUILD/rustc-1.52.0-src/build/x86_64-unknown-linux-gnu/stage1-tools/x86_64-unknown-linux-gnu/release/deps/libserde-a60da1908f18824b.rlib" "/tmp/B.XtfB3h/BUILD/rustc-1.52.0-src/build/x86_64-unknown-linux-gnu/stage1-tools/x86_64-unknown-linux-gnu/release/deps/liblog-c9d06714704976de.rlib" "/tmp/B.XtfB3h/BUILD/rustc-1.52.0-src/build/x86_64-unknown-linux-gnu/stage1-tools/x86_64-unknown-linux-gnu/release/deps/libcfg_if-c510b1b733e81177.rlib" "/tmp/B.XtfB3h/BUILD/rustc-1.52.0-src/build/x86_64-unknown-linux-gnu/stage1-tools/x86_64-unknown-linux-gnu/release/deps/libanyhow-26c8e6d329365311.rlib" "-Wl,--start-group" "/tmp/B.XtfB3h/BUILD/rustc-1.52.0-src/build/x86_64-unknown-linux-gnu/stage1/lib/rustlib/x86_64-unknown-linux-gnu/lib/libstd-73f264a7d4b17036.rlib" "/tmp/B.XtfB3h/BUILD/rustc-1.52.0-src/build/x86_64-unknown-linux-gnu/stage1/lib/rustlib/x86_64-unknown-linux-gnu/lib/libpanic_unwind-0c98c365506d5624.rlib" "/tmp/B.XtfB3h/BUILD/rustc-1.52.0-src/build/x86_64-unknown-linux-gnu/stage1/lib/rustlib/x86_64-unknown-linux-gnu/lib/libminiz_oxide-3f7e21dd26c19a88.rlib" "/tmp/B.XtfB3h/BUILD/rustc-1.52.0-src/build/x86_64-unknown-linux-gnu/stage1/lib/rustlib/x86_64-unknown-linux-gnu/lib/libadler-2e698ff0567f6d15.rlib" "/tmp/B.XtfB3h/BUILD/rustc-1.52.0-src/build/x86_64-unknown-linux-gnu/stage1/lib/rustlib/x86_64-unknown-linux-gnu/lib/libobject-bef27d78a935175e.rlib" "/tmp/B.XtfB3h/BUILD/rustc-1.52.0-src/build/x86_64-unknown-linux-gnu/stage1/lib/rustlib/x86_64-unknown-linux-gnu/lib/libaddr2line-5b2fc6be2e8a3559.rlib" "/tmp/B.XtfB3h/BUILD/rustc-1.52.0-src/build/x86_64-unknown-linux-gnu/stage1/lib/rustlib/x86_64-unknown-linux-gnu/lib/libgimli-8fa7a65873e6eb70.rlib" "/tmp/B.XtfB3h/BUILD/rustc-1.52.0-src/build/x86_64-unknown-linux-gnu/stage1/lib/rustlib/x86_64-unknown-linux-gnu/lib/librustc_demangle-c6d84cb6e9f6501d.rlib" "/tmp/B.XtfB3h/BUILD/rustc-1.52.0-src/build/x86_64-unknown-linux-gnu/stage1/lib/rustlib/x86_64-unknown-linux-gnu/lib/libhashbrown-77f044b51b690871.rlib" "/tmp/B.XtfB3h/BUILD/rustc-1.52.0-src/build/x86_64-unknown-linux-gnu/stage1/lib/rustlib/x86_64-unknown-linux-gnu/lib/librustc_std_workspace_alloc-8df2c039324822f4.rlib" "/tmp/B.XtfB3h/BUILD/rustc-1.52.0-src/build/x86_64-unknown-linux-gnu/stage1/lib/rustlib/x86_64-unknown-linux-gnu/lib/libunwind-0df73623b1c056b8.rlib" "/tmp/B.XtfB3h/BUILD/rustc-1.52.0-src/build/x86_64-unknown-linux-gnu/stage1/lib/rustlib/x86_64-unknown-linux-gnu/lib/libcfg_if-f5e5198a273e4a13.rlib" "/tmp/B.XtfB3h/BUILD/rustc-1.52.0-src/build/x86_64-unknown-linux-gnu/stage1/lib/rustlib/x86_64-unknown-linux-gnu/lib/liblibc-833b9a3a4c1b632d.rlib" "/tmp/B.XtfB3h/BUILD/rustc-1.52.0-src/build/x86_64-unknown-linux-gnu/stage1/lib/rustlib/x86_64-unknown-linux-gnu/lib/liballoc-c38b477524f7e26e.rlib" "/tmp/B.XtfB3h/BUILD/rustc-1.52.0-src/build/x86_64-unknown-linux-gnu/stage1/lib/rustlib/x86_64-unknown-linux-gnu/lib/librustc_std_workspace_core-e87d7841c6549bd7.rlib" "/tmp/B.XtfB3h/BUILD/rustc-1.52.0-src/build/x86_64-unknown-linux-gnu/stage1/lib/rustlib/x86_64-unknown-linux-gnu/lib/libcore-5a41b4b582501f38.rlib" "-Wl,--end-group" "/tmp/B.XtfB3h/BUILD/rustc-1.52.0-src/build/x86_64-unknown-linux-gnu/stage1/lib/rustlib/x86_64-unknown-linux-gnu/lib/libcompiler_builtins-9b57e2899fbab757.rlib" "-Wl,-Bdynamic" "-lssl" "-lcrypto" "-lz" "-lcurl" "-lgcc_s" "-lutil" "-lrt" "-lpthread" "-lm" "-ldl" "-lc"
  = note: /usr/bin/ld: skipping incompatible /usr/libx32/libssl.so when searching for -lssl
          /usr/bin/ld: skipping incompatible /usr/libx32/libssl.a when searching for -lssl
          /usr/bin/ld: skipping incompatible /usr/libx32/gcc/x86_64-pld-linux-gnux32/11.1.0/../../../libssl.so when searching for -lssl
          /usr/bin/ld: skipping incompatible /usr/libx32/gcc/x86_64-pld-linux-gnux32/11.1.0/../../../libssl.a when searching for -lssl
          /usr/bin/ld: skipping incompatible /usr/libx32/libssl.so when searching for -lssl
          /usr/bin/ld: skipping incompatible /usr/libx32/libssl.a when searching for -lssl
          /usr/bin/ld: cannot find -lssl
          /usr/bin/ld: skipping incompatible /usr/libx32/libssl.so when searching for -lssl
          /usr/bin/ld: skipping incompatible /usr/libx32/gcc/x86_64-pld-linux-gnux32/11.1.0/../../../libssl.so when searching for -lssl
          /usr/bin/ld: skipping incompatible /usr/libx32/libssl.so when searching for -lssl
          /usr/bin/ld: skipping incompatible /usr/libx32/libcrypto.so when searching for -lcrypto
          /usr/bin/ld: skipping incompatible /usr/libx32/libcrypto.a when searching for -lcrypto
          /usr/bin/ld: skipping incompatible /usr/libx32/gcc/x86_64-pld-linux-gnux32/11.1.0/../../../libcrypto.so when searching for -lcrypto
          /usr/bin/ld: skipping incompatible /usr/libx32/gcc/x86_64-pld-linux-gnux32/11.1.0/../../../libcrypto.a when searching for -lcrypto
          /usr/bin/ld: skipping incompatible /usr/libx32/libcrypto.so when searching for -lcrypto
          /usr/bin/ld: skipping incompatible /usr/libx32/libcrypto.a when searching for -lcrypto
          /usr/bin/ld: cannot find -lcrypto
          /usr/bin/ld: skipping incompatible /usr/libx32/libcrypto.so when searching for -lcrypto
          /usr/bin/ld: skipping incompatible /usr/libx32/gcc/x86_64-pld-linux-gnux32/11.1.0/../../../libcrypto.so when searching for -lcrypto
          /usr/bin/ld: skipping incompatible /usr/libx32/libcrypto.so when searching for -lcrypto
          /usr/bin/ld: skipping incompatible /usr/libx32/libz.so when searching for -lz
          /usr/bin/ld: skipping incompatible /usr/libx32/libz.a when searching for -lz
          /usr/bin/ld: skipping incompatible /usr/libx32/libcurl.so when searching for -lcurl
          /usr/bin/ld: skipping incompatible /usr/libx32/gcc/x86_64-pld-linux-gnux32/11.1.0/../../../libcurl.so when searching for -lcurl
          /usr/bin/ld: skipping incompatible /usr/libx32/libcurl.so when searching for -lcurl
          /usr/bin/ld: cannot find -lcurl
          /usr/bin/ld: skipping incompatible /usr/libx32/libcurl.so when searching for -lcurl
          /usr/bin/ld: skipping incompatible /usr/libx32/gcc/x86_64-pld-linux-gnux32/11.1.0/../../../libcurl.so when searching for -lcurl
          /usr/bin/ld: skipping incompatible /usr/libx32/libcurl.so when searching for -lcurl
          collect2: error: ld returned 1 exit status
          

error: aborting due to previous error


Did not run successfully: exit code: 1
"/tmp/B.XtfB3h/BUILD/rustc-1.52.0-src/build/x86_64-unknown-linux-gnu/stage1/bin/rustc" "--crate-name" "cargo" "--edition=2018" "src/tools/cargo/src/bin/cargo/main.rs" "--error-format=json" "--json=diagnostic-rendered-ansi" "--crate-type" "bin" "--emit=dep-info,link" "-C" "opt-level=3" "-C" "embed-bitcode=no" "-C" "debuginfo=0" "-C" "metadata=ec5e048f2e257e15" "-C" "extra-filename=-ec5e048f2e257e15" "--out-dir" "/tmp/B.XtfB3h/BUILD/rustc-1.52.0-src/build/x86_64-unknown-linux-gnu/stage1-tools/x86_64-unknown-linux-gnu/release/deps" "--target" "x86_64-unknown-linux-gnu" "-L" "dependency=/tmp/B.XtfB3h/BUILD/rustc-1.52.0-src/build/x86_64-unknown-linux-gnu/stage1-tools/x86_64-unknown-linux-gnu/release/deps" "-L" "dependency=/tmp/B.XtfB3h/BUILD/rustc-1.52.0-src/build/x86_64-unknown-linux-gnu/stage1-tools/release/deps" "--extern" "anyhow=/tmp/B.XtfB3h/BUILD/rustc-1.52.0-src/build/x86_64-unknown-linux-gnu/stage1-tools/x86_64-unknown-linux-gnu/release/deps/libanyhow-26c8e6d329365311.rlib" "--extern" "atty=/tmp/B.XtfB3h/BUILD/rustc-1.52.0-src/build/x86_64-unknown-linux-gnu/stage1-tools/x86_64-unknown-linux-gnu/release/deps/libatty-3897dd9fc8f32f6a.rlib" "--extern" "bytesize=/tmp/B.XtfB3h/BUILD/rustc-1.52.0-src/build/x86_64-unknown-linux-gnu/stage1-tools/x86_64-unknown-linux-gnu/release/deps/libbytesize-4745c32745244329.rlib" "--extern" "cargo=/tmp/B.XtfB3h/BUILD/rustc-1.52.0-src/build/x86_64-unknown-linux-gnu/stage1-tools/x86_64-unknown-linux-gnu/release/deps/libcargo-23e8a01484eb3197.rlib" "--extern" "cargo_platform=/tmp/B.XtfB3h/BUILD/rustc-1.52.0-src/build/x86_64-unknown-linux-gnu/stage1-tools/x86_64-unknown-linux-gnu/release/deps/libcargo_platform-eeb8902723416fad.rlib" "--extern" "clap=/tmp/B.XtfB3h/BUILD/rustc-1.52.0-src/build/x86_64-unknown-linux-gnu/stage1-tools/x86_64-unknown-linux-gnu/release/deps/libclap-f4120352c0f03d1c.rlib" "--extern" "crates_io=/tmp/B.XtfB3h/BUILD/rustc-1.52.0-src/build/x86_64-unknown-linux-gnu/stage1-tools/x86_64-unknown-linux-gnu/release/deps/libcrates_io-93c08763b6f635eb.rlib" "--extern" "crossbeam_utils=/tmp/B.XtfB3h/BUILD/rustc-1.52.0-src/build/x86_64-unknown-linux-gnu/stage1-tools/x86_64-unknown-linux-gnu/release/deps/libcrossbeam_utils-8b44c156e02af5de.rlib" "--extern" "crypto_hash=/tmp/B.XtfB3h/BUILD/rustc-1.52.0-src/build/x86_64-unknown-linux-gnu/stage1-tools/x86_64-unknown-linux-gnu/release/deps/libcrypto_hash-1a0eef28dd744368.rlib" "--extern" "curl=/tmp/B.XtfB3h/BUILD/rustc-1.52.0-src/build/x86_64-unknown-linux-gnu/stage1-tools/x86_64-unknown-linux-gnu/release/deps/libcurl-d9452262fac33b72.rlib" "--extern" "curl_sys=/tmp/B.XtfB3h/BUILD/rustc-1.52.0-src/build/x86_64-unknown-linux-gnu/stage1-tools/x86_64-unknown-linux-gnu/release/deps/libcurl_sys-819709d8c08d39af.rlib" "--extern" "env_logger=/tmp/B.XtfB3h/BUILD/rustc-1.52.0-src/build/x86_64-unknown-linux-gnu/stage1-tools/x86_64-unknown-linux-gnu/release/deps/libenv_logger-d8f4338133da7c71.rlib" "--extern" "filetime=/tmp/B.XtfB3h/BUILD/rustc-1.52.0-src/build/x86_64-unknown-linux-gnu/stage1-tools/x86_64-unknown-linux-gnu/release/deps/libfiletime-bf31ebc6294611ef.rlib" "--extern" "flate2=/tmp/B.XtfB3h/BUILD/rustc-1.52.0-src/build/x86_64-unknown-linux-gnu/stage1-tools/x86_64-unknown-linux-gnu/release/deps/libflate2-39eee8a87f21e719.rlib" "--extern" "git2=/tmp/B.XtfB3h/BUILD/rustc-1.52.0-src/build/x86_64-unknown-linux-gnu/stage1-tools/x86_64-unknown-linux-gnu/release/deps/libgit2-9654de238ee3664f.rlib" "--extern" "git2_curl=/tmp/B.XtfB3h/BUILD/rustc-1.52.0-src/build/x86_64-unknown-linux-gnu/stage1-tools/x86_64-unknown-linux-gnu/release/deps/libgit2_curl-01f68a0ee423ad7d.rlib" "--extern" "glob=/tmp/B.XtfB3h/BUILD/rustc-1.52.0-src/build/x86_64-unknown-linux-gnu/stage1-tools/x86_64-unknown-linux-gnu/release/deps/libglob-f0b6cd67f93ee5e6.rlib" "--extern" "hex=/tmp/B.XtfB3h/BUILD/rustc-1.52.0-src/build/x86_64-unknown-linux-gnu/stage1-tools/x86_64-unknown-linux-gnu/release/deps/libhex-ea4b49ea672f1d2e.rlib" "--extern" "home=/tmp/B.XtfB3h/BUILD/rustc-1.52.0-src/build/x86_64-unknown-linux-gnu/stage1-tools/x86_64-unknown-linux-gnu/release/deps/libhome-efb09d58dccb8961.rlib" "--extern" "humantime=/tmp/B.XtfB3h/BUILD/rustc-1.52.0-src/build/x86_64-unknown-linux-gnu/stage1-tools/x86_64-unknown-linux-gnu/release/deps/libhumantime-7f237d82b1c6a20f.rlib" "--extern" "ignore=/tmp/B.XtfB3h/BUILD/rustc-1.52.0-src/build/x86_64-unknown-linux-gnu/stage1-tools/x86_64-unknown-linux-gnu/release/deps/libignore-c8de76aba52cd4ec.rlib" "--extern" "im_rc=/tmp/B.XtfB3h/BUILD/rustc-1.52.0-src/build/x86_64-unknown-linux-gnu/stage1-tools/x86_64-unknown-linux-gnu/release/deps/libim_rc-2db7390d7cecc610.rlib" "--extern" "jobserver=/tmp/B.XtfB3h/BUILD/rustc-1.52.0-src/build/x86_64-unknown-linux-gnu/stage1-tools/x86_64-unknown-linux-gnu/release/deps/libjobserver-5613003565be7348.rlib" "--extern" "lazy_static=/tmp/B.XtfB3h/BUILD/rustc-1.52.0-src/build/x86_64-unknown-linux-gnu/stage1-tools/x86_64-unknown-linux-gnu/release/deps/liblazy_static-b63ee8f3ea109544.rlib" "--extern" "lazycell=/tmp/B.XtfB3h/BUILD/rustc-1.52.0-src/build/x86_64-unknown-linux-gnu/stage1-tools/x86_64-unknown-linux-gnu/release/deps/liblazycell-0f574e6fccdb1b9a.rlib" "--extern" "libc=/tmp/B.XtfB3h/BUILD/rustc-1.52.0-src/build/x86_64-unknown-linux-gnu/stage1-tools/x86_64-unknown-linux-gnu/release/deps/liblibc-c7f33d1ff880face.rlib" "--extern" "libgit2_sys=/tmp/B.XtfB3h/BUILD/rustc-1.52.0-src/build/x86_64-unknown-linux-gnu/stage1-tools/x86_64-unknown-linux-gnu/release/deps/liblibgit2_sys-63272627e32ed4c0.rlib" "--extern" "log=/tmp/B.XtfB3h/BUILD/rustc-1.52.0-src/build/x86_64-unknown-linux-gnu/stage1-tools/x86_64-unknown-linux-gnu/release/deps/liblog-c9d06714704976de.rlib" "--extern" "memchr=/tmp/B.XtfB3h/BUILD/rustc-1.52.0-src/build/x86_64-unknown-linux-gnu/stage1-tools/x86_64-unknown-linux-gnu/release/deps/libmemchr-50de0c51580ec93b.rlib" "--extern" "num_cpus=/tmp/B.XtfB3h/BUILD/rustc-1.52.0-src/build/x86_64-unknown-linux-gnu/stage1-tools/x86_64-unknown-linux-gnu/release/deps/libnum_cpus-96765d59807c1aa7.rlib" "--extern" "opener=/tmp/B.XtfB3h/BUILD/rustc-1.52.0-src/build/x86_64-unknown-linux-gnu/stage1-tools/x86_64-unknown-linux-gnu/release/deps/libopener-77c0baa9eb7de122.rlib" "--extern" "percent_encoding=/tmp/B.XtfB3h/BUILD/rustc-1.52.0-src/build/x86_64-unknown-linux-gnu/stage1-tools/x86_64-unknown-linux-gnu/release/deps/libpercent_encoding-0c2fe98e981e1606.rlib" "--extern" "rand=/tmp/B.XtfB3h/BUILD/rustc-1.52.0-src/build/x86_64-unknown-linux-gnu/stage1-tools/x86_64-unknown-linux-gnu/release/deps/librand-0bdbb10616eb4376.rlib" "--extern" "rustc_workspace_hack=/tmp/B.XtfB3h/BUILD/rustc-1.52.0-src/build/x86_64-unknown-linux-gnu/stage1-tools/x86_64-unknown-linux-gnu/release/deps/librustc_workspace_hack-6f9a7e9ba25586d1.rlib" "--extern" "rustfix=/tmp/B.XtfB3h/BUILD/rustc-1.52.0-src/build/x86_64-unknown-linux-gnu/stage1-tools/x86_64-unknown-linux-gnu/release/deps/librustfix-0e45a65344741f3c.rlib" "--extern" "same_file=/tmp/B.XtfB3h/BUILD/rustc-1.52.0-src/build/x86_64-unknown-linux-gnu/stage1-tools/x86_64-unknown-linux-gnu/release/deps/libsame_file-8166268969abc34d.rlib" "--extern" "semver=/tmp/B.XtfB3h/BUILD/rustc-1.52.0-src/build/x86_64-unknown-linux-gnu/stage1-tools/x86_64-unknown-linux-gnu/release/deps/libsemver-def375c7fc0fe4e4.rlib" "--extern" "serde=/tmp/B.XtfB3h/BUILD/rustc-1.52.0-src/build/x86_64-unknown-linux-gnu/stage1-tools/x86_64-unknown-linux-gnu/release/deps/libserde-a60da1908f18824b.rlib" "--extern" "serde_ignored=/tmp/B.XtfB3h/BUILD/rustc-1.52.0-src/build/x86_64-unknown-linux-gnu/stage1-tools/x86_64-unknown-linux-gnu/release/deps/libserde_ignored-42b80a2c13bb5b9e.rlib" "--extern" "serde_json=/tmp/B.XtfB3h/BUILD/rustc-1.52.0-src/build/x86_64-unknown-linux-gnu/stage1-tools/x86_64-unknown-linux-gnu/release/deps/libserde_json-38f88ab48d93b79b.rlib" "--extern" "shell_escape=/tmp/B.XtfB3h/BUILD/rustc-1.52.0-src/build/x86_64-unknown-linux-gnu/stage1-tools/x86_64-unknown-linux-gnu/release/deps/libshell_escape-1f0f58c2efc26d1e.rlib" "--extern" "strip_ansi_escapes=/tmp/B.XtfB3h/BUILD/rustc-1.52.0-src/build/x86_64-unknown-linux-gnu/stage1-tools/x86_64-unknown-linux-gnu/release/deps/libstrip_ansi_escapes-2ab7bf0e496f1a5c.rlib" "--extern" "tar=/tmp/B.XtfB3h/BUILD/rustc-1.52.0-src/build/x86_64-unknown-linux-gnu/stage1-tools/x86_64-unknown-linux-gnu/release/deps/libtar-8a61b09719607154.rlib" "--extern" "tempfile=/tmp/B.XtfB3h/BUILD/rustc-1.52.0-src/build/x86_64-unknown-linux-gnu/stage1-tools/x86_64-unknown-linux-gnu/release/deps/libtempfile-528fb5faf0bdde3e.rlib" "--extern" "termcolor=/tmp/B.XtfB3h/BUILD/rustc-1.52.0-src/build/x86_64-unknown-linux-gnu/stage1-tools/x86_64-unknown-linux-gnu/release/deps/libtermcolor-548c11073a1e26b6.rlib" "--extern" "toml=/tmp/B.XtfB3h/BUILD/rustc-1.52.0-src/build/x86_64-unknown-linux-gnu/stage1-tools/x86_64-unknown-linux-gnu/release/deps/libtoml-f8b5771e3f11c802.rlib" "--extern" "unicode_width=/tmp/B.XtfB3h/BUILD/rustc-1.52.0-src/build/x86_64-unknown-linux-gnu/stage1-tools/x86_64-unknown-linux-gnu/release/deps/libunicode_width-439593cbb5adc90a.rlib" "--extern" "unicode_xid=/tmp/B.XtfB3h/BUILD/rustc-1.52.0-src/build/x86_64-unknown-linux-gnu/stage1-tools/x86_64-unknown-linux-gnu/release/deps/libunicode_xid-5439b13c16948c4a.rlib" "--extern" "url=/tmp/B.XtfB3h/BUILD/rustc-1.52.0-src/build/x86_64-unknown-linux-gnu/stage1-tools/x86_64-unknown-linux-gnu/release/deps/liburl-461f760cb1d6467d.rlib" "--extern" "walkdir=/tmp/B.XtfB3h/BUILD/rustc-1.52.0-src/build/x86_64-unknown-linux-gnu/stage1-tools/x86_64-unknown-linux-gnu/release/deps/libwalkdir-de79cbc5956be93e.rlib" "-Zmacro-backtrace" "-Ztls-model=initial-exec" "-Z" "binary-dep-depinfo" "-L" "native=/usr/libx32" "-L" "native=/tmp/B.XtfB3h/BUILD/rustc-1.52.0-src/build/x86_64-unknown-linux-gnu/stage1-tools/x86_64-unknown-linux-gnu/release/build/libnghttp2-sys-4255034ac6e49b4c/out/i/lib" "-L" "native=/tmp/B.XtfB3h/BUILD/rustc-1.52.0-src/build/x86_64-unknown-linux-gnu/stage1-tools/x86_64-unknown-linux-gnu/release/build/libgit2-sys-4700f324ad6104cc/out/build" "-L" "native=/tmp/B.XtfB3h/BUILD/rustc-1.52.0-src/build/x86_64-unknown-linux-gnu/stage1-tools/x86_64-unknown-linux-gnu/release/build/libssh2-sys-7ef25151156179c1/out/build" "--sysroot" "/tmp/B.XtfB3h/BUILD/rustc-1.52.0-src/build/x86_64-unknown-linux-gnu/stage1"
-------------
error: could not compile `cargo`

To learn more, run the command again with --verbose.
command did not execute successfully: "/tmp/B.XtfB3h/BUILD/rustc-1.52.0-src/rust-1.51.0-x86_64-unknown-linux-gnu/bin/cargo" "build" "--target" "x86_64-unknown-linux-gnu" "-Zbinary-dep-depinfo" "-j" "4" "--release" "--frozen" "--manifest-path" "/tmp/B.XtfB3h/BUILD/rustc-1.52.0-src/src/tools/cargo/Cargo.toml" "--message-format" "json-render-diagnostics"
expected success, got: exit code: 101
Traceback (most recent call last):
  File "/tmp/B.XtfB3h/BUILD/rustc-1.52.0-src/./x.py", line 27, in <module>
    bootstrap.main()
  File "/tmp/B.XtfB3h/BUILD/rustc-1.52.0-src/src/bootstrap/bootstrap.py", line 1175, in main
    bootstrap(help_triggered)
  File "/tmp/B.XtfB3h/BUILD/rustc-1.52.0-src/src/bootstrap/bootstrap.py", line 1161, in bootstrap
    run(args, env=env, verbose=build.verbose)
  File "/tmp/B.XtfB3h/BUILD/rustc-1.52.0-src/src/bootstrap/bootstrap.py", line 153, in run
    raise RuntimeError(err)
RuntimeError: failed to run: /tmp/B.XtfB3h/BUILD/rustc-1.52.0-src/build/bootstrap/debug/bootstrap dist -j 4 --verbose
error: Bad exit status from /tmp/B.XtfB3h/BUILD/tmp/rpm-tmp.cqxXv0 (%build)


RPM build errors:
    Could not canonicalize hostname: naiad
    Bad exit status from /tmp/B.XtfB3h/BUILD/tmp/rpm-tmp.cqxXv0 (%build)
ended at: Tue May 25 16:28:58 2021, done in 1:02:31.818281
error: No files produced.
+ chmod -R u+rwX /tmp/B.XtfB3h/BUILD
+ rm -rf /tmp/B.XtfB3h/tmp /tmp/B.XtfB3h/BUILD
+ rm -rf /tmp/B.XtfB3h
Begin-PLD-Builder-Info
Build-Time: user:12645.00s sys:220.11s real:3814.15s (faults io:263 non-io:24330820)

End-PLD-Builder-Info
[Back to list of logs] [View rpm -qa of builder]