FailedOk

th/SRPMS[OK]
th/x32[OK]
th/i686[OK]
th/x86_64[OK]

ac/SRPMS[OK]
ac/i386[OK]
ac/i586[OK]
ac/i686[OK]
ac/alpha[OK]
ac/amd64[OK]
ac/athlon[OK]
ac/ppc[OK]
ac/sparc[OK]
ac/sparc64[OK]

Advanced Search
main()
Powered by PLD Linux
(c) 2002-2021 PLD Team
$Revision: 1.37 $
Powered by Linux.
Your IP: 54.227.97.219

sssd fa4c77e9-7fcf-4072-a63b-768be1cb26d5

Status:Failed
Source URL:https://buildlogs.pld-linux.org/pld/th/x32/FAIL/sssd,fa4c77e9-7fcf-4072-a63b-768be1cb26d5.bz2
text/plain URL:View!
full text:View!
rpm -qa of builder:View!
Date:2021/11/21 09:06:37
Runtime:0:01:19.846234

Toc:

  • error 1
  • src/providers/ad/ad_gpo_ndr.c:108:13: error: too few arguments to function 'ndr_token_peek'
  • error 2
  • src/providers/ad/ad_gpo_ndr.c:138:13: error: too few arguments to function 'ndr_token_peek'
  • error 3
  • src/providers/ad/ad_gpo_ndr.c:201:13: error: too few arguments to function 'ndr_token_peek'
  • error 4
  • make[2]: *** [Makefile:13060: src/providers/ad/libsss_ad_la-ad_gpo_ndr.lo] Error 1
  • error 5
  • make[1]: *** [Makefile:20605: all-recursive] Error 1
  • error 6
  • error: Bad exit status from /tmp/B.j8crwcva/BUILD/tmp/rpm-tmp.CXu6fS (%build)
  • error 7
  • RPM build errors:
  • error 8
  • error: No files produced.

Content:

make[2]: Leaving directory '/tmp/B.j8crwcva/BUILD/sssd-1.13.4'
make[2]: Entering directory '/tmp/B.j8crwcva/BUILD/sssd-1.13.4'
/bin/sh ./libtool  --tag=CC   --mode=compile x86_64-pld-linux-gnux32-gcc -DHAVE_CONFIG_H -I.  -Wall -Iinclude -I.. -I./include -I./src/sss_client -I./src -Iinclude -I.      -I/usr/include/dbus-1.0 -I/usr/libx32/dbus-1.0/include     -I/usr/include/libnl3  -I/usr/include/glib-2.0 -I/usr/libx32/glib-2.0/include  -DLIBDIR=\"/usr/libx32\" -DVARDIR=\"/var\" -DSSS_STATEDIR=\"/var/lib/sss\" -DSYSCONFDIR=\"/etc\" -DSHLIBEXT=\"\" -DSSSD_LIBEXEC_PATH=\"/usr/libexec/sssd\" -DSSSD_CONF_DIR=\"/etc/sssd\" -DSSS_NSS_MCACHE_DIR=\"/var/lib/sss/mc\" -DSSS_NSS_SOCKET_NAME=\"/var/lib/sss/pipes/nss\" -DSSS_PAM_SOCKET_NAME=\"/var/lib/sss/pipes/pam\" -DSSS_PAC_SOCKET_NAME=\"/var/lib/sss/pipes/pac\" -DSSS_PAM_PRIV_SOCKET_NAME=\"/var/lib/sss/pipes/private/pam\" -DSSS_SUDO_SOCKET_NAME=\"/var/lib/sss/pipes/sudo\" -DSSS_AUTOFS_SOCKET_NAME=\"/var/lib/sss/pipes/autofs\" -DSSS_SSH_SOCKET_NAME=\"/var/lib/sss/pipes/ssh\" -DLOCALEDIR=\"/usr/share/locale\" -DBASE_FILE_STEM=\"libsss_ad_la-ad_opts\"    -Wall -Wshadow -Wstrict-prototypes -Wpointer-arith -Wcast-qual -Wcast-align -Wwrite-strings -Wundef -Werror-implicit-function-declaration -Winit-self -fno-strict-aliasing -std=gnu99     -DHAVE_IMMEDIATE_STRUCTURES=1 -D_GNU_SOURCE=1 -DHAVE_IMMEDIATE_STRUCTURES=1 -D_GNU_SOURCE=1 -DHAVE_IMMEDIATE_STRUCTURES=1 -I/usr/include/samba-4.0 -I/usr/include/samba-4.0 -O2 -fwrapv -pipe -Wformat -Werror=format-security -gdwarf-4 -fno-debug-types-section -fvar-tracking-assignments -g2 -Wp,-D_FORTIFY_SOURCE=2 -fstack-protector-strong --param=ssp-buffer-size=4 -Werror=trampolines -fPIC -mtune=generic -march=x86-64 -gdwarf-4 -fno-debug-types-section -fvar-tracking-assignments -g2  -D_FILE_OFFSET_BITS=64 -D_LARGEFILE_SOURCE -D_LARGEFILE64_SOURCE -MT src/providers/ad/libsss_ad_la-ad_opts.lo -MD -MP -MF src/providers/ad/.deps/libsss_ad_la-ad_opts.Tpo -c -o src/providers/ad/libsss_ad_la-ad_opts.lo `test -f 'src/providers/ad/ad_opts.c' || echo './'`src/providers/ad/ad_opts.c
libtool: compile:  x86_64-pld-linux-gnux32-gcc -DHAVE_CONFIG_H -I. -Wall -Iinclude -I.. -I./include -I./src/sss_client -I./src -Iinclude -I. -I/usr/include/dbus-1.0 -I/usr/libx32/dbus-1.0/include -I/usr/include/libnl3 -I/usr/include/glib-2.0 -I/usr/libx32/glib-2.0/include -DLIBDIR=\"/usr/libx32\" -DVARDIR=\"/var\" -DSSS_STATEDIR=\"/var/lib/sss\" -DSYSCONFDIR=\"/etc\" -DSHLIBEXT=\"\" -DSSSD_LIBEXEC_PATH=\"/usr/libexec/sssd\" -DSSSD_CONF_DIR=\"/etc/sssd\" -DSSS_NSS_MCACHE_DIR=\"/var/lib/sss/mc\" -DSSS_NSS_SOCKET_NAME=\"/var/lib/sss/pipes/nss\" -DSSS_PAM_SOCKET_NAME=\"/var/lib/sss/pipes/pam\" -DSSS_PAC_SOCKET_NAME=\"/var/lib/sss/pipes/pac\" -DSSS_PAM_PRIV_SOCKET_NAME=\"/var/lib/sss/pipes/private/pam\" -DSSS_SUDO_SOCKET_NAME=\"/var/lib/sss/pipes/sudo\" -DSSS_AUTOFS_SOCKET_NAME=\"/var/lib/sss/pipes/autofs\" -DSSS_SSH_SOCKET_NAME=\"/var/lib/sss/pipes/ssh\" -DLOCALEDIR=\"/usr/share/locale\" -DBASE_FILE_STEM=\"libsss_ad_la-ad_opts\" -Wall -Wshadow -Wstrict-prototypes -Wpointer-arith -Wcast-qual -Wcast-align -Wwrite-strings -Wundef -Werror-implicit-function-declaration -Winit-self -fno-strict-aliasing -std=gnu99 -DHAVE_IMMEDIATE_STRUCTURES=1 -D_GNU_SOURCE=1 -DHAVE_IMMEDIATE_STRUCTURES=1 -D_GNU_SOURCE=1 -DHAVE_IMMEDIATE_STRUCTURES=1 -I/usr/include/samba-4.0 -I/usr/include/samba-4.0 -O2 -fwrapv -pipe -Wformat -Werror=format-security -gdwarf-4 -fno-debug-types-section -fvar-tracking-assignments -g2 -Wp,-D_FORTIFY_SOURCE=2 -fstack-protector-strong --param=ssp-buffer-size=4 -Werror=trampolines -fPIC -mtune=generic -march=x86-64 -gdwarf-4 -fno-debug-types-section -fvar-tracking-assignments -g2 -D_FILE_OFFSET_BITS=64 -D_LARGEFILE_SOURCE -D_LARGEFILE64_SOURCE -MT src/providers/ad/libsss_ad_la-ad_opts.lo -MD -MP -MF src/providers/ad/.deps/libsss_ad_la-ad_opts.Tpo -c src/providers/ad/ad_opts.c  -fPIC -DPIC -o src/providers/ad/.libs/libsss_ad_la-ad_opts.o
In file included from ./src/providers/krb5/krb5_common.h:34,
                 from ./src/providers/ldap/ldap_common.h:29,
                 from src/providers/ad/ad_opts.c:26:
./src/util/sss_krb5.h:113:5: warning: "HAVE_KRB5_GET_INIT_CREDS_OPT_SET_FAST_FLAGS" is not defined, evaluates to 0 [-Wundef]
  113 | #if HAVE_KRB5_GET_INIT_CREDS_OPT_SET_FAST_FLAGS
      |     ^~~~~~~~~~~~~~~~~~~~~~~~~~~~~~~~~~~~~~~~~~~
mv -f src/providers/ad/.deps/libsss_ad_la-ad_opts.Tpo src/providers/ad/.deps/libsss_ad_la-ad_opts.Plo
make[2]: Leaving directory '/tmp/B.j8crwcva/BUILD/sssd-1.13.4'
make[2]: Entering directory '/tmp/B.j8crwcva/BUILD/sssd-1.13.4'
/bin/sh ./libtool  --tag=CC   --mode=compile x86_64-pld-linux-gnux32-gcc -DHAVE_CONFIG_H -I.  -Wall -Iinclude -I.. -I./include -I./src/sss_client -I./src -Iinclude -I.      -I/usr/include/dbus-1.0 -I/usr/libx32/dbus-1.0/include     -I/usr/include/libnl3  -I/usr/include/glib-2.0 -I/usr/libx32/glib-2.0/include  -DLIBDIR=\"/usr/libx32\" -DVARDIR=\"/var\" -DSSS_STATEDIR=\"/var/lib/sss\" -DSYSCONFDIR=\"/etc\" -DSHLIBEXT=\"\" -DSSSD_LIBEXEC_PATH=\"/usr/libexec/sssd\" -DSSSD_CONF_DIR=\"/etc/sssd\" -DSSS_NSS_MCACHE_DIR=\"/var/lib/sss/mc\" -DSSS_NSS_SOCKET_NAME=\"/var/lib/sss/pipes/nss\" -DSSS_PAM_SOCKET_NAME=\"/var/lib/sss/pipes/pam\" -DSSS_PAC_SOCKET_NAME=\"/var/lib/sss/pipes/pac\" -DSSS_PAM_PRIV_SOCKET_NAME=\"/var/lib/sss/pipes/private/pam\" -DSSS_SUDO_SOCKET_NAME=\"/var/lib/sss/pipes/sudo\" -DSSS_AUTOFS_SOCKET_NAME=\"/var/lib/sss/pipes/autofs\" -DSSS_SSH_SOCKET_NAME=\"/var/lib/sss/pipes/ssh\" -DLOCALEDIR=\"/usr/share/locale\" -DBASE_FILE_STEM=\"libsss_ipa_la-ipa_hostid\"    -Wall -Wshadow -Wstrict-prototypes -Wpointer-arith -Wcast-qual -Wcast-align -Wwrite-strings -Wundef -Werror-implicit-function-declaration -Winit-self -fno-strict-aliasing -std=gnu99   -DHAVE_IMMEDIATE_STRUCTURES=1 -D_GNU_SOURCE=1 -DHAVE_IMMEDIATE_STRUCTURES=1 -D_GNU_SOURCE=1 -DHAVE_IMMEDIATE_STRUCTURES=1 -I/usr/include/samba-4.0  -O2 -fwrapv -pipe -Wformat -Werror=format-security -gdwarf-4 -fno-debug-types-section -fvar-tracking-assignments -g2 -Wp,-D_FORTIFY_SOURCE=2 -fstack-protector-strong --param=ssp-buffer-size=4 -Werror=trampolines -fPIC -mtune=generic -march=x86-64 -gdwarf-4 -fno-debug-types-section -fvar-tracking-assignments -g2  -D_FILE_OFFSET_BITS=64 -D_LARGEFILE_SOURCE -D_LARGEFILE64_SOURCE -MT src/providers/ipa/libsss_ipa_la-ipa_hostid.lo -MD -MP -MF src/providers/ipa/.deps/libsss_ipa_la-ipa_hostid.Tpo -c -o src/providers/ipa/libsss_ipa_la-ipa_hostid.lo `test -f 'src/providers/ipa/ipa_hostid.c' || echo './'`src/providers/ipa/ipa_hostid.c
libtool: compile:  x86_64-pld-linux-gnux32-gcc -DHAVE_CONFIG_H -I. -Wall -Iinclude -I.. -I./include -I./src/sss_client -I./src -Iinclude -I. -I/usr/include/dbus-1.0 -I/usr/libx32/dbus-1.0/include -I/usr/include/libnl3 -I/usr/include/glib-2.0 -I/usr/libx32/glib-2.0/include -DLIBDIR=\"/usr/libx32\" -DVARDIR=\"/var\" -DSSS_STATEDIR=\"/var/lib/sss\" -DSYSCONFDIR=\"/etc\" -DSHLIBEXT=\"\" -DSSSD_LIBEXEC_PATH=\"/usr/libexec/sssd\" -DSSSD_CONF_DIR=\"/etc/sssd\" -DSSS_NSS_MCACHE_DIR=\"/var/lib/sss/mc\" -DSSS_NSS_SOCKET_NAME=\"/var/lib/sss/pipes/nss\" -DSSS_PAM_SOCKET_NAME=\"/var/lib/sss/pipes/pam\" -DSSS_PAC_SOCKET_NAME=\"/var/lib/sss/pipes/pac\" -DSSS_PAM_PRIV_SOCKET_NAME=\"/var/lib/sss/pipes/private/pam\" -DSSS_SUDO_SOCKET_NAME=\"/var/lib/sss/pipes/sudo\" -DSSS_AUTOFS_SOCKET_NAME=\"/var/lib/sss/pipes/autofs\" -DSSS_SSH_SOCKET_NAME=\"/var/lib/sss/pipes/ssh\" -DLOCALEDIR=\"/usr/share/locale\" -DBASE_FILE_STEM=\"libsss_ipa_la-ipa_hostid\" -Wall -Wshadow -Wstrict-prototypes -Wpointer-arith -Wcast-qual -Wcast-align -Wwrite-strings -Wundef -Werror-implicit-function-declaration -Winit-self -fno-strict-aliasing -std=gnu99 -DHAVE_IMMEDIATE_STRUCTURES=1 -D_GNU_SOURCE=1 -DHAVE_IMMEDIATE_STRUCTURES=1 -D_GNU_SOURCE=1 -DHAVE_IMMEDIATE_STRUCTURES=1 -I/usr/include/samba-4.0 -O2 -fwrapv -pipe -Wformat -Werror=format-security -gdwarf-4 -fno-debug-types-section -fvar-tracking-assignments -g2 -Wp,-D_FORTIFY_SOURCE=2 -fstack-protector-strong --param=ssp-buffer-size=4 -Werror=trampolines -fPIC -mtune=generic -march=x86-64 -gdwarf-4 -fno-debug-types-section -fvar-tracking-assignments -g2 -D_FILE_OFFSET_BITS=64 -D_LARGEFILE_SOURCE -D_LARGEFILE64_SOURCE -MT src/providers/ipa/libsss_ipa_la-ipa_hostid.lo -MD -MP -MF src/providers/ipa/.deps/libsss_ipa_la-ipa_hostid.Tpo -c src/providers/ipa/ipa_hostid.c  -fPIC -DPIC -o src/providers/ipa/.libs/libsss_ipa_la-ipa_hostid.o
In file included from ./src/providers/krb5/krb5_common.h:34,
                 from ./src/providers/ldap/ldap_common.h:29,
                 from src/providers/ipa/ipa_hostid.c:24:
./src/util/sss_krb5.h:113:5: warning: "HAVE_KRB5_GET_INIT_CREDS_OPT_SET_FAST_FLAGS" is not defined, evaluates to 0 [-Wundef]
  113 | #if HAVE_KRB5_GET_INIT_CREDS_OPT_SET_FAST_FLAGS
      |     ^~~~~~~~~~~~~~~~~~~~~~~~~~~~~~~~~~~~~~~~~~~
mv -f src/providers/ipa/.deps/libsss_ipa_la-ipa_hostid.Tpo src/providers/ipa/.deps/libsss_ipa_la-ipa_hostid.Plo
make[2]: Leaving directory '/tmp/B.j8crwcva/BUILD/sssd-1.13.4'
make[2]: Entering directory '/tmp/B.j8crwcva/BUILD/sssd-1.13.4'
/bin/sh ./libtool  --tag=CC   --mode=compile x86_64-pld-linux-gnux32-gcc -DHAVE_CONFIG_H -I.  -Wall -Iinclude -I.. -I./include -I./src/sss_client -I./src -Iinclude -I.      -I/usr/include/dbus-1.0 -I/usr/libx32/dbus-1.0/include     -I/usr/include/libnl3  -I/usr/include/glib-2.0 -I/usr/libx32/glib-2.0/include  -DLIBDIR=\"/usr/libx32\" -DVARDIR=\"/var\" -DSSS_STATEDIR=\"/var/lib/sss\" -DSYSCONFDIR=\"/etc\" -DSHLIBEXT=\"\" -DSSSD_LIBEXEC_PATH=\"/usr/libexec/sssd\" -DSSSD_CONF_DIR=\"/etc/sssd\" -DSSS_NSS_MCACHE_DIR=\"/var/lib/sss/mc\" -DSSS_NSS_SOCKET_NAME=\"/var/lib/sss/pipes/nss\" -DSSS_PAM_SOCKET_NAME=\"/var/lib/sss/pipes/pam\" -DSSS_PAC_SOCKET_NAME=\"/var/lib/sss/pipes/pac\" -DSSS_PAM_PRIV_SOCKET_NAME=\"/var/lib/sss/pipes/private/pam\" -DSSS_SUDO_SOCKET_NAME=\"/var/lib/sss/pipes/sudo\" -DSSS_AUTOFS_SOCKET_NAME=\"/var/lib/sss/pipes/autofs\" -DSSS_SSH_SOCKET_NAME=\"/var/lib/sss/pipes/ssh\" -DLOCALEDIR=\"/usr/share/locale\" -DBASE_FILE_STEM=\"libsss_ipa_la-ipa_sudo_async\"    -Wall -Wshadow -Wstrict-prototypes -Wpointer-arith -Wcast-qual -Wcast-align -Wwrite-strings -Wundef -Werror-implicit-function-declaration -Winit-self -fno-strict-aliasing -std=gnu99   -DHAVE_IMMEDIATE_STRUCTURES=1 -D_GNU_SOURCE=1 -DHAVE_IMMEDIATE_STRUCTURES=1 -D_GNU_SOURCE=1 -DHAVE_IMMEDIATE_STRUCTURES=1 -I/usr/include/samba-4.0  -O2 -fwrapv -pipe -Wformat -Werror=format-security -gdwarf-4 -fno-debug-types-section -fvar-tracking-assignments -g2 -Wp,-D_FORTIFY_SOURCE=2 -fstack-protector-strong --param=ssp-buffer-size=4 -Werror=trampolines -fPIC -mtune=generic -march=x86-64 -gdwarf-4 -fno-debug-types-section -fvar-tracking-assignments -g2  -D_FILE_OFFSET_BITS=64 -D_LARGEFILE_SOURCE -D_LARGEFILE64_SOURCE -MT src/providers/ipa/libsss_ipa_la-ipa_sudo_async.lo -MD -MP -MF src/providers/ipa/.deps/libsss_ipa_la-ipa_sudo_async.Tpo -c -o src/providers/ipa/libsss_ipa_la-ipa_sudo_async.lo `test -f 'src/providers/ipa/ipa_sudo_async.c' || echo './'`src/providers/ipa/ipa_sudo_async.c
libtool: compile:  x86_64-pld-linux-gnux32-gcc -DHAVE_CONFIG_H -I. -Wall -Iinclude -I.. -I./include -I./src/sss_client -I./src -Iinclude -I. -I/usr/include/dbus-1.0 -I/usr/libx32/dbus-1.0/include -I/usr/include/libnl3 -I/usr/include/glib-2.0 -I/usr/libx32/glib-2.0/include -DLIBDIR=\"/usr/libx32\" -DVARDIR=\"/var\" -DSSS_STATEDIR=\"/var/lib/sss\" -DSYSCONFDIR=\"/etc\" -DSHLIBEXT=\"\" -DSSSD_LIBEXEC_PATH=\"/usr/libexec/sssd\" -DSSSD_CONF_DIR=\"/etc/sssd\" -DSSS_NSS_MCACHE_DIR=\"/var/lib/sss/mc\" -DSSS_NSS_SOCKET_NAME=\"/var/lib/sss/pipes/nss\" -DSSS_PAM_SOCKET_NAME=\"/var/lib/sss/pipes/pam\" -DSSS_PAC_SOCKET_NAME=\"/var/lib/sss/pipes/pac\" -DSSS_PAM_PRIV_SOCKET_NAME=\"/var/lib/sss/pipes/private/pam\" -DSSS_SUDO_SOCKET_NAME=\"/var/lib/sss/pipes/sudo\" -DSSS_AUTOFS_SOCKET_NAME=\"/var/lib/sss/pipes/autofs\" -DSSS_SSH_SOCKET_NAME=\"/var/lib/sss/pipes/ssh\" -DLOCALEDIR=\"/usr/share/locale\" -DBASE_FILE_STEM=\"libsss_ipa_la-ipa_sudo_async\" -Wall -Wshadow -Wstrict-prototypes -Wpointer-arith -Wcast-qual -Wcast-align -Wwrite-strings -Wundef -Werror-implicit-function-declaration -Winit-self -fno-strict-aliasing -std=gnu99 -DHAVE_IMMEDIATE_STRUCTURES=1 -D_GNU_SOURCE=1 -DHAVE_IMMEDIATE_STRUCTURES=1 -D_GNU_SOURCE=1 -DHAVE_IMMEDIATE_STRUCTURES=1 -I/usr/include/samba-4.0 -O2 -fwrapv -pipe -Wformat -Werror=format-security -gdwarf-4 -fno-debug-types-section -fvar-tracking-assignments -g2 -Wp,-D_FORTIFY_SOURCE=2 -fstack-protector-strong --param=ssp-buffer-size=4 -Werror=trampolines -fPIC -mtune=generic -march=x86-64 -gdwarf-4 -fno-debug-types-section -fvar-tracking-assignments -g2 -D_FILE_OFFSET_BITS=64 -D_LARGEFILE_SOURCE -D_LARGEFILE64_SOURCE -MT src/providers/ipa/libsss_ipa_la-ipa_sudo_async.lo -MD -MP -MF src/providers/ipa/.deps/libsss_ipa_la-ipa_sudo_async.Tpo -c src/providers/ipa/ipa_sudo_async.c  -fPIC -DPIC -o src/providers/ipa/.libs/libsss_ipa_la-ipa_sudo_async.o
In file included from ./src/providers/krb5/krb5_common.h:34,
                 from ./src/providers/ldap/ldap_common.h:29,
                 from ./src/providers/ldap/sdap_ops.h:26,
                 from src/providers/ipa/ipa_sudo_async.c:25:
./src/util/sss_krb5.h:113:5: warning: "HAVE_KRB5_GET_INIT_CREDS_OPT_SET_FAST_FLAGS" is not defined, evaluates to 0 [-Wundef]
  113 | #if HAVE_KRB5_GET_INIT_CREDS_OPT_SET_FAST_FLAGS
      |     ^~~~~~~~~~~~~~~~~~~~~~~~~~~~~~~~~~~~~~~~~~~
mv -f src/providers/ipa/.deps/libsss_ipa_la-ipa_sudo_async.Tpo src/providers/ipa/.deps/libsss_ipa_la-ipa_sudo_async.Plo
make[2]: Leaving directory '/tmp/B.j8crwcva/BUILD/sssd-1.13.4'
make[2]: Entering directory '/tmp/B.j8crwcva/BUILD/sssd-1.13.4'
/bin/sh ./libtool  --tag=CC   --mode=compile x86_64-pld-linux-gnux32-gcc -DHAVE_CONFIG_H -I.  -Wall -Iinclude -I.. -I./include -I./src/sss_client -I./src -Iinclude -I.      -I/usr/include/dbus-1.0 -I/usr/libx32/dbus-1.0/include     -I/usr/include/libnl3  -I/usr/include/glib-2.0 -I/usr/libx32/glib-2.0/include  -DLIBDIR=\"/usr/libx32\" -DVARDIR=\"/var\" -DSSS_STATEDIR=\"/var/lib/sss\" -DSYSCONFDIR=\"/etc\" -DSHLIBEXT=\"\" -DSSSD_LIBEXEC_PATH=\"/usr/libexec/sssd\" -DSSSD_CONF_DIR=\"/etc/sssd\" -DSSS_NSS_MCACHE_DIR=\"/var/lib/sss/mc\" -DSSS_NSS_SOCKET_NAME=\"/var/lib/sss/pipes/nss\" -DSSS_PAM_SOCKET_NAME=\"/var/lib/sss/pipes/pam\" -DSSS_PAC_SOCKET_NAME=\"/var/lib/sss/pipes/pac\" -DSSS_PAM_PRIV_SOCKET_NAME=\"/var/lib/sss/pipes/private/pam\" -DSSS_SUDO_SOCKET_NAME=\"/var/lib/sss/pipes/sudo\" -DSSS_AUTOFS_SOCKET_NAME=\"/var/lib/sss/pipes/autofs\" -DSSS_SSH_SOCKET_NAME=\"/var/lib/sss/pipes/ssh\" -DLOCALEDIR=\"/usr/share/locale\" -DBASE_FILE_STEM=\"libsss_ad_la-ad_dyndns\"    -Wall -Wshadow -Wstrict-prototypes -Wpointer-arith -Wcast-qual -Wcast-align -Wwrite-strings -Wundef -Werror-implicit-function-declaration -Winit-self -fno-strict-aliasing -std=gnu99     -DHAVE_IMMEDIATE_STRUCTURES=1 -D_GNU_SOURCE=1 -DHAVE_IMMEDIATE_STRUCTURES=1 -D_GNU_SOURCE=1 -DHAVE_IMMEDIATE_STRUCTURES=1 -I/usr/include/samba-4.0 -I/usr/include/samba-4.0 -O2 -fwrapv -pipe -Wformat -Werror=format-security -gdwarf-4 -fno-debug-types-section -fvar-tracking-assignments -g2 -Wp,-D_FORTIFY_SOURCE=2 -fstack-protector-strong --param=ssp-buffer-size=4 -Werror=trampolines -fPIC -mtune=generic -march=x86-64 -gdwarf-4 -fno-debug-types-section -fvar-tracking-assignments -g2  -D_FILE_OFFSET_BITS=64 -D_LARGEFILE_SOURCE -D_LARGEFILE64_SOURCE -MT src/providers/ad/libsss_ad_la-ad_dyndns.lo -MD -MP -MF src/providers/ad/.deps/libsss_ad_la-ad_dyndns.Tpo -c -o src/providers/ad/libsss_ad_la-ad_dyndns.lo `test -f 'src/providers/ad/ad_dyndns.c' || echo './'`src/providers/ad/ad_dyndns.c
libtool: compile:  x86_64-pld-linux-gnux32-gcc -DHAVE_CONFIG_H -I. -Wall -Iinclude -I.. -I./include -I./src/sss_client -I./src -Iinclude -I. -I/usr/include/dbus-1.0 -I/usr/libx32/dbus-1.0/include -I/usr/include/libnl3 -I/usr/include/glib-2.0 -I/usr/libx32/glib-2.0/include -DLIBDIR=\"/usr/libx32\" -DVARDIR=\"/var\" -DSSS_STATEDIR=\"/var/lib/sss\" -DSYSCONFDIR=\"/etc\" -DSHLIBEXT=\"\" -DSSSD_LIBEXEC_PATH=\"/usr/libexec/sssd\" -DSSSD_CONF_DIR=\"/etc/sssd\" -DSSS_NSS_MCACHE_DIR=\"/var/lib/sss/mc\" -DSSS_NSS_SOCKET_NAME=\"/var/lib/sss/pipes/nss\" -DSSS_PAM_SOCKET_NAME=\"/var/lib/sss/pipes/pam\" -DSSS_PAC_SOCKET_NAME=\"/var/lib/sss/pipes/pac\" -DSSS_PAM_PRIV_SOCKET_NAME=\"/var/lib/sss/pipes/private/pam\" -DSSS_SUDO_SOCKET_NAME=\"/var/lib/sss/pipes/sudo\" -DSSS_AUTOFS_SOCKET_NAME=\"/var/lib/sss/pipes/autofs\" -DSSS_SSH_SOCKET_NAME=\"/var/lib/sss/pipes/ssh\" -DLOCALEDIR=\"/usr/share/locale\" -DBASE_FILE_STEM=\"libsss_ad_la-ad_dyndns\" -Wall -Wshadow -Wstrict-prototypes -Wpointer-arith -Wcast-qual -Wcast-align -Wwrite-strings -Wundef -Werror-implicit-function-declaration -Winit-self -fno-strict-aliasing -std=gnu99 -DHAVE_IMMEDIATE_STRUCTURES=1 -D_GNU_SOURCE=1 -DHAVE_IMMEDIATE_STRUCTURES=1 -D_GNU_SOURCE=1 -DHAVE_IMMEDIATE_STRUCTURES=1 -I/usr/include/samba-4.0 -I/usr/include/samba-4.0 -O2 -fwrapv -pipe -Wformat -Werror=format-security -gdwarf-4 -fno-debug-types-section -fvar-tracking-assignments -g2 -Wp,-D_FORTIFY_SOURCE=2 -fstack-protector-strong --param=ssp-buffer-size=4 -Werror=trampolines -fPIC -mtune=generic -march=x86-64 -gdwarf-4 -fno-debug-types-section -fvar-tracking-assignments -g2 -D_FILE_OFFSET_BITS=64 -D_LARGEFILE_SOURCE -D_LARGEFILE64_SOURCE -MT src/providers/ad/libsss_ad_la-ad_dyndns.lo -MD -MP -MF src/providers/ad/.deps/libsss_ad_la-ad_dyndns.Tpo -c src/providers/ad/ad_dyndns.c  -fPIC -DPIC -o src/providers/ad/.libs/libsss_ad_la-ad_dyndns.o
In file included from ./src/providers/krb5/krb5_common.h:34,
                 from ./src/providers/ldap/ldap_common.h:29,
                 from ./src/providers/ldap/sdap_dyndns.h:31,
                 from src/providers/ad/ad_dyndns.c:27:
./src/util/sss_krb5.h:113:5: warning: "HAVE_KRB5_GET_INIT_CREDS_OPT_SET_FAST_FLAGS" is not defined, evaluates to 0 [-Wundef]
  113 | #if HAVE_KRB5_GET_INIT_CREDS_OPT_SET_FAST_FLAGS
      |     ^~~~~~~~~~~~~~~~~~~~~~~~~~~~~~~~~~~~~~~~~~~
mv -f src/providers/ad/.deps/libsss_ad_la-ad_dyndns.Tpo src/providers/ad/.deps/libsss_ad_la-ad_dyndns.Plo
make[2]: Leaving directory '/tmp/B.j8crwcva/BUILD/sssd-1.13.4'
make[2]: Entering directory '/tmp/B.j8crwcva/BUILD/sssd-1.13.4'
/bin/sh ./libtool  --tag=CC   --mode=compile x86_64-pld-linux-gnux32-gcc -DHAVE_CONFIG_H -I.  -Wall -Iinclude -I.. -I./include -I./src/sss_client -I./src -Iinclude -I.      -I/usr/include/dbus-1.0 -I/usr/libx32/dbus-1.0/include     -I/usr/include/libnl3  -I/usr/include/glib-2.0 -I/usr/libx32/glib-2.0/include  -DLIBDIR=\"/usr/libx32\" -DVARDIR=\"/var\" -DSSS_STATEDIR=\"/var/lib/sss\" -DSYSCONFDIR=\"/etc\" -DSHLIBEXT=\"\" -DSSSD_LIBEXEC_PATH=\"/usr/libexec/sssd\" -DSSSD_CONF_DIR=\"/etc/sssd\" -DSSS_NSS_MCACHE_DIR=\"/var/lib/sss/mc\" -DSSS_NSS_SOCKET_NAME=\"/var/lib/sss/pipes/nss\" -DSSS_PAM_SOCKET_NAME=\"/var/lib/sss/pipes/pam\" -DSSS_PAC_SOCKET_NAME=\"/var/lib/sss/pipes/pac\" -DSSS_PAM_PRIV_SOCKET_NAME=\"/var/lib/sss/pipes/private/pam\" -DSSS_SUDO_SOCKET_NAME=\"/var/lib/sss/pipes/sudo\" -DSSS_AUTOFS_SOCKET_NAME=\"/var/lib/sss/pipes/autofs\" -DSSS_SSH_SOCKET_NAME=\"/var/lib/sss/pipes/ssh\" -DLOCALEDIR=\"/usr/share/locale\" -DBASE_FILE_STEM=\"libsss_ad_la-ad_init\"    -Wall -Wshadow -Wstrict-prototypes -Wpointer-arith -Wcast-qual -Wcast-align -Wwrite-strings -Wundef -Werror-implicit-function-declaration -Winit-self -fno-strict-aliasing -std=gnu99     -DHAVE_IMMEDIATE_STRUCTURES=1 -D_GNU_SOURCE=1 -DHAVE_IMMEDIATE_STRUCTURES=1 -D_GNU_SOURCE=1 -DHAVE_IMMEDIATE_STRUCTURES=1 -I/usr/include/samba-4.0 -I/usr/include/samba-4.0 -O2 -fwrapv -pipe -Wformat -Werror=format-security -gdwarf-4 -fno-debug-types-section -fvar-tracking-assignments -g2 -Wp,-D_FORTIFY_SOURCE=2 -fstack-protector-strong --param=ssp-buffer-size=4 -Werror=trampolines -fPIC -mtune=generic -march=x86-64 -gdwarf-4 -fno-debug-types-section -fvar-tracking-assignments -g2  -D_FILE_OFFSET_BITS=64 -D_LARGEFILE_SOURCE -D_LARGEFILE64_SOURCE -MT src/providers/ad/libsss_ad_la-ad_init.lo -MD -MP -MF src/providers/ad/.deps/libsss_ad_la-ad_init.Tpo -c -o src/providers/ad/libsss_ad_la-ad_init.lo `test -f 'src/providers/ad/ad_init.c' || echo './'`src/providers/ad/ad_init.c
libtool: compile:  x86_64-pld-linux-gnux32-gcc -DHAVE_CONFIG_H -I. -Wall -Iinclude -I.. -I./include -I./src/sss_client -I./src -Iinclude -I. -I/usr/include/dbus-1.0 -I/usr/libx32/dbus-1.0/include -I/usr/include/libnl3 -I/usr/include/glib-2.0 -I/usr/libx32/glib-2.0/include -DLIBDIR=\"/usr/libx32\" -DVARDIR=\"/var\" -DSSS_STATEDIR=\"/var/lib/sss\" -DSYSCONFDIR=\"/etc\" -DSHLIBEXT=\"\" -DSSSD_LIBEXEC_PATH=\"/usr/libexec/sssd\" -DSSSD_CONF_DIR=\"/etc/sssd\" -DSSS_NSS_MCACHE_DIR=\"/var/lib/sss/mc\" -DSSS_NSS_SOCKET_NAME=\"/var/lib/sss/pipes/nss\" -DSSS_PAM_SOCKET_NAME=\"/var/lib/sss/pipes/pam\" -DSSS_PAC_SOCKET_NAME=\"/var/lib/sss/pipes/pac\" -DSSS_PAM_PRIV_SOCKET_NAME=\"/var/lib/sss/pipes/private/pam\" -DSSS_SUDO_SOCKET_NAME=\"/var/lib/sss/pipes/sudo\" -DSSS_AUTOFS_SOCKET_NAME=\"/var/lib/sss/pipes/autofs\" -DSSS_SSH_SOCKET_NAME=\"/var/lib/sss/pipes/ssh\" -DLOCALEDIR=\"/usr/share/locale\" -DBASE_FILE_STEM=\"libsss_ad_la-ad_init\" -Wall -Wshadow -Wstrict-prototypes -Wpointer-arith -Wcast-qual -Wcast-align -Wwrite-strings -Wundef -Werror-implicit-function-declaration -Winit-self -fno-strict-aliasing -std=gnu99 -DHAVE_IMMEDIATE_STRUCTURES=1 -D_GNU_SOURCE=1 -DHAVE_IMMEDIATE_STRUCTURES=1 -D_GNU_SOURCE=1 -DHAVE_IMMEDIATE_STRUCTURES=1 -I/usr/include/samba-4.0 -I/usr/include/samba-4.0 -O2 -fwrapv -pipe -Wformat -Werror=format-security -gdwarf-4 -fno-debug-types-section -fvar-tracking-assignments -g2 -Wp,-D_FORTIFY_SOURCE=2 -fstack-protector-strong --param=ssp-buffer-size=4 -Werror=trampolines -fPIC -mtune=generic -march=x86-64 -gdwarf-4 -fno-debug-types-section -fvar-tracking-assignments -g2 -D_FILE_OFFSET_BITS=64 -D_LARGEFILE_SOURCE -D_LARGEFILE64_SOURCE -MT src/providers/ad/libsss_ad_la-ad_init.lo -MD -MP -MF src/providers/ad/.deps/libsss_ad_la-ad_init.Tpo -c src/providers/ad/ad_init.c  -fPIC -DPIC -o src/providers/ad/.libs/libsss_ad_la-ad_init.o
In file included from ./src/providers/krb5/krb5_common.h:34,
                 from ./src/providers/ldap/ldap_common.h:29,
                 from ./src/providers/ad/ad_common.h:27,
                 from src/providers/ad/ad_init.c:32:
./src/util/sss_krb5.h:113:5: warning: "HAVE_KRB5_GET_INIT_CREDS_OPT_SET_FAST_FLAGS" is not defined, evaluates to 0 [-Wundef]
  113 | #if HAVE_KRB5_GET_INIT_CREDS_OPT_SET_FAST_FLAGS
      |     ^~~~~~~~~~~~~~~~~~~~~~~~~~~~~~~~~~~~~~~~~~~
mv -f src/providers/ad/.deps/libsss_ad_la-ad_init.Tpo src/providers/ad/.deps/libsss_ad_la-ad_init.Plo
make[2]: Leaving directory '/tmp/B.j8crwcva/BUILD/sssd-1.13.4'
make[2]: Entering directory '/tmp/B.j8crwcva/BUILD/sssd-1.13.4'
/bin/sh ./libtool  --tag=CC   --mode=compile x86_64-pld-linux-gnux32-gcc -DHAVE_CONFIG_H -I.  -Wall -Iinclude -I.. -I./include -I./src/sss_client -I./src -Iinclude -I.      -I/usr/include/dbus-1.0 -I/usr/libx32/dbus-1.0/include     -I/usr/include/libnl3  -I/usr/include/glib-2.0 -I/usr/libx32/glib-2.0/include  -DLIBDIR=\"/usr/libx32\" -DVARDIR=\"/var\" -DSSS_STATEDIR=\"/var/lib/sss\" -DSYSCONFDIR=\"/etc\" -DSHLIBEXT=\"\" -DSSSD_LIBEXEC_PATH=\"/usr/libexec/sssd\" -DSSSD_CONF_DIR=\"/etc/sssd\" -DSSS_NSS_MCACHE_DIR=\"/var/lib/sss/mc\" -DSSS_NSS_SOCKET_NAME=\"/var/lib/sss/pipes/nss\" -DSSS_PAM_SOCKET_NAME=\"/var/lib/sss/pipes/pam\" -DSSS_PAC_SOCKET_NAME=\"/var/lib/sss/pipes/pac\" -DSSS_PAM_PRIV_SOCKET_NAME=\"/var/lib/sss/pipes/private/pam\" -DSSS_SUDO_SOCKET_NAME=\"/var/lib/sss/pipes/sudo\" -DSSS_AUTOFS_SOCKET_NAME=\"/var/lib/sss/pipes/autofs\" -DSSS_SSH_SOCKET_NAME=\"/var/lib/sss/pipes/ssh\" -DLOCALEDIR=\"/usr/share/locale\" -DBASE_FILE_STEM=\"libsss_ad_la-ad_common\"    -Wall -Wshadow -Wstrict-prototypes -Wpointer-arith -Wcast-qual -Wcast-align -Wwrite-strings -Wundef -Werror-implicit-function-declaration -Winit-self -fno-strict-aliasing -std=gnu99     -DHAVE_IMMEDIATE_STRUCTURES=1 -D_GNU_SOURCE=1 -DHAVE_IMMEDIATE_STRUCTURES=1 -D_GNU_SOURCE=1 -DHAVE_IMMEDIATE_STRUCTURES=1 -I/usr/include/samba-4.0 -I/usr/include/samba-4.0 -O2 -fwrapv -pipe -Wformat -Werror=format-security -gdwarf-4 -fno-debug-types-section -fvar-tracking-assignments -g2 -Wp,-D_FORTIFY_SOURCE=2 -fstack-protector-strong --param=ssp-buffer-size=4 -Werror=trampolines -fPIC -mtune=generic -march=x86-64 -gdwarf-4 -fno-debug-types-section -fvar-tracking-assignments -g2  -D_FILE_OFFSET_BITS=64 -D_LARGEFILE_SOURCE -D_LARGEFILE64_SOURCE -MT src/providers/ad/libsss_ad_la-ad_common.lo -MD -MP -MF src/providers/ad/.deps/libsss_ad_la-ad_common.Tpo -c -o src/providers/ad/libsss_ad_la-ad_common.lo `test -f 'src/providers/ad/ad_common.c' || echo './'`src/providers/ad/ad_common.c
libtool: compile:  x86_64-pld-linux-gnux32-gcc -DHAVE_CONFIG_H -I. -Wall -Iinclude -I.. -I./include -I./src/sss_client -I./src -Iinclude -I. -I/usr/include/dbus-1.0 -I/usr/libx32/dbus-1.0/include -I/usr/include/libnl3 -I/usr/include/glib-2.0 -I/usr/libx32/glib-2.0/include -DLIBDIR=\"/usr/libx32\" -DVARDIR=\"/var\" -DSSS_STATEDIR=\"/var/lib/sss\" -DSYSCONFDIR=\"/etc\" -DSHLIBEXT=\"\" -DSSSD_LIBEXEC_PATH=\"/usr/libexec/sssd\" -DSSSD_CONF_DIR=\"/etc/sssd\" -DSSS_NSS_MCACHE_DIR=\"/var/lib/sss/mc\" -DSSS_NSS_SOCKET_NAME=\"/var/lib/sss/pipes/nss\" -DSSS_PAM_SOCKET_NAME=\"/var/lib/sss/pipes/pam\" -DSSS_PAC_SOCKET_NAME=\"/var/lib/sss/pipes/pac\" -DSSS_PAM_PRIV_SOCKET_NAME=\"/var/lib/sss/pipes/private/pam\" -DSSS_SUDO_SOCKET_NAME=\"/var/lib/sss/pipes/sudo\" -DSSS_AUTOFS_SOCKET_NAME=\"/var/lib/sss/pipes/autofs\" -DSSS_SSH_SOCKET_NAME=\"/var/lib/sss/pipes/ssh\" -DLOCALEDIR=\"/usr/share/locale\" -DBASE_FILE_STEM=\"libsss_ad_la-ad_common\" -Wall -Wshadow -Wstrict-prototypes -Wpointer-arith -Wcast-qual -Wcast-align -Wwrite-strings -Wundef -Werror-implicit-function-declaration -Winit-self -fno-strict-aliasing -std=gnu99 -DHAVE_IMMEDIATE_STRUCTURES=1 -D_GNU_SOURCE=1 -DHAVE_IMMEDIATE_STRUCTURES=1 -D_GNU_SOURCE=1 -DHAVE_IMMEDIATE_STRUCTURES=1 -I/usr/include/samba-4.0 -I/usr/include/samba-4.0 -O2 -fwrapv -pipe -Wformat -Werror=format-security -gdwarf-4 -fno-debug-types-section -fvar-tracking-assignments -g2 -Wp,-D_FORTIFY_SOURCE=2 -fstack-protector-strong --param=ssp-buffer-size=4 -Werror=trampolines -fPIC -mtune=generic -march=x86-64 -gdwarf-4 -fno-debug-types-section -fvar-tracking-assignments -g2 -D_FILE_OFFSET_BITS=64 -D_LARGEFILE_SOURCE -D_LARGEFILE64_SOURCE -MT src/providers/ad/libsss_ad_la-ad_common.lo -MD -MP -MF src/providers/ad/.deps/libsss_ad_la-ad_common.Tpo -c src/providers/ad/ad_common.c  -fPIC -DPIC -o src/providers/ad/.libs/libsss_ad_la-ad_common.o
In file included from ./src/providers/krb5/krb5_common.h:34,
                 from ./src/providers/ldap/ldap_common.h:29,
                 from ./src/providers/ad/ad_common.h:27,
                 from src/providers/ad/ad_common.c:24:
./src/util/sss_krb5.h:113:5: warning: "HAVE_KRB5_GET_INIT_CREDS_OPT_SET_FAST_FLAGS" is not defined, evaluates to 0 [-Wundef]
  113 | #if HAVE_KRB5_GET_INIT_CREDS_OPT_SET_FAST_FLAGS
      |     ^~~~~~~~~~~~~~~~~~~~~~~~~~~~~~~~~~~~~~~~~~~
mv -f src/providers/ad/.deps/libsss_ad_la-ad_common.Tpo src/providers/ad/.deps/libsss_ad_la-ad_common.Plo
make[2]: Leaving directory '/tmp/B.j8crwcva/BUILD/sssd-1.13.4'
make[2]: Entering directory '/tmp/B.j8crwcva/BUILD/sssd-1.13.4'
/bin/sh ./libtool  --tag=CC   --mode=compile x86_64-pld-linux-gnux32-gcc -DHAVE_CONFIG_H -I.  -Wall -Iinclude -I.. -I./include -I./src/sss_client -I./src -Iinclude -I.      -I/usr/include/dbus-1.0 -I/usr/libx32/dbus-1.0/include     -I/usr/include/libnl3  -I/usr/include/glib-2.0 -I/usr/libx32/glib-2.0/include  -DLIBDIR=\"/usr/libx32\" -DVARDIR=\"/var\" -DSSS_STATEDIR=\"/var/lib/sss\" -DSYSCONFDIR=\"/etc\" -DSHLIBEXT=\"\" -DSSSD_LIBEXEC_PATH=\"/usr/libexec/sssd\" -DSSSD_CONF_DIR=\"/etc/sssd\" -DSSS_NSS_MCACHE_DIR=\"/var/lib/sss/mc\" -DSSS_NSS_SOCKET_NAME=\"/var/lib/sss/pipes/nss\" -DSSS_PAM_SOCKET_NAME=\"/var/lib/sss/pipes/pam\" -DSSS_PAC_SOCKET_NAME=\"/var/lib/sss/pipes/pac\" -DSSS_PAM_PRIV_SOCKET_NAME=\"/var/lib/sss/pipes/private/pam\" -DSSS_SUDO_SOCKET_NAME=\"/var/lib/sss/pipes/sudo\" -DSSS_AUTOFS_SOCKET_NAME=\"/var/lib/sss/pipes/autofs\" -DSSS_SSH_SOCKET_NAME=\"/var/lib/sss/pipes/ssh\" -DLOCALEDIR=\"/usr/share/locale\" -DBASE_FILE_STEM=\"libsss_ad_la-ad_machine_pw_renewal\"    -Wall -Wshadow -Wstrict-prototypes -Wpointer-arith -Wcast-qual -Wcast-align -Wwrite-strings -Wundef -Werror-implicit-function-declaration -Winit-self -fno-strict-aliasing -std=gnu99     -DHAVE_IMMEDIATE_STRUCTURES=1 -D_GNU_SOURCE=1 -DHAVE_IMMEDIATE_STRUCTURES=1 -D_GNU_SOURCE=1 -DHAVE_IMMEDIATE_STRUCTURES=1 -I/usr/include/samba-4.0 -I/usr/include/samba-4.0 -O2 -fwrapv -pipe -Wformat -Werror=format-security -gdwarf-4 -fno-debug-types-section -fvar-tracking-assignments -g2 -Wp,-D_FORTIFY_SOURCE=2 -fstack-protector-strong --param=ssp-buffer-size=4 -Werror=trampolines -fPIC -mtune=generic -march=x86-64 -gdwarf-4 -fno-debug-types-section -fvar-tracking-assignments -g2  -D_FILE_OFFSET_BITS=64 -D_LARGEFILE_SOURCE -D_LARGEFILE64_SOURCE -MT src/providers/ad/libsss_ad_la-ad_machine_pw_renewal.lo -MD -MP -MF src/providers/ad/.deps/libsss_ad_la-ad_machine_pw_renewal.Tpo -c -o src/providers/ad/libsss_ad_la-ad_machine_pw_renewal.lo `test -f 'src/providers/ad/ad_machine_pw_renewal.c' || echo './'`src/providers/ad/ad_machine_pw_renewal.c
libtool: compile:  x86_64-pld-linux-gnux32-gcc -DHAVE_CONFIG_H -I. -Wall -Iinclude -I.. -I./include -I./src/sss_client -I./src -Iinclude -I. -I/usr/include/dbus-1.0 -I/usr/libx32/dbus-1.0/include -I/usr/include/libnl3 -I/usr/include/glib-2.0 -I/usr/libx32/glib-2.0/include -DLIBDIR=\"/usr/libx32\" -DVARDIR=\"/var\" -DSSS_STATEDIR=\"/var/lib/sss\" -DSYSCONFDIR=\"/etc\" -DSHLIBEXT=\"\" -DSSSD_LIBEXEC_PATH=\"/usr/libexec/sssd\" -DSSSD_CONF_DIR=\"/etc/sssd\" -DSSS_NSS_MCACHE_DIR=\"/var/lib/sss/mc\" -DSSS_NSS_SOCKET_NAME=\"/var/lib/sss/pipes/nss\" -DSSS_PAM_SOCKET_NAME=\"/var/lib/sss/pipes/pam\" -DSSS_PAC_SOCKET_NAME=\"/var/lib/sss/pipes/pac\" -DSSS_PAM_PRIV_SOCKET_NAME=\"/var/lib/sss/pipes/private/pam\" -DSSS_SUDO_SOCKET_NAME=\"/var/lib/sss/pipes/sudo\" -DSSS_AUTOFS_SOCKET_NAME=\"/var/lib/sss/pipes/autofs\" -DSSS_SSH_SOCKET_NAME=\"/var/lib/sss/pipes/ssh\" -DLOCALEDIR=\"/usr/share/locale\" -DBASE_FILE_STEM=\"libsss_ad_la-ad_machine_pw_renewal\" -Wall -Wshadow -Wstrict-prototypes -Wpointer-arith -Wcast-qual -Wcast-align -Wwrite-strings -Wundef -Werror-implicit-function-declaration -Winit-self -fno-strict-aliasing -std=gnu99 -DHAVE_IMMEDIATE_STRUCTURES=1 -D_GNU_SOURCE=1 -DHAVE_IMMEDIATE_STRUCTURES=1 -D_GNU_SOURCE=1 -DHAVE_IMMEDIATE_STRUCTURES=1 -I/usr/include/samba-4.0 -I/usr/include/samba-4.0 -O2 -fwrapv -pipe -Wformat -Werror=format-security -gdwarf-4 -fno-debug-types-section -fvar-tracking-assignments -g2 -Wp,-D_FORTIFY_SOURCE=2 -fstack-protector-strong --param=ssp-buffer-size=4 -Werror=trampolines -fPIC -mtune=generic -march=x86-64 -gdwarf-4 -fno-debug-types-section -fvar-tracking-assignments -g2 -D_FILE_OFFSET_BITS=64 -D_LARGEFILE_SOURCE -D_LARGEFILE64_SOURCE -MT src/providers/ad/libsss_ad_la-ad_machine_pw_renewal.lo -MD -MP -MF src/providers/ad/.deps/libsss_ad_la-ad_machine_pw_renewal.Tpo -c src/providers/ad/ad_machine_pw_renewal.c  -fPIC -DPIC -o src/providers/ad/.libs/libsss_ad_la-ad_machine_pw_renewal.o
In file included from ./src/providers/krb5/krb5_common.h:34,
                 from ./src/providers/ldap/ldap_common.h:29,
                 from ./src/providers/ad/ad_common.h:27,
                 from src/providers/ad/ad_machine_pw_renewal.c:27:
./src/util/sss_krb5.h:113:5: warning: "HAVE_KRB5_GET_INIT_CREDS_OPT_SET_FAST_FLAGS" is not defined, evaluates to 0 [-Wundef]
  113 | #if HAVE_KRB5_GET_INIT_CREDS_OPT_SET_FAST_FLAGS
      |     ^~~~~~~~~~~~~~~~~~~~~~~~~~~~~~~~~~~~~~~~~~~
mv -f src/providers/ad/.deps/libsss_ad_la-ad_machine_pw_renewal.Tpo src/providers/ad/.deps/libsss_ad_la-ad_machine_pw_renewal.Plo
make[2]: Leaving directory '/tmp/B.j8crwcva/BUILD/sssd-1.13.4'
make[2]: Entering directory '/tmp/B.j8crwcva/BUILD/sssd-1.13.4'
/bin/sh ./libtool  --tag=CC   --mode=compile x86_64-pld-linux-gnux32-gcc -DHAVE_CONFIG_H -I.  -Wall -Iinclude -I.. -I./include -I./src/sss_client -I./src -Iinclude -I.      -I/usr/include/dbus-1.0 -I/usr/libx32/dbus-1.0/include     -I/usr/include/libnl3  -I/usr/include/glib-2.0 -I/usr/libx32/glib-2.0/include  -DLIBDIR=\"/usr/libx32\" -DVARDIR=\"/var\" -DSSS_STATEDIR=\"/var/lib/sss\" -DSYSCONFDIR=\"/etc\" -DSHLIBEXT=\"\" -DSSSD_LIBEXEC_PATH=\"/usr/libexec/sssd\" -DSSSD_CONF_DIR=\"/etc/sssd\" -DSSS_NSS_MCACHE_DIR=\"/var/lib/sss/mc\" -DSSS_NSS_SOCKET_NAME=\"/var/lib/sss/pipes/nss\" -DSSS_PAM_SOCKET_NAME=\"/var/lib/sss/pipes/pam\" -DSSS_PAC_SOCKET_NAME=\"/var/lib/sss/pipes/pac\" -DSSS_PAM_PRIV_SOCKET_NAME=\"/var/lib/sss/pipes/private/pam\" -DSSS_SUDO_SOCKET_NAME=\"/var/lib/sss/pipes/sudo\" -DSSS_AUTOFS_SOCKET_NAME=\"/var/lib/sss/pipes/autofs\" -DSSS_SSH_SOCKET_NAME=\"/var/lib/sss/pipes/ssh\" -DLOCALEDIR=\"/usr/share/locale\" -DBASE_FILE_STEM=\"libsss_ad_la-ad_id\"    -Wall -Wshadow -Wstrict-prototypes -Wpointer-arith -Wcast-qual -Wcast-align -Wwrite-strings -Wundef -Werror-implicit-function-declaration -Winit-self -fno-strict-aliasing -std=gnu99     -DHAVE_IMMEDIATE_STRUCTURES=1 -D_GNU_SOURCE=1 -DHAVE_IMMEDIATE_STRUCTURES=1 -D_GNU_SOURCE=1 -DHAVE_IMMEDIATE_STRUCTURES=1 -I/usr/include/samba-4.0 -I/usr/include/samba-4.0 -O2 -fwrapv -pipe -Wformat -Werror=format-security -gdwarf-4 -fno-debug-types-section -fvar-tracking-assignments -g2 -Wp,-D_FORTIFY_SOURCE=2 -fstack-protector-strong --param=ssp-buffer-size=4 -Werror=trampolines -fPIC -mtune=generic -march=x86-64 -gdwarf-4 -fno-debug-types-section -fvar-tracking-assignments -g2  -D_FILE_OFFSET_BITS=64 -D_LARGEFILE_SOURCE -D_LARGEFILE64_SOURCE -MT src/providers/ad/libsss_ad_la-ad_id.lo -MD -MP -MF src/providers/ad/.deps/libsss_ad_la-ad_id.Tpo -c -o src/providers/ad/libsss_ad_la-ad_id.lo `test -f 'src/providers/ad/ad_id.c' || echo './'`src/providers/ad/ad_id.c
libtool: compile:  x86_64-pld-linux-gnux32-gcc -DHAVE_CONFIG_H -I. -Wall -Iinclude -I.. -I./include -I./src/sss_client -I./src -Iinclude -I. -I/usr/include/dbus-1.0 -I/usr/libx32/dbus-1.0/include -I/usr/include/libnl3 -I/usr/include/glib-2.0 -I/usr/libx32/glib-2.0/include -DLIBDIR=\"/usr/libx32\" -DVARDIR=\"/var\" -DSSS_STATEDIR=\"/var/lib/sss\" -DSYSCONFDIR=\"/etc\" -DSHLIBEXT=\"\" -DSSSD_LIBEXEC_PATH=\"/usr/libexec/sssd\" -DSSSD_CONF_DIR=\"/etc/sssd\" -DSSS_NSS_MCACHE_DIR=\"/var/lib/sss/mc\" -DSSS_NSS_SOCKET_NAME=\"/var/lib/sss/pipes/nss\" -DSSS_PAM_SOCKET_NAME=\"/var/lib/sss/pipes/pam\" -DSSS_PAC_SOCKET_NAME=\"/var/lib/sss/pipes/pac\" -DSSS_PAM_PRIV_SOCKET_NAME=\"/var/lib/sss/pipes/private/pam\" -DSSS_SUDO_SOCKET_NAME=\"/var/lib/sss/pipes/sudo\" -DSSS_AUTOFS_SOCKET_NAME=\"/var/lib/sss/pipes/autofs\" -DSSS_SSH_SOCKET_NAME=\"/var/lib/sss/pipes/ssh\" -DLOCALEDIR=\"/usr/share/locale\" -DBASE_FILE_STEM=\"libsss_ad_la-ad_id\" -Wall -Wshadow -Wstrict-prototypes -Wpointer-arith -Wcast-qual -Wcast-align -Wwrite-strings -Wundef -Werror-implicit-function-declaration -Winit-self -fno-strict-aliasing -std=gnu99 -DHAVE_IMMEDIATE_STRUCTURES=1 -D_GNU_SOURCE=1 -DHAVE_IMMEDIATE_STRUCTURES=1 -D_GNU_SOURCE=1 -DHAVE_IMMEDIATE_STRUCTURES=1 -I/usr/include/samba-4.0 -I/usr/include/samba-4.0 -O2 -fwrapv -pipe -Wformat -Werror=format-security -gdwarf-4 -fno-debug-types-section -fvar-tracking-assignments -g2 -Wp,-D_FORTIFY_SOURCE=2 -fstack-protector-strong --param=ssp-buffer-size=4 -Werror=trampolines -fPIC -mtune=generic -march=x86-64 -gdwarf-4 -fno-debug-types-section -fvar-tracking-assignments -g2 -D_FILE_OFFSET_BITS=64 -D_LARGEFILE_SOURCE -D_LARGEFILE64_SOURCE -MT src/providers/ad/libsss_ad_la-ad_id.lo -MD -MP -MF src/providers/ad/.deps/libsss_ad_la-ad_id.Tpo -c src/providers/ad/ad_id.c  -fPIC -DPIC -o src/providers/ad/.libs/libsss_ad_la-ad_id.o
In file included from ./src/providers/krb5/krb5_common.h:34,
                 from ./src/providers/ldap/ldap_common.h:29,
                 from ./src/providers/ad/ad_common.h:27,
                 from src/providers/ad/ad_id.c:24:
./src/util/sss_krb5.h:113:5: warning: "HAVE_KRB5_GET_INIT_CREDS_OPT_SET_FAST_FLAGS" is not defined, evaluates to 0 [-Wundef]
  113 | #if HAVE_KRB5_GET_INIT_CREDS_OPT_SET_FAST_FLAGS
      |     ^~~~~~~~~~~~~~~~~~~~~~~~~~~~~~~~~~~~~~~~~~~
mv -f src/providers/ad/.deps/libsss_ad_la-ad_id.Tpo src/providers/ad/.deps/libsss_ad_la-ad_id.Plo
make[2]: Leaving directory '/tmp/B.j8crwcva/BUILD/sssd-1.13.4'
make[2]: Entering directory '/tmp/B.j8crwcva/BUILD/sssd-1.13.4'
/bin/sh ./libtool  --tag=CC   --mode=compile x86_64-pld-linux-gnux32-gcc -DHAVE_CONFIG_H -I.  -Wall -Iinclude -I.. -I./include -I./src/sss_client -I./src -Iinclude -I.      -I/usr/include/dbus-1.0 -I/usr/libx32/dbus-1.0/include     -I/usr/include/libnl3  -I/usr/include/glib-2.0 -I/usr/libx32/glib-2.0/include  -DLIBDIR=\"/usr/libx32\" -DVARDIR=\"/var\" -DSSS_STATEDIR=\"/var/lib/sss\" -DSYSCONFDIR=\"/etc\" -DSHLIBEXT=\"\" -DSSSD_LIBEXEC_PATH=\"/usr/libexec/sssd\" -DSSSD_CONF_DIR=\"/etc/sssd\" -DSSS_NSS_MCACHE_DIR=\"/var/lib/sss/mc\" -DSSS_NSS_SOCKET_NAME=\"/var/lib/sss/pipes/nss\" -DSSS_PAM_SOCKET_NAME=\"/var/lib/sss/pipes/pam\" -DSSS_PAC_SOCKET_NAME=\"/var/lib/sss/pipes/pac\" -DSSS_PAM_PRIV_SOCKET_NAME=\"/var/lib/sss/pipes/private/pam\" -DSSS_SUDO_SOCKET_NAME=\"/var/lib/sss/pipes/sudo\" -DSSS_AUTOFS_SOCKET_NAME=\"/var/lib/sss/pipes/autofs\" -DSSS_SSH_SOCKET_NAME=\"/var/lib/sss/pipes/ssh\" -DLOCALEDIR=\"/usr/share/locale\" -DBASE_FILE_STEM=\"libsss_ad_la-ad_gpo_ndr\"    -Wall -Wshadow -Wstrict-prototypes -Wpointer-arith -Wcast-qual -Wcast-align -Wwrite-strings -Wundef -Werror-implicit-function-declaration -Winit-self -fno-strict-aliasing -std=gnu99     -DHAVE_IMMEDIATE_STRUCTURES=1 -D_GNU_SOURCE=1 -DHAVE_IMMEDIATE_STRUCTURES=1 -D_GNU_SOURCE=1 -DHAVE_IMMEDIATE_STRUCTURES=1 -I/usr/include/samba-4.0 -I/usr/include/samba-4.0 -O2 -fwrapv -pipe -Wformat -Werror=format-security -gdwarf-4 -fno-debug-types-section -fvar-tracking-assignments -g2 -Wp,-D_FORTIFY_SOURCE=2 -fstack-protector-strong --param=ssp-buffer-size=4 -Werror=trampolines -fPIC -mtune=generic -march=x86-64 -gdwarf-4 -fno-debug-types-section -fvar-tracking-assignments -g2  -D_FILE_OFFSET_BITS=64 -D_LARGEFILE_SOURCE -D_LARGEFILE64_SOURCE -MT src/providers/ad/libsss_ad_la-ad_gpo_ndr.lo -MD -MP -MF src/providers/ad/.deps/libsss_ad_la-ad_gpo_ndr.Tpo -c -o src/providers/ad/libsss_ad_la-ad_gpo_ndr.lo `test -f 'src/providers/ad/ad_gpo_ndr.c' || echo './'`src/providers/ad/ad_gpo_ndr.c
libtool: compile:  x86_64-pld-linux-gnux32-gcc -DHAVE_CONFIG_H -I. -Wall -Iinclude -I.. -I./include -I./src/sss_client -I./src -Iinclude -I. -I/usr/include/dbus-1.0 -I/usr/libx32/dbus-1.0/include -I/usr/include/libnl3 -I/usr/include/glib-2.0 -I/usr/libx32/glib-2.0/include -DLIBDIR=\"/usr/libx32\" -DVARDIR=\"/var\" -DSSS_STATEDIR=\"/var/lib/sss\" -DSYSCONFDIR=\"/etc\" -DSHLIBEXT=\"\" -DSSSD_LIBEXEC_PATH=\"/usr/libexec/sssd\" -DSSSD_CONF_DIR=\"/etc/sssd\" -DSSS_NSS_MCACHE_DIR=\"/var/lib/sss/mc\" -DSSS_NSS_SOCKET_NAME=\"/var/lib/sss/pipes/nss\" -DSSS_PAM_SOCKET_NAME=\"/var/lib/sss/pipes/pam\" -DSSS_PAC_SOCKET_NAME=\"/var/lib/sss/pipes/pac\" -DSSS_PAM_PRIV_SOCKET_NAME=\"/var/lib/sss/pipes/private/pam\" -DSSS_SUDO_SOCKET_NAME=\"/var/lib/sss/pipes/sudo\" -DSSS_AUTOFS_SOCKET_NAME=\"/var/lib/sss/pipes/autofs\" -DSSS_SSH_SOCKET_NAME=\"/var/lib/sss/pipes/ssh\" -DLOCALEDIR=\"/usr/share/locale\" -DBASE_FILE_STEM=\"libsss_ad_la-ad_gpo_ndr\" -Wall -Wshadow -Wstrict-prototypes -Wpointer-arith -Wcast-qual -Wcast-align -Wwrite-strings -Wundef -Werror-implicit-function-declaration -Winit-self -fno-strict-aliasing -std=gnu99 -DHAVE_IMMEDIATE_STRUCTURES=1 -D_GNU_SOURCE=1 -DHAVE_IMMEDIATE_STRUCTURES=1 -D_GNU_SOURCE=1 -DHAVE_IMMEDIATE_STRUCTURES=1 -I/usr/include/samba-4.0 -I/usr/include/samba-4.0 -O2 -fwrapv -pipe -Wformat -Werror=format-security -gdwarf-4 -fno-debug-types-section -fvar-tracking-assignments -g2 -Wp,-D_FORTIFY_SOURCE=2 -fstack-protector-strong --param=ssp-buffer-size=4 -Werror=trampolines -fPIC -mtune=generic -march=x86-64 -gdwarf-4 -fno-debug-types-section -fvar-tracking-assignments -g2 -D_FILE_OFFSET_BITS=64 -D_LARGEFILE_SOURCE -D_LARGEFILE64_SOURCE -MT src/providers/ad/libsss_ad_la-ad_gpo_ndr.lo -MD -MP -MF src/providers/ad/.deps/libsss_ad_la-ad_gpo_ndr.Tpo -c src/providers/ad/ad_gpo_ndr.c  -fPIC -DPIC -o src/providers/ad/.libs/libsss_ad_la-ad_gpo_ndr.o
src/providers/ad/ad_gpo_ndr.c: In function 'ndr_pull_security_ace_object_type':
src/providers/ad/ad_gpo_ndr.c:108:13: error: too few arguments to function 'ndr_token_peek'
  108 |     level = ndr_token_peek(&ndr->switch_list, r);
      |             ^~~~~~~~~~~~~~
In file included from src/providers/ad/ad_gpo_ndr.c:36:
/usr/include/samba-4.0/ndr.h:656:19: note: declared here
  656 | enum ndr_err_code ndr_token_peek(struct ndr_token_list *list, const void *key, uint32_t *v);
      |                   ^~~~~~~~~~~~~~
src/providers/ad/ad_gpo_ndr.c: In function 'ndr_pull_security_ace_object_inherited_type':
src/providers/ad/ad_gpo_ndr.c:138:13: error: too few arguments to function 'ndr_token_peek'
  138 |     level = ndr_token_peek(&ndr->switch_list, r);
      |             ^~~~~~~~~~~~~~
In file included from src/providers/ad/ad_gpo_ndr.c:36:
/usr/include/samba-4.0/ndr.h:656:19: note: declared here
  656 | enum ndr_err_code ndr_token_peek(struct ndr_token_list *list, const void *key, uint32_t *v);
      |                   ^~~~~~~~~~~~~~
src/providers/ad/ad_gpo_ndr.c: In function 'ndr_pull_security_ace_object_ctr':
src/providers/ad/ad_gpo_ndr.c:201:13: error: too few arguments to function 'ndr_token_peek'
  201 |     level = ndr_token_peek(&ndr->switch_list, r);
      |             ^~~~~~~~~~~~~~
In file included from src/providers/ad/ad_gpo_ndr.c:36:
/usr/include/samba-4.0/ndr.h:656:19: note: declared here
  656 | enum ndr_err_code ndr_token_peek(struct ndr_token_list *list, const void *key, uint32_t *v);
      |                   ^~~~~~~~~~~~~~
make[2]: *** [Makefile:13060: src/providers/ad/libsss_ad_la-ad_gpo_ndr.lo] Error 1
make[2]: Leaving directory '/tmp/B.j8crwcva/BUILD/sssd-1.13.4'
make[2]: *** Waiting for unfinished jobs....
make[2]: Entering directory '/tmp/B.j8crwcva/BUILD/sssd-1.13.4'
/bin/sh ./libtool  --tag=CC   --mode=compile x86_64-pld-linux-gnux32-gcc -DHAVE_CONFIG_H -I.  -Wall -Iinclude -I.. -I./include -I./src/sss_client -I./src -Iinclude -I.      -I/usr/include/dbus-1.0 -I/usr/libx32/dbus-1.0/include     -I/usr/include/libnl3  -I/usr/include/glib-2.0 -I/usr/libx32/glib-2.0/include  -DLIBDIR=\"/usr/libx32\" -DVARDIR=\"/var\" -DSSS_STATEDIR=\"/var/lib/sss\" -DSYSCONFDIR=\"/etc\" -DSHLIBEXT=\"\" -DSSSD_LIBEXEC_PATH=\"/usr/libexec/sssd\" -DSSSD_CONF_DIR=\"/etc/sssd\" -DSSS_NSS_MCACHE_DIR=\"/var/lib/sss/mc\" -DSSS_NSS_SOCKET_NAME=\"/var/lib/sss/pipes/nss\" -DSSS_PAM_SOCKET_NAME=\"/var/lib/sss/pipes/pam\" -DSSS_PAC_SOCKET_NAME=\"/var/lib/sss/pipes/pac\" -DSSS_PAM_PRIV_SOCKET_NAME=\"/var/lib/sss/pipes/private/pam\" -DSSS_SUDO_SOCKET_NAME=\"/var/lib/sss/pipes/sudo\" -DSSS_AUTOFS_SOCKET_NAME=\"/var/lib/sss/pipes/autofs\" -DSSS_SSH_SOCKET_NAME=\"/var/lib/sss/pipes/ssh\" -DLOCALEDIR=\"/usr/share/locale\" -DBASE_FILE_STEM=\"libsss_ad_la-ad_access\"    -Wall -Wshadow -Wstrict-prototypes -Wpointer-arith -Wcast-qual -Wcast-align -Wwrite-strings -Wundef -Werror-implicit-function-declaration -Winit-self -fno-strict-aliasing -std=gnu99     -DHAVE_IMMEDIATE_STRUCTURES=1 -D_GNU_SOURCE=1 -DHAVE_IMMEDIATE_STRUCTURES=1 -D_GNU_SOURCE=1 -DHAVE_IMMEDIATE_STRUCTURES=1 -I/usr/include/samba-4.0 -I/usr/include/samba-4.0 -O2 -fwrapv -pipe -Wformat -Werror=format-security -gdwarf-4 -fno-debug-types-section -fvar-tracking-assignments -g2 -Wp,-D_FORTIFY_SOURCE=2 -fstack-protector-strong --param=ssp-buffer-size=4 -Werror=trampolines -fPIC -mtune=generic -march=x86-64 -gdwarf-4 -fno-debug-types-section -fvar-tracking-assignments -g2  -D_FILE_OFFSET_BITS=64 -D_LARGEFILE_SOURCE -D_LARGEFILE64_SOURCE -MT src/providers/ad/libsss_ad_la-ad_access.lo -MD -MP -MF src/providers/ad/.deps/libsss_ad_la-ad_access.Tpo -c -o src/providers/ad/libsss_ad_la-ad_access.lo `test -f 'src/providers/ad/ad_access.c' || echo './'`src/providers/ad/ad_access.c
libtool: compile:  x86_64-pld-linux-gnux32-gcc -DHAVE_CONFIG_H -I. -Wall -Iinclude -I.. -I./include -I./src/sss_client -I./src -Iinclude -I. -I/usr/include/dbus-1.0 -I/usr/libx32/dbus-1.0/include -I/usr/include/libnl3 -I/usr/include/glib-2.0 -I/usr/libx32/glib-2.0/include -DLIBDIR=\"/usr/libx32\" -DVARDIR=\"/var\" -DSSS_STATEDIR=\"/var/lib/sss\" -DSYSCONFDIR=\"/etc\" -DSHLIBEXT=\"\" -DSSSD_LIBEXEC_PATH=\"/usr/libexec/sssd\" -DSSSD_CONF_DIR=\"/etc/sssd\" -DSSS_NSS_MCACHE_DIR=\"/var/lib/sss/mc\" -DSSS_NSS_SOCKET_NAME=\"/var/lib/sss/pipes/nss\" -DSSS_PAM_SOCKET_NAME=\"/var/lib/sss/pipes/pam\" -DSSS_PAC_SOCKET_NAME=\"/var/lib/sss/pipes/pac\" -DSSS_PAM_PRIV_SOCKET_NAME=\"/var/lib/sss/pipes/private/pam\" -DSSS_SUDO_SOCKET_NAME=\"/var/lib/sss/pipes/sudo\" -DSSS_AUTOFS_SOCKET_NAME=\"/var/lib/sss/pipes/autofs\" -DSSS_SSH_SOCKET_NAME=\"/var/lib/sss/pipes/ssh\" -DLOCALEDIR=\"/usr/share/locale\" -DBASE_FILE_STEM=\"libsss_ad_la-ad_access\" -Wall -Wshadow -Wstrict-prototypes -Wpointer-arith -Wcast-qual -Wcast-align -Wwrite-strings -Wundef -Werror-implicit-function-declaration -Winit-self -fno-strict-aliasing -std=gnu99 -DHAVE_IMMEDIATE_STRUCTURES=1 -D_GNU_SOURCE=1 -DHAVE_IMMEDIATE_STRUCTURES=1 -D_GNU_SOURCE=1 -DHAVE_IMMEDIATE_STRUCTURES=1 -I/usr/include/samba-4.0 -I/usr/include/samba-4.0 -O2 -fwrapv -pipe -Wformat -Werror=format-security -gdwarf-4 -fno-debug-types-section -fvar-tracking-assignments -g2 -Wp,-D_FORTIFY_SOURCE=2 -fstack-protector-strong --param=ssp-buffer-size=4 -Werror=trampolines -fPIC -mtune=generic -march=x86-64 -gdwarf-4 -fno-debug-types-section -fvar-tracking-assignments -g2 -D_FILE_OFFSET_BITS=64 -D_LARGEFILE_SOURCE -D_LARGEFILE64_SOURCE -MT src/providers/ad/libsss_ad_la-ad_access.lo -MD -MP -MF src/providers/ad/.deps/libsss_ad_la-ad_access.Tpo -c src/providers/ad/ad_access.c  -fPIC -DPIC -o src/providers/ad/.libs/libsss_ad_la-ad_access.o
In file included from ./src/providers/krb5/krb5_common.h:34,
                 from ./src/providers/ldap/ldap_common.h:29,
                 from ./src/providers/ad/ad_common.h:27,
                 from src/providers/ad/ad_access.c:31:
./src/util/sss_krb5.h:113:5: warning: "HAVE_KRB5_GET_INIT_CREDS_OPT_SET_FAST_FLAGS" is not defined, evaluates to 0 [-Wundef]
  113 | #if HAVE_KRB5_GET_INIT_CREDS_OPT_SET_FAST_FLAGS
      |     ^~~~~~~~~~~~~~~~~~~~~~~~~~~~~~~~~~~~~~~~~~~
mv -f src/providers/ad/.deps/libsss_ad_la-ad_access.Tpo src/providers/ad/.deps/libsss_ad_la-ad_access.Plo
make[2]: Leaving directory '/tmp/B.j8crwcva/BUILD/sssd-1.13.4'
make[2]: Entering directory '/tmp/B.j8crwcva/BUILD/sssd-1.13.4'
/bin/sh ./libtool  --tag=CC   --mode=compile x86_64-pld-linux-gnux32-gcc -DHAVE_CONFIG_H -I.  -Wall -Iinclude -I.. -I./include -I./src/sss_client -I./src -Iinclude -I.      -I/usr/include/dbus-1.0 -I/usr/libx32/dbus-1.0/include     -I/usr/include/libnl3  -I/usr/include/glib-2.0 -I/usr/libx32/glib-2.0/include  -DLIBDIR=\"/usr/libx32\" -DVARDIR=\"/var\" -DSSS_STATEDIR=\"/var/lib/sss\" -DSYSCONFDIR=\"/etc\" -DSHLIBEXT=\"\" -DSSSD_LIBEXEC_PATH=\"/usr/libexec/sssd\" -DSSSD_CONF_DIR=\"/etc/sssd\" -DSSS_NSS_MCACHE_DIR=\"/var/lib/sss/mc\" -DSSS_NSS_SOCKET_NAME=\"/var/lib/sss/pipes/nss\" -DSSS_PAM_SOCKET_NAME=\"/var/lib/sss/pipes/pam\" -DSSS_PAC_SOCKET_NAME=\"/var/lib/sss/pipes/pac\" -DSSS_PAM_PRIV_SOCKET_NAME=\"/var/lib/sss/pipes/private/pam\" -DSSS_SUDO_SOCKET_NAME=\"/var/lib/sss/pipes/sudo\" -DSSS_AUTOFS_SOCKET_NAME=\"/var/lib/sss/pipes/autofs\" -DSSS_SSH_SOCKET_NAME=\"/var/lib/sss/pipes/ssh\" -DLOCALEDIR=\"/usr/share/locale\" -DBASE_FILE_STEM=\"libsss_ad_la-ad_sudo\"    -Wall -Wshadow -Wstrict-prototypes -Wpointer-arith -Wcast-qual -Wcast-align -Wwrite-strings -Wundef -Werror-implicit-function-declaration -Winit-self -fno-strict-aliasing -std=gnu99     -DHAVE_IMMEDIATE_STRUCTURES=1 -D_GNU_SOURCE=1 -DHAVE_IMMEDIATE_STRUCTURES=1 -D_GNU_SOURCE=1 -DHAVE_IMMEDIATE_STRUCTURES=1 -I/usr/include/samba-4.0 -I/usr/include/samba-4.0 -O2 -fwrapv -pipe -Wformat -Werror=format-security -gdwarf-4 -fno-debug-types-section -fvar-tracking-assignments -g2 -Wp,-D_FORTIFY_SOURCE=2 -fstack-protector-strong --param=ssp-buffer-size=4 -Werror=trampolines -fPIC -mtune=generic -march=x86-64 -gdwarf-4 -fno-debug-types-section -fvar-tracking-assignments -g2  -D_FILE_OFFSET_BITS=64 -D_LARGEFILE_SOURCE -D_LARGEFILE64_SOURCE -MT src/providers/ad/libsss_ad_la-ad_sudo.lo -MD -MP -MF src/providers/ad/.deps/libsss_ad_la-ad_sudo.Tpo -c -o src/providers/ad/libsss_ad_la-ad_sudo.lo `test -f 'src/providers/ad/ad_sudo.c' || echo './'`src/providers/ad/ad_sudo.c
libtool: compile:  x86_64-pld-linux-gnux32-gcc -DHAVE_CONFIG_H -I. -Wall -Iinclude -I.. -I./include -I./src/sss_client -I./src -Iinclude -I. -I/usr/include/dbus-1.0 -I/usr/libx32/dbus-1.0/include -I/usr/include/libnl3 -I/usr/include/glib-2.0 -I/usr/libx32/glib-2.0/include -DLIBDIR=\"/usr/libx32\" -DVARDIR=\"/var\" -DSSS_STATEDIR=\"/var/lib/sss\" -DSYSCONFDIR=\"/etc\" -DSHLIBEXT=\"\" -DSSSD_LIBEXEC_PATH=\"/usr/libexec/sssd\" -DSSSD_CONF_DIR=\"/etc/sssd\" -DSSS_NSS_MCACHE_DIR=\"/var/lib/sss/mc\" -DSSS_NSS_SOCKET_NAME=\"/var/lib/sss/pipes/nss\" -DSSS_PAM_SOCKET_NAME=\"/var/lib/sss/pipes/pam\" -DSSS_PAC_SOCKET_NAME=\"/var/lib/sss/pipes/pac\" -DSSS_PAM_PRIV_SOCKET_NAME=\"/var/lib/sss/pipes/private/pam\" -DSSS_SUDO_SOCKET_NAME=\"/var/lib/sss/pipes/sudo\" -DSSS_AUTOFS_SOCKET_NAME=\"/var/lib/sss/pipes/autofs\" -DSSS_SSH_SOCKET_NAME=\"/var/lib/sss/pipes/ssh\" -DLOCALEDIR=\"/usr/share/locale\" -DBASE_FILE_STEM=\"libsss_ad_la-ad_sudo\" -Wall -Wshadow -Wstrict-prototypes -Wpointer-arith -Wcast-qual -Wcast-align -Wwrite-strings -Wundef -Werror-implicit-function-declaration -Winit-self -fno-strict-aliasing -std=gnu99 -DHAVE_IMMEDIATE_STRUCTURES=1 -D_GNU_SOURCE=1 -DHAVE_IMMEDIATE_STRUCTURES=1 -D_GNU_SOURCE=1 -DHAVE_IMMEDIATE_STRUCTURES=1 -I/usr/include/samba-4.0 -I/usr/include/samba-4.0 -O2 -fwrapv -pipe -Wformat -Werror=format-security -gdwarf-4 -fno-debug-types-section -fvar-tracking-assignments -g2 -Wp,-D_FORTIFY_SOURCE=2 -fstack-protector-strong --param=ssp-buffer-size=4 -Werror=trampolines -fPIC -mtune=generic -march=x86-64 -gdwarf-4 -fno-debug-types-section -fvar-tracking-assignments -g2 -D_FILE_OFFSET_BITS=64 -D_LARGEFILE_SOURCE -D_LARGEFILE64_SOURCE -MT src/providers/ad/libsss_ad_la-ad_sudo.lo -MD -MP -MF src/providers/ad/.deps/libsss_ad_la-ad_sudo.Tpo -c src/providers/ad/ad_sudo.c  -fPIC -DPIC -o src/providers/ad/.libs/libsss_ad_la-ad_sudo.o
In file included from ./src/providers/krb5/krb5_common.h:34,
                 from ./src/providers/ldap/ldap_common.h:29,
                 from ./src/providers/ad/ad_common.h:27,
                 from src/providers/ad/ad_sudo.c:25:
./src/util/sss_krb5.h:113:5: warning: "HAVE_KRB5_GET_INIT_CREDS_OPT_SET_FAST_FLAGS" is not defined, evaluates to 0 [-Wundef]
  113 | #if HAVE_KRB5_GET_INIT_CREDS_OPT_SET_FAST_FLAGS
      |     ^~~~~~~~~~~~~~~~~~~~~~~~~~~~~~~~~~~~~~~~~~~
mv -f src/providers/ad/.deps/libsss_ad_la-ad_sudo.Tpo src/providers/ad/.deps/libsss_ad_la-ad_sudo.Plo
make[2]: Leaving directory '/tmp/B.j8crwcva/BUILD/sssd-1.13.4'
make[2]: Entering directory '/tmp/B.j8crwcva/BUILD/sssd-1.13.4'
/bin/sh ./libtool  --tag=CC   --mode=compile x86_64-pld-linux-gnux32-gcc -DHAVE_CONFIG_H -I.  -Wall -Iinclude -I.. -I./include -I./src/sss_client -I./src -Iinclude -I.      -I/usr/include/dbus-1.0 -I/usr/libx32/dbus-1.0/include     -I/usr/include/libnl3  -I/usr/include/glib-2.0 -I/usr/libx32/glib-2.0/include  -DLIBDIR=\"/usr/libx32\" -DVARDIR=\"/var\" -DSSS_STATEDIR=\"/var/lib/sss\" -DSYSCONFDIR=\"/etc\" -DSHLIBEXT=\"\" -DSSSD_LIBEXEC_PATH=\"/usr/libexec/sssd\" -DSSSD_CONF_DIR=\"/etc/sssd\" -DSSS_NSS_MCACHE_DIR=\"/var/lib/sss/mc\" -DSSS_NSS_SOCKET_NAME=\"/var/lib/sss/pipes/nss\" -DSSS_PAM_SOCKET_NAME=\"/var/lib/sss/pipes/pam\" -DSSS_PAC_SOCKET_NAME=\"/var/lib/sss/pipes/pac\" -DSSS_PAM_PRIV_SOCKET_NAME=\"/var/lib/sss/pipes/private/pam\" -DSSS_SUDO_SOCKET_NAME=\"/var/lib/sss/pipes/sudo\" -DSSS_AUTOFS_SOCKET_NAME=\"/var/lib/sss/pipes/autofs\" -DSSS_SSH_SOCKET_NAME=\"/var/lib/sss/pipes/ssh\" -DLOCALEDIR=\"/usr/share/locale\" -DBASE_FILE_STEM=\"libsss_ad_la-ad_autofs\"    -Wall -Wshadow -Wstrict-prototypes -Wpointer-arith -Wcast-qual -Wcast-align -Wwrite-strings -Wundef -Werror-implicit-function-declaration -Winit-self -fno-strict-aliasing -std=gnu99     -DHAVE_IMMEDIATE_STRUCTURES=1 -D_GNU_SOURCE=1 -DHAVE_IMMEDIATE_STRUCTURES=1 -D_GNU_SOURCE=1 -DHAVE_IMMEDIATE_STRUCTURES=1 -I/usr/include/samba-4.0 -I/usr/include/samba-4.0 -O2 -fwrapv -pipe -Wformat -Werror=format-security -gdwarf-4 -fno-debug-types-section -fvar-tracking-assignments -g2 -Wp,-D_FORTIFY_SOURCE=2 -fstack-protector-strong --param=ssp-buffer-size=4 -Werror=trampolines -fPIC -mtune=generic -march=x86-64 -gdwarf-4 -fno-debug-types-section -fvar-tracking-assignments -g2  -D_FILE_OFFSET_BITS=64 -D_LARGEFILE_SOURCE -D_LARGEFILE64_SOURCE -MT src/providers/ad/libsss_ad_la-ad_autofs.lo -MD -MP -MF src/providers/ad/.deps/libsss_ad_la-ad_autofs.Tpo -c -o src/providers/ad/libsss_ad_la-ad_autofs.lo `test -f 'src/providers/ad/ad_autofs.c' || echo './'`src/providers/ad/ad_autofs.c
libtool: compile:  x86_64-pld-linux-gnux32-gcc -DHAVE_CONFIG_H -I. -Wall -Iinclude -I.. -I./include -I./src/sss_client -I./src -Iinclude -I. -I/usr/include/dbus-1.0 -I/usr/libx32/dbus-1.0/include -I/usr/include/libnl3 -I/usr/include/glib-2.0 -I/usr/libx32/glib-2.0/include -DLIBDIR=\"/usr/libx32\" -DVARDIR=\"/var\" -DSSS_STATEDIR=\"/var/lib/sss\" -DSYSCONFDIR=\"/etc\" -DSHLIBEXT=\"\" -DSSSD_LIBEXEC_PATH=\"/usr/libexec/sssd\" -DSSSD_CONF_DIR=\"/etc/sssd\" -DSSS_NSS_MCACHE_DIR=\"/var/lib/sss/mc\" -DSSS_NSS_SOCKET_NAME=\"/var/lib/sss/pipes/nss\" -DSSS_PAM_SOCKET_NAME=\"/var/lib/sss/pipes/pam\" -DSSS_PAC_SOCKET_NAME=\"/var/lib/sss/pipes/pac\" -DSSS_PAM_PRIV_SOCKET_NAME=\"/var/lib/sss/pipes/private/pam\" -DSSS_SUDO_SOCKET_NAME=\"/var/lib/sss/pipes/sudo\" -DSSS_AUTOFS_SOCKET_NAME=\"/var/lib/sss/pipes/autofs\" -DSSS_SSH_SOCKET_NAME=\"/var/lib/sss/pipes/ssh\" -DLOCALEDIR=\"/usr/share/locale\" -DBASE_FILE_STEM=\"libsss_ad_la-ad_autofs\" -Wall -Wshadow -Wstrict-prototypes -Wpointer-arith -Wcast-qual -Wcast-align -Wwrite-strings -Wundef -Werror-implicit-function-declaration -Winit-self -fno-strict-aliasing -std=gnu99 -DHAVE_IMMEDIATE_STRUCTURES=1 -D_GNU_SOURCE=1 -DHAVE_IMMEDIATE_STRUCTURES=1 -D_GNU_SOURCE=1 -DHAVE_IMMEDIATE_STRUCTURES=1 -I/usr/include/samba-4.0 -I/usr/include/samba-4.0 -O2 -fwrapv -pipe -Wformat -Werror=format-security -gdwarf-4 -fno-debug-types-section -fvar-tracking-assignments -g2 -Wp,-D_FORTIFY_SOURCE=2 -fstack-protector-strong --param=ssp-buffer-size=4 -Werror=trampolines -fPIC -mtune=generic -march=x86-64 -gdwarf-4 -fno-debug-types-section -fvar-tracking-assignments -g2 -D_FILE_OFFSET_BITS=64 -D_LARGEFILE_SOURCE -D_LARGEFILE64_SOURCE -MT src/providers/ad/libsss_ad_la-ad_autofs.lo -MD -MP -MF src/providers/ad/.deps/libsss_ad_la-ad_autofs.Tpo -c src/providers/ad/ad_autofs.c  -fPIC -DPIC -o src/providers/ad/.libs/libsss_ad_la-ad_autofs.o
In file included from ./src/providers/krb5/krb5_common.h:34,
                 from ./src/providers/ldap/ldap_common.h:29,
                 from ./src/providers/ad/ad_common.h:27,
                 from src/providers/ad/ad_autofs.c:22:
./src/util/sss_krb5.h:113:5: warning: "HAVE_KRB5_GET_INIT_CREDS_OPT_SET_FAST_FLAGS" is not defined, evaluates to 0 [-Wundef]
  113 | #if HAVE_KRB5_GET_INIT_CREDS_OPT_SET_FAST_FLAGS
      |     ^~~~~~~~~~~~~~~~~~~~~~~~~~~~~~~~~~~~~~~~~~~
mv -f src/providers/ad/.deps/libsss_ad_la-ad_autofs.Tpo src/providers/ad/.deps/libsss_ad_la-ad_autofs.Plo
make[2]: Leaving directory '/tmp/B.j8crwcva/BUILD/sssd-1.13.4'
make[2]: Entering directory '/tmp/B.j8crwcva/BUILD/sssd-1.13.4'
/bin/sh ./libtool  --tag=CC   --mode=compile x86_64-pld-linux-gnux32-gcc -DHAVE_CONFIG_H -I.  -Wall -Iinclude -I.. -I./include -I./src/sss_client -I./src -Iinclude -I.      -I/usr/include/dbus-1.0 -I/usr/libx32/dbus-1.0/include     -I/usr/include/libnl3  -I/usr/include/glib-2.0 -I/usr/libx32/glib-2.0/include  -DLIBDIR=\"/usr/libx32\" -DVARDIR=\"/var\" -DSSS_STATEDIR=\"/var/lib/sss\" -DSYSCONFDIR=\"/etc\" -DSHLIBEXT=\"\" -DSSSD_LIBEXEC_PATH=\"/usr/libexec/sssd\" -DSSSD_CONF_DIR=\"/etc/sssd\" -DSSS_NSS_MCACHE_DIR=\"/var/lib/sss/mc\" -DSSS_NSS_SOCKET_NAME=\"/var/lib/sss/pipes/nss\" -DSSS_PAM_SOCKET_NAME=\"/var/lib/sss/pipes/pam\" -DSSS_PAC_SOCKET_NAME=\"/var/lib/sss/pipes/pac\" -DSSS_PAM_PRIV_SOCKET_NAME=\"/var/lib/sss/pipes/private/pam\" -DSSS_SUDO_SOCKET_NAME=\"/var/lib/sss/pipes/sudo\" -DSSS_AUTOFS_SOCKET_NAME=\"/var/lib/sss/pipes/autofs\" -DSSS_SSH_SOCKET_NAME=\"/var/lib/sss/pipes/ssh\" -DLOCALEDIR=\"/usr/share/locale\" -DBASE_FILE_STEM=\"libsss_ad_la-ad_srv\"    -Wall -Wshadow -Wstrict-prototypes -Wpointer-arith -Wcast-qual -Wcast-align -Wwrite-strings -Wundef -Werror-implicit-function-declaration -Winit-self -fno-strict-aliasing -std=gnu99     -DHAVE_IMMEDIATE_STRUCTURES=1 -D_GNU_SOURCE=1 -DHAVE_IMMEDIATE_STRUCTURES=1 -D_GNU_SOURCE=1 -DHAVE_IMMEDIATE_STRUCTURES=1 -I/usr/include/samba-4.0 -I/usr/include/samba-4.0 -O2 -fwrapv -pipe -Wformat -Werror=format-security -gdwarf-4 -fno-debug-types-section -fvar-tracking-assignments -g2 -Wp,-D_FORTIFY_SOURCE=2 -fstack-protector-strong --param=ssp-buffer-size=4 -Werror=trampolines -fPIC -mtune=generic -march=x86-64 -gdwarf-4 -fno-debug-types-section -fvar-tracking-assignments -g2  -D_FILE_OFFSET_BITS=64 -D_LARGEFILE_SOURCE -D_LARGEFILE64_SOURCE -MT src/providers/ad/libsss_ad_la-ad_srv.lo -MD -MP -MF src/providers/ad/.deps/libsss_ad_la-ad_srv.Tpo -c -o src/providers/ad/libsss_ad_la-ad_srv.lo `test -f 'src/providers/ad/ad_srv.c' || echo './'`src/providers/ad/ad_srv.c
libtool: compile:  x86_64-pld-linux-gnux32-gcc -DHAVE_CONFIG_H -I. -Wall -Iinclude -I.. -I./include -I./src/sss_client -I./src -Iinclude -I. -I/usr/include/dbus-1.0 -I/usr/libx32/dbus-1.0/include -I/usr/include/libnl3 -I/usr/include/glib-2.0 -I/usr/libx32/glib-2.0/include -DLIBDIR=\"/usr/libx32\" -DVARDIR=\"/var\" -DSSS_STATEDIR=\"/var/lib/sss\" -DSYSCONFDIR=\"/etc\" -DSHLIBEXT=\"\" -DSSSD_LIBEXEC_PATH=\"/usr/libexec/sssd\" -DSSSD_CONF_DIR=\"/etc/sssd\" -DSSS_NSS_MCACHE_DIR=\"/var/lib/sss/mc\" -DSSS_NSS_SOCKET_NAME=\"/var/lib/sss/pipes/nss\" -DSSS_PAM_SOCKET_NAME=\"/var/lib/sss/pipes/pam\" -DSSS_PAC_SOCKET_NAME=\"/var/lib/sss/pipes/pac\" -DSSS_PAM_PRIV_SOCKET_NAME=\"/var/lib/sss/pipes/private/pam\" -DSSS_SUDO_SOCKET_NAME=\"/var/lib/sss/pipes/sudo\" -DSSS_AUTOFS_SOCKET_NAME=\"/var/lib/sss/pipes/autofs\" -DSSS_SSH_SOCKET_NAME=\"/var/lib/sss/pipes/ssh\" -DLOCALEDIR=\"/usr/share/locale\" -DBASE_FILE_STEM=\"libsss_ad_la-ad_srv\" -Wall -Wshadow -Wstrict-prototypes -Wpointer-arith -Wcast-qual -Wcast-align -Wwrite-strings -Wundef -Werror-implicit-function-declaration -Winit-self -fno-strict-aliasing -std=gnu99 -DHAVE_IMMEDIATE_STRUCTURES=1 -D_GNU_SOURCE=1 -DHAVE_IMMEDIATE_STRUCTURES=1 -D_GNU_SOURCE=1 -DHAVE_IMMEDIATE_STRUCTURES=1 -I/usr/include/samba-4.0 -I/usr/include/samba-4.0 -O2 -fwrapv -pipe -Wformat -Werror=format-security -gdwarf-4 -fno-debug-types-section -fvar-tracking-assignments -g2 -Wp,-D_FORTIFY_SOURCE=2 -fstack-protector-strong --param=ssp-buffer-size=4 -Werror=trampolines -fPIC -mtune=generic -march=x86-64 -gdwarf-4 -fno-debug-types-section -fvar-tracking-assignments -g2 -D_FILE_OFFSET_BITS=64 -D_LARGEFILE_SOURCE -D_LARGEFILE64_SOURCE -MT src/providers/ad/libsss_ad_la-ad_srv.lo -MD -MP -MF src/providers/ad/.deps/libsss_ad_la-ad_srv.Tpo -c src/providers/ad/ad_srv.c  -fPIC -DPIC -o src/providers/ad/.libs/libsss_ad_la-ad_srv.o
In file included from ./src/providers/krb5/krb5_common.h:34,
                 from ./src/providers/ldap/ldap_common.h:29,
                 from ./src/providers/ad/ad_common.h:27,
                 from src/providers/ad/ad_srv.c:32:
./src/util/sss_krb5.h:113:5: warning: "HAVE_KRB5_GET_INIT_CREDS_OPT_SET_FAST_FLAGS" is not defined, evaluates to 0 [-Wundef]
  113 | #if HAVE_KRB5_GET_INIT_CREDS_OPT_SET_FAST_FLAGS
      |     ^~~~~~~~~~~~~~~~~~~~~~~~~~~~~~~~~~~~~~~~~~~
mv -f src/providers/ad/.deps/libsss_ad_la-ad_srv.Tpo src/providers/ad/.deps/libsss_ad_la-ad_srv.Plo
make[2]: Leaving directory '/tmp/B.j8crwcva/BUILD/sssd-1.13.4'
make[2]: Entering directory '/tmp/B.j8crwcva/BUILD/sssd-1.13.4'
/bin/sh ./libtool  --tag=CC   --mode=compile x86_64-pld-linux-gnux32-gcc -DHAVE_CONFIG_H -I.  -Wall -Iinclude -I.. -I./include -I./src/sss_client -I./src -Iinclude -I.      -I/usr/include/dbus-1.0 -I/usr/libx32/dbus-1.0/include     -I/usr/include/libnl3  -I/usr/include/glib-2.0 -I/usr/libx32/glib-2.0/include  -DLIBDIR=\"/usr/libx32\" -DVARDIR=\"/var\" -DSSS_STATEDIR=\"/var/lib/sss\" -DSYSCONFDIR=\"/etc\" -DSHLIBEXT=\"\" -DSSSD_LIBEXEC_PATH=\"/usr/libexec/sssd\" -DSSSD_CONF_DIR=\"/etc/sssd\" -DSSS_NSS_MCACHE_DIR=\"/var/lib/sss/mc\" -DSSS_NSS_SOCKET_NAME=\"/var/lib/sss/pipes/nss\" -DSSS_PAM_SOCKET_NAME=\"/var/lib/sss/pipes/pam\" -DSSS_PAC_SOCKET_NAME=\"/var/lib/sss/pipes/pac\" -DSSS_PAM_PRIV_SOCKET_NAME=\"/var/lib/sss/pipes/private/pam\" -DSSS_SUDO_SOCKET_NAME=\"/var/lib/sss/pipes/sudo\" -DSSS_AUTOFS_SOCKET_NAME=\"/var/lib/sss/pipes/autofs\" -DSSS_SSH_SOCKET_NAME=\"/var/lib/sss/pipes/ssh\" -DLOCALEDIR=\"/usr/share/locale\" -DBASE_FILE_STEM=\"libsss_ad_la-ad_domain_info\"    -Wall -Wshadow -Wstrict-prototypes -Wpointer-arith -Wcast-qual -Wcast-align -Wwrite-strings -Wundef -Werror-implicit-function-declaration -Winit-self -fno-strict-aliasing -std=gnu99     -DHAVE_IMMEDIATE_STRUCTURES=1 -D_GNU_SOURCE=1 -DHAVE_IMMEDIATE_STRUCTURES=1 -D_GNU_SOURCE=1 -DHAVE_IMMEDIATE_STRUCTURES=1 -I/usr/include/samba-4.0 -I/usr/include/samba-4.0 -O2 -fwrapv -pipe -Wformat -Werror=format-security -gdwarf-4 -fno-debug-types-section -fvar-tracking-assignments -g2 -Wp,-D_FORTIFY_SOURCE=2 -fstack-protector-strong --param=ssp-buffer-size=4 -Werror=trampolines -fPIC -mtune=generic -march=x86-64 -gdwarf-4 -fno-debug-types-section -fvar-tracking-assignments -g2  -D_FILE_OFFSET_BITS=64 -D_LARGEFILE_SOURCE -D_LARGEFILE64_SOURCE -MT src/providers/ad/libsss_ad_la-ad_domain_info.lo -MD -MP -MF src/providers/ad/.deps/libsss_ad_la-ad_domain_info.Tpo -c -o src/providers/ad/libsss_ad_la-ad_domain_info.lo `test -f 'src/providers/ad/ad_domain_info.c' || echo './'`src/providers/ad/ad_domain_info.c
libtool: compile:  x86_64-pld-linux-gnux32-gcc -DHAVE_CONFIG_H -I. -Wall -Iinclude -I.. -I./include -I./src/sss_client -I./src -Iinclude -I. -I/usr/include/dbus-1.0 -I/usr/libx32/dbus-1.0/include -I/usr/include/libnl3 -I/usr/include/glib-2.0 -I/usr/libx32/glib-2.0/include -DLIBDIR=\"/usr/libx32\" -DVARDIR=\"/var\" -DSSS_STATEDIR=\"/var/lib/sss\" -DSYSCONFDIR=\"/etc\" -DSHLIBEXT=\"\" -DSSSD_LIBEXEC_PATH=\"/usr/libexec/sssd\" -DSSSD_CONF_DIR=\"/etc/sssd\" -DSSS_NSS_MCACHE_DIR=\"/var/lib/sss/mc\" -DSSS_NSS_SOCKET_NAME=\"/var/lib/sss/pipes/nss\" -DSSS_PAM_SOCKET_NAME=\"/var/lib/sss/pipes/pam\" -DSSS_PAC_SOCKET_NAME=\"/var/lib/sss/pipes/pac\" -DSSS_PAM_PRIV_SOCKET_NAME=\"/var/lib/sss/pipes/private/pam\" -DSSS_SUDO_SOCKET_NAME=\"/var/lib/sss/pipes/sudo\" -DSSS_AUTOFS_SOCKET_NAME=\"/var/lib/sss/pipes/autofs\" -DSSS_SSH_SOCKET_NAME=\"/var/lib/sss/pipes/ssh\" -DLOCALEDIR=\"/usr/share/locale\" -DBASE_FILE_STEM=\"libsss_ad_la-ad_domain_info\" -Wall -Wshadow -Wstrict-prototypes -Wpointer-arith -Wcast-qual -Wcast-align -Wwrite-strings -Wundef -Werror-implicit-function-declaration -Winit-self -fno-strict-aliasing -std=gnu99 -DHAVE_IMMEDIATE_STRUCTURES=1 -D_GNU_SOURCE=1 -DHAVE_IMMEDIATE_STRUCTURES=1 -D_GNU_SOURCE=1 -DHAVE_IMMEDIATE_STRUCTURES=1 -I/usr/include/samba-4.0 -I/usr/include/samba-4.0 -O2 -fwrapv -pipe -Wformat -Werror=format-security -gdwarf-4 -fno-debug-types-section -fvar-tracking-assignments -g2 -Wp,-D_FORTIFY_SOURCE=2 -fstack-protector-strong --param=ssp-buffer-size=4 -Werror=trampolines -fPIC -mtune=generic -march=x86-64 -gdwarf-4 -fno-debug-types-section -fvar-tracking-assignments -g2 -D_FILE_OFFSET_BITS=64 -D_LARGEFILE_SOURCE -D_LARGEFILE64_SOURCE -MT src/providers/ad/libsss_ad_la-ad_domain_info.lo -MD -MP -MF src/providers/ad/.deps/libsss_ad_la-ad_domain_info.Tpo -c src/providers/ad/ad_domain_info.c  -fPIC -DPIC -o src/providers/ad/.libs/libsss_ad_la-ad_domain_info.o
In file included from ./src/providers/krb5/krb5_common.h:34,
                 from ./src/providers/ldap/ldap_common.h:29,
                 from ./src/providers/ldap/sdap_idmap.h:27,
                 from src/providers/ad/ad_domain_info.c:33:
./src/util/sss_krb5.h:113:5: warning: "HAVE_KRB5_GET_INIT_CREDS_OPT_SET_FAST_FLAGS" is not defined, evaluates to 0 [-Wundef]
  113 | #if HAVE_KRB5_GET_INIT_CREDS_OPT_SET_FAST_FLAGS
      |     ^~~~~~~~~~~~~~~~~~~~~~~~~~~~~~~~~~~~~~~~~~~
mv -f src/providers/ad/.deps/libsss_ad_la-ad_domain_info.Tpo src/providers/ad/.deps/libsss_ad_la-ad_domain_info.Plo
make[2]: Leaving directory '/tmp/B.j8crwcva/BUILD/sssd-1.13.4'
make[2]: Entering directory '/tmp/B.j8crwcva/BUILD/sssd-1.13.4'
depbase=`echo src/sss_client/sudo/sss_sudo_response.lo | sed 's|[^/]*$|.deps/&|;s|\.lo$||'`;\
/bin/sh ./libtool  --tag=CC   --mode=compile x86_64-pld-linux-gnux32-gcc -DHAVE_CONFIG_H -I.  -Wall -Iinclude -I.. -I./include -I./src/sss_client -I./src -Iinclude -I.      -I/usr/include/dbus-1.0 -I/usr/libx32/dbus-1.0/include     -I/usr/include/libnl3  -I/usr/include/glib-2.0 -I/usr/libx32/glib-2.0/include  -DLIBDIR=\"/usr/libx32\" -DVARDIR=\"/var\" -DSSS_STATEDIR=\"/var/lib/sss\" -DSYSCONFDIR=\"/etc\" -DSHLIBEXT=\"\" -DSSSD_LIBEXEC_PATH=\"/usr/libexec/sssd\" -DSSSD_CONF_DIR=\"/etc/sssd\" -DSSS_NSS_MCACHE_DIR=\"/var/lib/sss/mc\" -DSSS_NSS_SOCKET_NAME=\"/var/lib/sss/pipes/nss\" -DSSS_PAM_SOCKET_NAME=\"/var/lib/sss/pipes/pam\" -DSSS_PAC_SOCKET_NAME=\"/var/lib/sss/pipes/pac\" -DSSS_PAM_PRIV_SOCKET_NAME=\"/var/lib/sss/pipes/private/pam\" -DSSS_SUDO_SOCKET_NAME=\"/var/lib/sss/pipes/sudo\" -DSSS_AUTOFS_SOCKET_NAME=\"/var/lib/sss/pipes/autofs\" -DSSS_SSH_SOCKET_NAME=\"/var/lib/sss/pipes/ssh\" -DLOCALEDIR=\"/usr/share/locale\" -DBASE_FILE_STEM=\"sss_sudo_response\"    -Wall -Wshadow -Wstrict-prototypes -Wpointer-arith -Wcast-qual -Wcast-align -Wwrite-strings -Wundef -Werror-implicit-function-declaration -Winit-self -fno-strict-aliasing -std=gnu99 -O2 -fwrapv -pipe -Wformat -Werror=format-security -gdwarf-4 -fno-debug-types-section -fvar-tracking-assignments -g2 -Wp,-D_FORTIFY_SOURCE=2 -fstack-protector-strong --param=ssp-buffer-size=4 -Werror=trampolines -fPIC -mtune=generic -march=x86-64 -gdwarf-4 -fno-debug-types-section -fvar-tracking-assignments -g2  -D_FILE_OFFSET_BITS=64 -D_LARGEFILE_SOURCE -D_LARGEFILE64_SOURCE -MT src/sss_client/sudo/sss_sudo_response.lo -MD -MP -MF $depbase.Tpo -c -o src/sss_client/sudo/sss_sudo_response.lo src/sss_client/sudo/sss_sudo_response.c &&\
mv -f $depbase.Tpo $depbase.Plo
libtool: compile:  x86_64-pld-linux-gnux32-gcc -DHAVE_CONFIG_H -I. -Wall -Iinclude -I.. -I./include -I./src/sss_client -I./src -Iinclude -I. -I/usr/include/dbus-1.0 -I/usr/libx32/dbus-1.0/include -I/usr/include/libnl3 -I/usr/include/glib-2.0 -I/usr/libx32/glib-2.0/include -DLIBDIR=\"/usr/libx32\" -DVARDIR=\"/var\" -DSSS_STATEDIR=\"/var/lib/sss\" -DSYSCONFDIR=\"/etc\" -DSHLIBEXT=\"\" -DSSSD_LIBEXEC_PATH=\"/usr/libexec/sssd\" -DSSSD_CONF_DIR=\"/etc/sssd\" -DSSS_NSS_MCACHE_DIR=\"/var/lib/sss/mc\" -DSSS_NSS_SOCKET_NAME=\"/var/lib/sss/pipes/nss\" -DSSS_PAM_SOCKET_NAME=\"/var/lib/sss/pipes/pam\" -DSSS_PAC_SOCKET_NAME=\"/var/lib/sss/pipes/pac\" -DSSS_PAM_PRIV_SOCKET_NAME=\"/var/lib/sss/pipes/private/pam\" -DSSS_SUDO_SOCKET_NAME=\"/var/lib/sss/pipes/sudo\" -DSSS_AUTOFS_SOCKET_NAME=\"/var/lib/sss/pipes/autofs\" -DSSS_SSH_SOCKET_NAME=\"/var/lib/sss/pipes/ssh\" -DLOCALEDIR=\"/usr/share/locale\" -DBASE_FILE_STEM=\"sss_sudo_response\" -Wall -Wshadow -Wstrict-prototypes -Wpointer-arith -Wcast-qual -Wcast-align -Wwrite-strings -Wundef -Werror-implicit-function-declaration -Winit-self -fno-strict-aliasing -std=gnu99 -O2 -fwrapv -pipe -Wformat -Werror=format-security -gdwarf-4 -fno-debug-types-section -fvar-tracking-assignments -g2 -Wp,-D_FORTIFY_SOURCE=2 -fstack-protector-strong --param=ssp-buffer-size=4 -Werror=trampolines -fPIC -mtune=generic -march=x86-64 -gdwarf-4 -fno-debug-types-section -fvar-tracking-assignments -g2 -D_FILE_OFFSET_BITS=64 -D_LARGEFILE_SOURCE -D_LARGEFILE64_SOURCE -MT src/sss_client/sudo/sss_sudo_response.lo -MD -MP -MF src/sss_client/sudo/.deps/sss_sudo_response.Tpo -c src/sss_client/sudo/sss_sudo_response.c  -fPIC -DPIC -o src/sss_client/sudo/.libs/sss_sudo_response.o
make[2]: Leaving directory '/tmp/B.j8crwcva/BUILD/sssd-1.13.4'
make[2]: Entering directory '/tmp/B.j8crwcva/BUILD/sssd-1.13.4'
/bin/sh ./libtool  --tag=CC   --mode=compile x86_64-pld-linux-gnux32-gcc -DHAVE_CONFIG_H -I.  -Wall -Iinclude -I.. -I./include -I./src/sss_client -I./src -Iinclude -I.      -I/usr/include/dbus-1.0 -I/usr/libx32/dbus-1.0/include     -I/usr/include/libnl3  -I/usr/include/glib-2.0 -I/usr/libx32/glib-2.0/include  -DLIBDIR=\"/usr/libx32\" -DVARDIR=\"/var\" -DSSS_STATEDIR=\"/var/lib/sss\" -DSYSCONFDIR=\"/etc\" -DSHLIBEXT=\"\" -DSSSD_LIBEXEC_PATH=\"/usr/libexec/sssd\" -DSSSD_CONF_DIR=\"/etc/sssd\" -DSSS_NSS_MCACHE_DIR=\"/var/lib/sss/mc\" -DSSS_NSS_SOCKET_NAME=\"/var/lib/sss/pipes/nss\" -DSSS_PAM_SOCKET_NAME=\"/var/lib/sss/pipes/pam\" -DSSS_PAC_SOCKET_NAME=\"/var/lib/sss/pipes/pac\" -DSSS_PAM_PRIV_SOCKET_NAME=\"/var/lib/sss/pipes/private/pam\" -DSSS_SUDO_SOCKET_NAME=\"/var/lib/sss/pipes/sudo\" -DSSS_AUTOFS_SOCKET_NAME=\"/var/lib/sss/pipes/autofs\" -DSSS_SSH_SOCKET_NAME=\"/var/lib/sss/pipes/ssh\" -DLOCALEDIR=\"/usr/share/locale\" -DBASE_FILE_STEM=\"libsss_ad_la-ad_subdomains\"    -Wall -Wshadow -Wstrict-prototypes -Wpointer-arith -Wcast-qual -Wcast-align -Wwrite-strings -Wundef -Werror-implicit-function-declaration -Winit-self -fno-strict-aliasing -std=gnu99     -DHAVE_IMMEDIATE_STRUCTURES=1 -D_GNU_SOURCE=1 -DHAVE_IMMEDIATE_STRUCTURES=1 -D_GNU_SOURCE=1 -DHAVE_IMMEDIATE_STRUCTURES=1 -I/usr/include/samba-4.0 -I/usr/include/samba-4.0 -O2 -fwrapv -pipe -Wformat -Werror=format-security -gdwarf-4 -fno-debug-types-section -fvar-tracking-assignments -g2 -Wp,-D_FORTIFY_SOURCE=2 -fstack-protector-strong --param=ssp-buffer-size=4 -Werror=trampolines -fPIC -mtune=generic -march=x86-64 -gdwarf-4 -fno-debug-types-section -fvar-tracking-assignments -g2  -D_FILE_OFFSET_BITS=64 -D_LARGEFILE_SOURCE -D_LARGEFILE64_SOURCE -MT src/providers/ad/libsss_ad_la-ad_subdomains.lo -MD -MP -MF src/providers/ad/.deps/libsss_ad_la-ad_subdomains.Tpo -c -o src/providers/ad/libsss_ad_la-ad_subdomains.lo `test -f 'src/providers/ad/ad_subdomains.c' || echo './'`src/providers/ad/ad_subdomains.c
libtool: compile:  x86_64-pld-linux-gnux32-gcc -DHAVE_CONFIG_H -I. -Wall -Iinclude -I.. -I./include -I./src/sss_client -I./src -Iinclude -I. -I/usr/include/dbus-1.0 -I/usr/libx32/dbus-1.0/include -I/usr/include/libnl3 -I/usr/include/glib-2.0 -I/usr/libx32/glib-2.0/include -DLIBDIR=\"/usr/libx32\" -DVARDIR=\"/var\" -DSSS_STATEDIR=\"/var/lib/sss\" -DSYSCONFDIR=\"/etc\" -DSHLIBEXT=\"\" -DSSSD_LIBEXEC_PATH=\"/usr/libexec/sssd\" -DSSSD_CONF_DIR=\"/etc/sssd\" -DSSS_NSS_MCACHE_DIR=\"/var/lib/sss/mc\" -DSSS_NSS_SOCKET_NAME=\"/var/lib/sss/pipes/nss\" -DSSS_PAM_SOCKET_NAME=\"/var/lib/sss/pipes/pam\" -DSSS_PAC_SOCKET_NAME=\"/var/lib/sss/pipes/pac\" -DSSS_PAM_PRIV_SOCKET_NAME=\"/var/lib/sss/pipes/private/pam\" -DSSS_SUDO_SOCKET_NAME=\"/var/lib/sss/pipes/sudo\" -DSSS_AUTOFS_SOCKET_NAME=\"/var/lib/sss/pipes/autofs\" -DSSS_SSH_SOCKET_NAME=\"/var/lib/sss/pipes/ssh\" -DLOCALEDIR=\"/usr/share/locale\" -DBASE_FILE_STEM=\"libsss_ad_la-ad_subdomains\" -Wall -Wshadow -Wstrict-prototypes -Wpointer-arith -Wcast-qual -Wcast-align -Wwrite-strings -Wundef -Werror-implicit-function-declaration -Winit-self -fno-strict-aliasing -std=gnu99 -DHAVE_IMMEDIATE_STRUCTURES=1 -D_GNU_SOURCE=1 -DHAVE_IMMEDIATE_STRUCTURES=1 -D_GNU_SOURCE=1 -DHAVE_IMMEDIATE_STRUCTURES=1 -I/usr/include/samba-4.0 -I/usr/include/samba-4.0 -O2 -fwrapv -pipe -Wformat -Werror=format-security -gdwarf-4 -fno-debug-types-section -fvar-tracking-assignments -g2 -Wp,-D_FORTIFY_SOURCE=2 -fstack-protector-strong --param=ssp-buffer-size=4 -Werror=trampolines -fPIC -mtune=generic -march=x86-64 -gdwarf-4 -fno-debug-types-section -fvar-tracking-assignments -g2 -D_FILE_OFFSET_BITS=64 -D_LARGEFILE_SOURCE -D_LARGEFILE64_SOURCE -MT src/providers/ad/libsss_ad_la-ad_subdomains.lo -MD -MP -MF src/providers/ad/.deps/libsss_ad_la-ad_subdomains.Tpo -c src/providers/ad/ad_subdomains.c  -fPIC -DPIC -o src/providers/ad/.libs/libsss_ad_la-ad_subdomains.o
In file included from ./src/providers/krb5/krb5_common.h:34,
                 from ./src/providers/ldap/ldap_common.h:29,
                 from ./src/providers/ad/ad_common.h:27,
                 from ./src/providers/ad/ad_subdomains.h:29,
                 from src/providers/ad/ad_subdomains.c:26:
./src/util/sss_krb5.h:113:5: warning: "HAVE_KRB5_GET_INIT_CREDS_OPT_SET_FAST_FLAGS" is not defined, evaluates to 0 [-Wundef]
  113 | #if HAVE_KRB5_GET_INIT_CREDS_OPT_SET_FAST_FLAGS
      |     ^~~~~~~~~~~~~~~~~~~~~~~~~~~~~~~~~~~~~~~~~~~
mv -f src/providers/ad/.deps/libsss_ad_la-ad_subdomains.Tpo src/providers/ad/.deps/libsss_ad_la-ad_subdomains.Plo
make[2]: Leaving directory '/tmp/B.j8crwcva/BUILD/sssd-1.13.4'
make[2]: Entering directory '/tmp/B.j8crwcva/BUILD/sssd-1.13.4'
/bin/sh ./libtool  --tag=CC   --mode=compile x86_64-pld-linux-gnux32-gcc -DHAVE_CONFIG_H -I.  -Wall -Iinclude -I.. -I./include -I./src/sss_client -I./src -Iinclude -I.      -I/usr/include/dbus-1.0 -I/usr/libx32/dbus-1.0/include     -I/usr/include/libnl3  -I/usr/include/glib-2.0 -I/usr/libx32/glib-2.0/include  -DLIBDIR=\"/usr/libx32\" -DVARDIR=\"/var\" -DSSS_STATEDIR=\"/var/lib/sss\" -DSYSCONFDIR=\"/etc\" -DSHLIBEXT=\"\" -DSSSD_LIBEXEC_PATH=\"/usr/libexec/sssd\" -DSSSD_CONF_DIR=\"/etc/sssd\" -DSSS_NSS_MCACHE_DIR=\"/var/lib/sss/mc\" -DSSS_NSS_SOCKET_NAME=\"/var/lib/sss/pipes/nss\" -DSSS_PAM_SOCKET_NAME=\"/var/lib/sss/pipes/pam\" -DSSS_PAC_SOCKET_NAME=\"/var/lib/sss/pipes/pac\" -DSSS_PAM_PRIV_SOCKET_NAME=\"/var/lib/sss/pipes/private/pam\" -DSSS_SUDO_SOCKET_NAME=\"/var/lib/sss/pipes/sudo\" -DSSS_AUTOFS_SOCKET_NAME=\"/var/lib/sss/pipes/autofs\" -DSSS_SSH_SOCKET_NAME=\"/var/lib/sss/pipes/ssh\" -DLOCALEDIR=\"/usr/share/locale\" -DBASE_FILE_STEM=\"libsss_ad_la-ad_gpo\"    -Wall -Wshadow -Wstrict-prototypes -Wpointer-arith -Wcast-qual -Wcast-align -Wwrite-strings -Wundef -Werror-implicit-function-declaration -Winit-self -fno-strict-aliasing -std=gnu99     -DHAVE_IMMEDIATE_STRUCTURES=1 -D_GNU_SOURCE=1 -DHAVE_IMMEDIATE_STRUCTURES=1 -D_GNU_SOURCE=1 -DHAVE_IMMEDIATE_STRUCTURES=1 -I/usr/include/samba-4.0 -I/usr/include/samba-4.0 -O2 -fwrapv -pipe -Wformat -Werror=format-security -gdwarf-4 -fno-debug-types-section -fvar-tracking-assignments -g2 -Wp,-D_FORTIFY_SOURCE=2 -fstack-protector-strong --param=ssp-buffer-size=4 -Werror=trampolines -fPIC -mtune=generic -march=x86-64 -gdwarf-4 -fno-debug-types-section -fvar-tracking-assignments -g2  -D_FILE_OFFSET_BITS=64 -D_LARGEFILE_SOURCE -D_LARGEFILE64_SOURCE -MT src/providers/ad/libsss_ad_la-ad_gpo.lo -MD -MP -MF src/providers/ad/.deps/libsss_ad_la-ad_gpo.Tpo -c -o src/providers/ad/libsss_ad_la-ad_gpo.lo `test -f 'src/providers/ad/ad_gpo.c' || echo './'`src/providers/ad/ad_gpo.c
libtool: compile:  x86_64-pld-linux-gnux32-gcc -DHAVE_CONFIG_H -I. -Wall -Iinclude -I.. -I./include -I./src/sss_client -I./src -Iinclude -I. -I/usr/include/dbus-1.0 -I/usr/libx32/dbus-1.0/include -I/usr/include/libnl3 -I/usr/include/glib-2.0 -I/usr/libx32/glib-2.0/include -DLIBDIR=\"/usr/libx32\" -DVARDIR=\"/var\" -DSSS_STATEDIR=\"/var/lib/sss\" -DSYSCONFDIR=\"/etc\" -DSHLIBEXT=\"\" -DSSSD_LIBEXEC_PATH=\"/usr/libexec/sssd\" -DSSSD_CONF_DIR=\"/etc/sssd\" -DSSS_NSS_MCACHE_DIR=\"/var/lib/sss/mc\" -DSSS_NSS_SOCKET_NAME=\"/var/lib/sss/pipes/nss\" -DSSS_PAM_SOCKET_NAME=\"/var/lib/sss/pipes/pam\" -DSSS_PAC_SOCKET_NAME=\"/var/lib/sss/pipes/pac\" -DSSS_PAM_PRIV_SOCKET_NAME=\"/var/lib/sss/pipes/private/pam\" -DSSS_SUDO_SOCKET_NAME=\"/var/lib/sss/pipes/sudo\" -DSSS_AUTOFS_SOCKET_NAME=\"/var/lib/sss/pipes/autofs\" -DSSS_SSH_SOCKET_NAME=\"/var/lib/sss/pipes/ssh\" -DLOCALEDIR=\"/usr/share/locale\" -DBASE_FILE_STEM=\"libsss_ad_la-ad_gpo\" -Wall -Wshadow -Wstrict-prototypes -Wpointer-arith -Wcast-qual -Wcast-align -Wwrite-strings -Wundef -Werror-implicit-function-declaration -Winit-self -fno-strict-aliasing -std=gnu99 -DHAVE_IMMEDIATE_STRUCTURES=1 -D_GNU_SOURCE=1 -DHAVE_IMMEDIATE_STRUCTURES=1 -D_GNU_SOURCE=1 -DHAVE_IMMEDIATE_STRUCTURES=1 -I/usr/include/samba-4.0 -I/usr/include/samba-4.0 -O2 -fwrapv -pipe -Wformat -Werror=format-security -gdwarf-4 -fno-debug-types-section -fvar-tracking-assignments -g2 -Wp,-D_FORTIFY_SOURCE=2 -fstack-protector-strong --param=ssp-buffer-size=4 -Werror=trampolines -fPIC -mtune=generic -march=x86-64 -gdwarf-4 -fno-debug-types-section -fvar-tracking-assignments -g2 -D_FILE_OFFSET_BITS=64 -D_LARGEFILE_SOURCE -D_LARGEFILE64_SOURCE -MT src/providers/ad/libsss_ad_la-ad_gpo.lo -MD -MP -MF src/providers/ad/.deps/libsss_ad_la-ad_gpo.Tpo -c src/providers/ad/ad_gpo.c  -fPIC -DPIC -o src/providers/ad/.libs/libsss_ad_la-ad_gpo.o
In file included from ./src/providers/krb5/krb5_common.h:34,
                 from ./src/providers/ldap/ldap_common.h:29,
                 from ./src/providers/ad/ad_common.h:27,
                 from src/providers/ad/ad_gpo.c:44:
./src/util/sss_krb5.h:113:5: warning: "HAVE_KRB5_GET_INIT_CREDS_OPT_SET_FAST_FLAGS" is not defined, evaluates to 0 [-Wundef]
  113 | #if HAVE_KRB5_GET_INIT_CREDS_OPT_SET_FAST_FLAGS
      |     ^~~~~~~~~~~~~~~~~~~~~~~~~~~~~~~~~~~~~~~~~~~
mv -f src/providers/ad/.deps/libsss_ad_la-ad_gpo.Tpo src/providers/ad/.deps/libsss_ad_la-ad_gpo.Plo
make[2]: Leaving directory '/tmp/B.j8crwcva/BUILD/sssd-1.13.4'
make[1]: *** [Makefile:20605: all-recursive] Error 1
make: *** [Makefile:7911: all] Error 2
error: Bad exit status from /tmp/B.j8crwcva/BUILD/tmp/rpm-tmp.CXu6fS (%build)


RPM build errors:
    line 309: second Description
    line 328: It's not recommended to have unversioned Obsoletes: Obsoletes:	libipa_hbac-python
    Macro expanded in comment on line 665: %{_sysconfdir}/rwtab.d/sssd

    Bad exit status from /tmp/B.j8crwcva/BUILD/tmp/rpm-tmp.CXu6fS (%build)
ended at: Sun Nov 21 09:06:36 2021, done in 0:01:19.846234
error: No files produced.
+ chmod -R u+rwX /tmp/B.j8crwcva/BUILD
+ rm -rf /tmp/B.j8crwcva/tmp /tmp/B.j8crwcva/BUILD
+ rm -rf /tmp/B.j8crwcva
Begin-PLD-Builder-Info
Build-Time: user:266.59s sys:83.05s real:82.60s (faults io:3827 non-io:17203116)

End-PLD-Builder-Info
[Back to list of logs] [View rpm -qa of builder]