FailedOk

th/SRPMS[OK]
th/x32[OK]
th/i686[OK]
th/x86_64[OK]

ac/SRPMS[OK]
ac/i386[OK]
ac/i586[OK]
ac/i686[OK]
ac/alpha[OK]
ac/amd64[OK]
ac/athlon[OK]
ac/ppc[OK]
ac/sparc[OK]
ac/sparc64[OK]

Advanced Search
main()
Powered by PLD Linux
(c) 2002-2024 PLD Team
$Revision: 1.37 $
Powered by The Right Thing.
Your IP: 44.192.44.30

systemtap 150e02b4-332b-4c7d-8ce4-9b310a2402ea

Status:Failed
Source URL:https://buildlogs.pld-linux.org/pld/th/x32/FAIL/systemtap,150e02b4-332b-4c7d-8ce4-9b310a2402ea.bz2
text/plain URL:View!
full text:View!
rpm -qa of builder:View!
Date:2024/06/30 22:34:35
Runtime:0:01:09.644085

Toc:

  • error 1
  • rpm: error: Failed build dependencies:
  • error 2
  • rpm: error: Failed build dependencies:
  • error 3
  • rpm: error: Failed build dependencies:
  • prep
  • Executing(%prep): /bin/sh -e /tmp/B.1d0q341v/BUILD/tmp/rpm-tmp.TTMABL
  • build
  • Executing(%build): /bin/sh -e /tmp/B.1d0q341v/BUILD/tmp/rpm-tmp.A3xuf7
  • error 4
  • client-http.cxx:707:21: error: 'CURLFORM_COPYNAME' is deprecated: since 7.56.0. Use curl_mime_name() [-Werror=deprecated-declarations]
  • error 5
  • client-http.cxx:708:21: error: 'CURLFORM_FILE' is deprecated: since 7.56.0. Use curl_mime_filedata() [-Werror=deprecated-declarations]
  • error 6
  • client-http.cxx:706:20: error: 'CURLFORMcode curl_formadd(curl_httppost**, curl_httppost**, ...)' is deprecated: since 7.56.0. Use curl_mime_init() [-Werror=deprecated-declarations]
  • error 7
  • client-http.cxx:711:21: error: 'CURLFORM_COPYNAME' is deprecated: since 7.56.0. Use curl_mime_name() [-Werror=deprecated-declarations]
  • error 8
  • client-http.cxx:712:21: error: 'CURLFORM_COPYCONTENTS' is deprecated: since 7.56.0. Use curl_mime_data() [-Werror=deprecated-declarations]
  • error 9
  • client-http.cxx:710:20: error: 'CURLFORMcode curl_formadd(curl_httppost**, curl_httppost**, ...)' is deprecated: since 7.56.0. Use curl_mime_init() [-Werror=deprecated-declarations]
  • error 10
  • client-http.cxx:762:7: error: 'CURLFORM_COPYNAME' is deprecated: since 7.56.0. Use curl_mime_name() [-Werror=deprecated-declarations]
  • error 11
  • client-http.cxx:763:7: error: 'CURLFORM_CONTENTTYPE' is deprecated: since 7.56.0. Use curl_mime_type() [-Werror=deprecated-declarations]
  • error 12
  • client-http.cxx:764:7: error: 'CURLFORM_COPYCONTENTS' is deprecated: since 7.56.0. Use curl_mime_data() [-Werror=deprecated-declarations]
  • error 13
  • client-http.cxx:761:16: error: 'CURLFORMcode curl_formadd(curl_httppost**, curl_httppost**, ...)' is deprecated: since 7.56.0. Use curl_mime_init() [-Werror=deprecated-declarations]
  • error 14
  • client-http.cxx:773:27: error: 'CURLOPT_HTTPPOST' is deprecated: since 7.56.0. Use CURLOPT_MIMEPOST [-Werror=deprecated-declarations]
  • error 15
  • client-http.cxx:843:17: error: 'void curl_formfree(curl_httppost*)' is deprecated: since 7.56.0. Use curl_mime_free() [-Werror=deprecated-declarations]
  • error 16
  • make[2]: *** [Makefile:1970: stap-client-http.o] Error 1
  • error 17
  • make[1]: *** [Makefile:2221: all-recursive] Error 1
  • error 18
  • error: Bad exit status from /tmp/B.1d0q341v/BUILD/tmp/rpm-tmp.A3xuf7 (%build)
  • error 19
  • RPM build errors:
  • error 20
  • error: No files produced.

Content:

checking if we should skip the build
started at: Sun Jun 30 22:33:05 2024
killing old processes on a builder
sending signal 9 to pid -1
cleaning up /tmp
fetching https://srcbuilder.pld-linux.org/th//srpms/150e02b4-332b-4c7d-8ce4-9b310a2402ea/systemtap-5.1-1.src.rpm
fetched 6591388 bytes, 11627.2 K/s
installing srpm: systemtap-5.1-1.src.rpm
+ install -d /tmp/B.1d0q341v/BUILD /tmp/B.1d0q341v/RPMS
+ LC_ALL=en_US.UTF-8
+ rpm -qp --changelog systemtap-5.1-1.src.rpm
* Sun Jun 30 2024 PLD Linux Team <feedback@pld-linux.org>
- For complete changelog see: http://git.pld-linux.org/?p=packages/systemtap.git;a=log;h=master
* Sun Jun 30 2024 Jakub Bogusz <qboosh@pld-linux.org> 55a861a
- updated to 5.1 * Tue Aug 08 2023 Jan Palus <atler@pld-linux.org> 2f987b6
- make sure python3 is preferred for dtrace * Tue Aug 08 2023 Jan Palus <atler@pld-linux.org> 7cbb091
- BR: ncurses-ext-devel for staprun * Tue Aug 08 2023 Jan Palus <atler@pld-linux.org> 54ada4b
- R: python3-modules S: python3-pyparsing in -sdt-devel for dtrace; rel 2 * Fri Jul 07 2023 Jan Palus <atler@pld-linux.org> e448505
- simplify jdk BR * Mon Jul 03 2023 Jan Palus <atler@pld-linux.org> 6d4da90
- disable dangling pointer warnings to fix build on i686 * Mon Jul 03 2023 Jan Palus <atler@pld-linux.org> 7560dce
- up to 4.9 * Mon Jul 03 2023 Jan Palus <atler@pld-linux.org> d621331
- fix build without doc * Mon Jul 03 2023 Jan Palus <atler@pld-linux.org> 11d61de
- do disable python probes when bcond is disabled * Mon Jul 03 2023 Jan Palus <atler@pld-linux.org> 67274bf
- BR: elfutils-debuginfod-devel * Mon Jul 03 2023 Jan Palus <atler@pld-linux.org> 24046c3
- java dir not used to find binaries, pass them explicitly * Mon Jul 03 2023 Jan Palus <atler@pld-linux.org> 60f1f91
- switch to %use_default_jdk * Wed Mar 01 2023 Jakub Bogusz <qboosh@pld-linux.org> 104281f
- use arm macro, release 3 (dyninst 12.3.x) * Sun Feb 19 2023 Jan Palus <atler@pld-linux.org> 49b3700
- boost rebuild * Sat Dec 24 2022 Jakub Bogusz <qboosh@pld-linux.org> b7d1566
- release 1 * Fri Dec 23 2022 Jakub Bogusz <qboosh@pld-linux.org> ef8f36a
- exporter subpackage - added systemd patch to adjust systemd unit file location * Thu Dec 22 2022 Jakub Bogusz <qboosh@pld-linux.org> 8f03482
- added dyninst patch (adjust dyninst linking) - initial files update * Sun Dec 18 2022 Jan Rękorajski <baggins@pld-linux.org> fcc0f9e
- updated to 4.8 * Sat Mar 26 2022 Jan Rękorajski <baggins@pld-linux.org> f75079b
- rebuild with python 3.10 * Mon Dec 20 2021 Jan Palus <atler@pld-linux.org> c27aa78
- dyninst rebuild + rpm -Uhv --nodeps --define '_topdir /tmp/B.1d0q341v' --define '_specdir %{_topdir}' --define '_sourcedir %{_specdir}' --define '_rpmdir %{_topdir}/RPMS' --define '_builddir %{_topdir}/BUILD' systemtap-5.1-1.src.rpm Updating / installing... systemtap-5.1-1 ######################################## + rm -f systemtap-5.1-1.src.rpm + install -m 700 -d /tmp/B.1d0q341v/BUILD/tmp + TMPDIR=/tmp/B.1d0q341v/BUILD/tmp + exec nice -n 0 rpmbuild -bp --short-circuit --nodeps --define '_topdir /tmp/B.1d0q341v' --define '_specdir %{_topdir}' --define '_sourcedir %{_specdir}' --define '_rpmdir %{_topdir}/RPMS' --define '_builddir %{_topdir}/BUILD' --target x32-pld-linux --define 'prep exit 0' /tmp/B.1d0q341v/systemtap.spec Building target platforms: x32-pld-linux Building for target x32-pld-linux checking BuildConflict-ing packages rpm: error: Failed build dependencies: rpm: latex2html is needed by systemtap-5.1-1.x32 rpm: Building target platforms: x32-pld-linux rpm: Building for target x32-pld-linux no BuildConflicts found checking BR rpm: error: Failed build dependencies: rpm: latex2html is needed by systemtap-5.1-1.x32 rpm: Building target platforms: x32-pld-linux rpm: Building for target x32-pld-linux updating poldek cache... ready is up to date th is up to date th is up to date th-ready is up to date th-ready is up to date Retrieving diff::packages.ndir.2024.06.30-18.55.01.gz......................................done Loading [pndir]th-test... Applying packages.ndir.2024.06.30-18.55.01.gz... Writing /root/.cache/poldek/[...]/packages.ndir.gz... Retrieving th-test::packages.ndir.diff.toc.gz..............................................done Retrieving diff::packages.ndir.2024.06.30-18.56.01.gz......................................done Retrieving diff::packages.ndir.dscr.2024.06.30-18.56.01.gz.................................done Loading [pndir]th-test... Applying packages.ndir.2024.06.30-18.56.01.gz... Retrieving diff::packages.ndir.2024.06.30-19.22.01.gz......................................done Applying packages.ndir.2024.06.30-19.22.01.gz... Writing /root/.cache/poldek/[...]/packages.ndir.gz... checking conflicting packages in BRed packages poldek: Loading [pndir]ready... poldek: Loading [pndir]th-test... poldek: Loading [pndir]th-test... poldek: Loading [pndir]th-ready... poldek: Loading [pndir]th-ready... poldek: Loading [pndir]th... poldek: Loading [pndir]th... poldek: 35419 packages read poldek: Removed 5217 duplicate packages from available set poldek: Processing dependencies... poldek: latex2html-2008-2.noarch marks netpbm-progs-10.73.43-1.x32 (cap netpbm-progs) poldek: There are 2 packages to install (1 marked by dependencies): poldek: A latex2html-2008-2.noarch netpbm-progs-10.73.43-1.x32 poldek: This operation will use 9.6MB of disk space. poldek: Need to get 1.9MB of archives (1.9MB to download). poldek: poldek: Retrieving [1/2] th::netpbm-progs-10.73.43-1.x32.rpm.......................................done poldek: netpbm-progs-10.73.43-1.x32.rpm: digests OK poldek: Retrieving [2/2] th::latex2html-2008-2.noarch.rpm..........................................done poldek: latex2html-2008-2.noarch.rpm: digests OK poldek: Executing pm-command.sh --upgrade -vh --test --root / --define _check_dirname_deps 0... poldek: warning: /root/.cache/poldek/ftp_ftp1.pld-linux.org.dists.th.PLD.x32.RPMS/netpbm-progs-10.73.43-1.x32.rpm: Header V4 DSA/SHA1 Signature, key ID e4f1bc2d: NOKEY poldek: Verifying... ######################################## poldek: Preparing... ######################################## no conflicts found checking BR rpm: error: Failed build dependencies: rpm: latex2html is needed by systemtap-5.1-1.x32 rpm: Building target platforms: x32-pld-linux rpm: Building for target x32-pld-linux installing BR: latex2html + poldek --noask --caplookup -Q -v '--ignore=hhvm-*' '--ignore=php4-*' '--ignore=php52-*' '--ignore=php54-*' '--ignore=php55-*' '--ignore=php56-*' '--ignore=php70-*' '--ignore=php71-*' '--ignore=php72-*' '--ignore=php73-*' '--ignore=php74-*' '--ignore=php80-*' '--ignore=php81-*' '--ignore=php82-*' --upgrade latex2html Loading [pndir]ready... Loading [pndir]th-test... Loading [pndir]th-test... Loading [pndir]th-ready... Loading [pndir]th-ready... Loading [pndir]th... Loading [pndir]th... 35419 packages read Removed 5217 duplicate packages from available set Processing dependencies... latex2html-2008-2.noarch marks netpbm-progs-10.73.43-1.x32 (cap netpbm-progs) There are 2 packages to install (1 marked by dependencies): A latex2html-2008-2.noarch netpbm-progs-10.73.43-1.x32 This operation will use 9.6MB of disk space. latex2html-2008-2.noarch.rpm: digests OK netpbm-progs-10.73.43-1.x32.rpm: digests OK Need to get 1.9MB of archives. netpbm-progs-10.73.43-1.x32.rpm: digests OK latex2html-2008-2.noarch.rpm: digests OK Executing pm-command.sh --upgrade -vh --root / --define _check_dirname_deps 0... warning: /root/.cache/poldek/ftp_ftp1.pld-linux.org.dists.th.PLD.x32.RPMS/netpbm-progs-10.73.43-1.x32.rpm: Header V4 DSA/SHA1 Signature, key ID e4f1bc2d: NOKEY Verifying... ######################################## Preparing... ######################################## Updating / installing... netpbm-progs-10.73.43-1 ######################################## latex2html-2008-2 ######################################## building RPM using: set -ex; : build-id: 150e02b4-332b-4c7d-8ce4-9b310a2402ea; TMPDIR=/tmp/B.1d0q341v/BUILD/tmp exec nice -n 0 rpmbuild -bb --define '__jobs 28' --define '_smp_mflags -j28' --define '_make_opts -Otarget' --define '_pld_builder 1' --define '_topdir /tmp/B.1d0q341v' --define '_specdir %{_topdir}' --define '_sourcedir %{_specdir}' --define '_rpmdir %{_topdir}/RPMS' --define '_builddir %{_topdir}/BUILD' --target x32-pld-linux /tmp/B.1d0q341v/systemtap.spec + : build-id: 150e02b4-332b-4c7d-8ce4-9b310a2402ea + TMPDIR=/tmp/B.1d0q341v/BUILD/tmp + exec nice -n 0 rpmbuild -bb --define '__jobs 28' --define '_smp_mflags -j28' --define '_make_opts -Otarget' --define '_pld_builder 1' --define '_topdir /tmp/B.1d0q341v' --define '_specdir %{_topdir}' --define '_sourcedir %{_specdir}' --define '_rpmdir %{_topdir}/RPMS' --define '_builddir %{_topdir}/BUILD' --target x32-pld-linux /tmp/B.1d0q341v/systemtap.spec Building target platforms: x32-pld-linux Building for target x32-pld-linux Executing(%prep): /bin/sh -e /tmp/B.1d0q341v/BUILD/tmp/rpm-tmp.TTMABL + umask 022 + cd /tmp/B.1d0q341v/BUILD + cd /tmp/B.1d0q341v/BUILD + rm -rf systemtap-5.1 + /bin/gzip -dc /tmp/B.1d0q341v/systemtap-5.1.tar.gz + /bin/tar -xof - + STATUS=0 + '[' 0 -ne 0 ']' + cd systemtap-5.1 + /bin/chmod -Rf a+rX,u+w,g-w,o-w . + echo 'Patch #0 (systemtap-dyninst.patch):' Patch #0 (systemtap-dyninst.patch): + </tmp/B.1d0q341v/systemtap-dyninst.patch + /usr/bin/patch -s -f -p1 '--fuzz=0' + echo 'Patch #1 (systemtap-systemd.patch):' Patch #1 (systemtap-systemd.patch): + </tmp/B.1d0q341v/systemtap-systemd.patch + /usr/bin/patch -s -f -p1 '--fuzz=0' + echo 'Patch #3 (systemtap-nss.patch):' Patch #3 (systemtap-nss.patch): + </tmp/B.1d0q341v/systemtap-nss.patch + /usr/bin/patch -s -f -p1 '--fuzz=0' + echo 'Patch #4 (systemtap-types.patch):' Patch #4 (systemtap-types.patch): + </tmp/B.1d0q341v/systemtap-types.patch + /usr/bin/patch -s -f -p1 '--fuzz=0' + echo 'Patch #5 (systemtap-install.patch):' Patch #5 (systemtap-install.patch): + </tmp/B.1d0q341v/systemtap-install.patch + /usr/bin/patch -s -f -p1 '--fuzz=0' + /bin/sed -E -i -e '1s,#!\s*/usr/bin/python(\s|$),#!/usr/bin/python2\1,' testsuite/systemtap.examples/general/pyexample.py + find testsuite/systemtap.examples/ -name '*.stp' -print0 + xargs -0 /bin/sed -E -i -e '1s,#!\s*/usr/bin/env\s+stap(\s|$),#!/usr/bin/stap\1,' + /bin/sed -i -e 's,/usr/bim/python$,/usr/bin/python3,' httpd/docker/fedora_install_package.py + RPM_EC=0 + jobs -p + exit 0 Executing(%build): /bin/sh -e /tmp/B.1d0q341v/BUILD/tmp/rpm-tmp.A3xuf7 HOME=/home/users/builder PATH=/home/users/builder/GNUstep/Tools:/bin:/usr/bin:/usr/local/bin TMPDIR=/tmp/B.1d0q341v/BUILD/tmp + umask 022 + cd /tmp/B.1d0q341v/BUILD + cd systemtap-5.1 + gettextize --copy --force --no-changelog Copying file ABOUT-NLS Copying file config.rpath Copying file po/Makefile.in.in Copying file po/Makevars.template Copying file po/Rules-quot Copying file po/boldquot.sed Copying file po/en@boldquot.header Copying file po/en@quot.header Copying file po/insert-header.sin Copying file po/quot.sed Copying file po/remove-potcdate.sin Copying file m4/build-to-host.m4 Copying file m4/gettext.m4 Copying file m4/host-cpu-c-abi.m4 Copying file m4/iconv.m4 Copying file m4/intlmacosx.m4 Copying file m4/lib-ld.m4 Copying file m4/lib-link.m4 Copying file m4/lib-prefix.m4 Copying file m4/nls.m4 Copying file m4/po.m4 Copying file m4/progtest.m4 Updating configure.ac (backup is in configure.ac~) Please run 'aclocal -I m4' to regenerate the aclocal.m4 file. You need aclocal from GNU automake 1.9 (or newer) to do this. Then run 'autoconf' to regenerate the configure file. You might also want to copy the convenience header file gettext.h from the /usr/share/gettext directory into your package. It is a wrapper around <libintl.h> that implements the configure --disable-nls option. + '[' ! -f po/Makevars ']' + aclocal -I m4 + autoconf + autoheader + automake -a -c -f --foreign + ./configure 'LDFLAGS=-Wl,--as-needed -Wl,--no-copy-dt-needed-entries -Wl,-z,relro -Wl,-z,combreloc ' 'CFLAGS=-O2 -fwrapv -pipe -Wformat -Werror=format-security -gdwarf-4 -fno-debug-types-section -fvar-tracking-assignments -g2 -Wp,-D_FORTIFY_SOURCE=2 -fstack-protector-strong --param=ssp-buffer-size=4 -Werror=trampolines -fPIC -mtune=generic -march=x86-64 -gdwarf-4 -fno-debug-types-section -fvar-tracking-assignments -g2 ' 'CXXFLAGS=-O2 -fwrapv -pipe -Wformat -Werror=format-security -gdwarf-4 -fno-debug-types-section -fvar-tracking-assignments -g2 -Wp,-D_FORTIFY_SOURCE=2 -fstack-protector-strong --param=ssp-buffer-size=4 -Werror=trampolines -fPIC -mtune=generic -march=x86-64 -gdwarf-4 -fno-debug-types-section -fvar-tracking-assignments -g2 ' 'FFLAGS=-O2 -fwrapv -pipe -Wformat -Werror=format-security -gdwarf-4 -fno-debug-types-section -fvar-tracking-assignments -g2 -Wp,-D_FORTIFY_SOURCE=2 -fstack-protector-strong --param=ssp-buffer-size=4 -Werror=trampolines -fPIC -mtune=generic -march=x86-64 -gdwarf-4 -fno-debug-types-section -fvar-tracking-assignments -g2 ' 'FCFLAGS=-O2 -fwrapv -pipe -Wformat -Werror=format-security -gdwarf-4 -fno-debug-types-section -fvar-tracking-assignments -g2 -Wp,-D_FORTIFY_SOURCE=2 -fstack-protector-strong --param=ssp-buffer-size=4 -Werror=trampolines -fPIC -mtune=generic -march=x86-64 -gdwarf-4 -fno-debug-types-section -fvar-tracking-assignments -g2 ' 'CPPFLAGS=' 'CC=x86_64-pld-linux-gnux32-gcc' 'CXX=x86_64-pld-linux-gnux32-g++' '--host=x86_64-pld-linux-gnux32' '--build=x86_64-pld-linux-gnux32' '--prefix=/usr' '--exec-prefix=/usr' '--bindir=/usr/bin' '--sbindir=/usr/sbin' '--sysconfdir=/etc' '--datadir=/usr/share' '--includedir=/usr/include' '--libdir=/usr/libx32' '--libexecdir=/usr/libexec' '--localstatedir=/var' '--sharedstatedir=/var/lib' '--mandir=/usr/share/man' '--infodir=/usr/share/info' '--x-libraries=/usr/libx32' 'CXXFLAGS=-O2 -fwrapv -pipe -Wformat -Werror=format-security -gdwarf-4 -fno-debug-types-section -fvar-tracking-assignments -g2 -Wp,-D_FORTIFY_SOURCE=2 -fstack-protector-strong --param=ssp-buffer-size=4 -Werror=trampolines -fPIC -mtune=generic -march=x86-64 -gdwarf-4 -fno-debug-types-section -fvar-tracking-assignments -g2 -Wno-dangling-pointer' 'have_javac=/usr/libx32/jvm/openjdk11/bin/javac' 'have_jar=/usr/libx32/jvm/openjdk11/bin/jar' --disable-silent-rules --enable-crash --enable-docs --enable-http --enable-pie --enable-server --enable-sqlite --with-dyninst '--with-java=/usr/libx32/jvm/openjdk11' --with-python3 checking build system type... x86_64-pld-linux-gnux32 checking host system type... x86_64-pld-linux-gnux32 checking target system type... x86_64-pld-linux-gnux32 checking for a BSD-compatible install... /usr/bin/install -c checking whether build environment is sane... yes checking for a race-free mkdir -p... /bin/mkdir -p checking for mawk... mawk checking whether make sets $(MAKE)... yes checking whether make supports nested variables... yes checking whether to enable maintainer-specific portions of Makefiles... no checking whether make supports nested variables... (cached) yes checking for x86_64-pld-linux-gnux32-pkg-config... /usr/bin/x86_64-pld-linux-gnux32-pkg-config checking pkg-config is at least version 0.9.0... yes checking whether make supports the include directive... yes (GNU style) checking for x86_64-pld-linux-gnux32-gcc... x86_64-pld-linux-gnux32-gcc checking whether the C compiler works... yes checking for C compiler default output file name... a.out checking for suffix of executables... checking whether we are cross compiling... no checking for suffix of object files... o checking whether the compiler supports GNU C... yes checking whether x86_64-pld-linux-gnux32-gcc accepts -g... yes checking for x86_64-pld-linux-gnux32-gcc option to enable C11 features... none needed checking whether x86_64-pld-linux-gnux32-gcc understands -c and -o together... yes checking dependency style of x86_64-pld-linux-gnux32-gcc... gcc3 checking for stdio.h... yes checking for stdlib.h... yes checking for string.h... yes checking for inttypes.h... yes checking for stdint.h... yes checking for strings.h... yes checking for sys/stat.h... yes checking for sys/types.h... yes checking for unistd.h... yes checking for wchar.h... yes checking for minix/config.h... no checking whether it is safe to define __EXTENSIONS__... yes checking whether _XOPEN_SOURCE should be defined... no checking whether ln -s works... yes checking for x86_64-pld-linux-gnux32-gcc... (cached) x86_64-pld-linux-gnux32-gcc checking whether the compiler supports GNU C... (cached) yes checking whether x86_64-pld-linux-gnux32-gcc accepts -g... (cached) yes checking for x86_64-pld-linux-gnux32-gcc option to enable C11 features... (cached) none needed checking whether x86_64-pld-linux-gnux32-gcc understands -c and -o together... (cached) yes checking dependency style of x86_64-pld-linux-gnux32-gcc... (cached) gcc3 checking whether the compiler supports GNU C++... yes checking whether x86_64-pld-linux-gnux32-g++ accepts -g... yes checking for x86_64-pld-linux-gnux32-g++ option to enable C++11 features... none needed checking dependency style of x86_64-pld-linux-gnux32-g++... gcc3 checking how to run the C preprocessor... x86_64-pld-linux-gnux32-gcc -E checking for x86_64-pld-linux-gnux32-ar... no checking for x86_64-pld-linux-gnux32-lib... no checking for x86_64-pld-linux-gnux32-link... no checking for ar... ar checking the archiver (ar) interface... ar checking for x86_64-pld-linux-gnux32-ranlib... no checking for ranlib... ranlib checking whether make sets $(MAKE)... (cached) yes checking for option for large files... none needed checking for ppoll... yes checking for openat... yes checking for a sed that does not truncate output... /bin/sed checking whether NLS is requested... yes checking for msgfmt... /usr/bin/msgfmt checking for gmsgfmt... /usr/bin/msgfmt checking for xgettext... /usr/bin/xgettext checking for msgmerge... /usr/bin/msgmerge checking for ld used by x86_64-pld-linux-gnux32-gcc... /usr/bin/ld checking if the linker (/usr/bin/ld) is GNU ld... yes checking for shared library run path origin... done checking 32-bit host C ABI... yes checking for egrep -e... /bin/grep -E checking for ELF binary format... yes checking for the common suffixes of directories in the library search path... lib,lib,lib checking for CFPreferencesCopyAppValue... no checking for CFLocaleCopyPreferredLanguages... no checking for GNU gettext in libc... yes checking whether to use NLS... yes checking where the gettext function comes from... libc checking for python... /usr/bin/python checking whether /usr/bin/python is version 2 or 3... 3 checking for a Python interpreter with version >= 2.6... python2 checking for python2... /usr/bin/python2 checking for python2 version... 2.7 checking for python2 platform... linux2 checking for GNU default python2 prefix... ${prefix} checking for GNU default python2 exec_prefix... ${exec_prefix} checking for python2 script directory (pythondir)... ${PYTHON_PREFIX}/share/python2.7/site-packages checking for python2 extension module directory (pyexecdir)... ${PYTHON_EXEC_PREFIX}/libx32/python2.7/site-packages checking for python3... /usr/bin/python3 checking for python3 version... 3.1 checking for python3 platform... linux checking for python3 script directory... ${prefix}/libx32/python3.10/site-packages checking for python3 extension module directory... ${exec_prefix}/libx32/python3.10/site-packages checking whether to build with -Werror... yes checking to see if prologue searching should be the default... no checking to see if sdt probes should be the default... yes checking whether x86_64-pld-linux-gnux32-g++ supports C++11 features by default... yes checking whether C++ compiler accepts -faligned-new... yes checking whether to use debuginfod... checking for debuginfod... yes checking for debuginfod_find_metadata in -ldebuginfod... no checking for sqlite3... yes checking for crash/defs.h... yes checking for latex... yes checking for dvips... yes checking for ps2pdf... yes checking for xmlto... yes checking for fop... no checking for xmlto --stringparam support... yes checking for nss... yes checking for openssl... yes configure: using dracut module directory /usr/lib/dracut/modules.d/99stap configure: using dracut binary /sbin checking for avahi... yes checking for rpmtsInitIterator in -lrpm... yes checking for rpmdbNextIterator in -lrpmdb... no checking for rpmFreeCrypto in -lrpmio... yes checking for stdatomic.h... yes checking for rpm/rpmcrypto.h... no checking how to link readline libs... -lreadline checking for ebl_strtabinit in -lebl... no checking for dwfl_module_getsym in -ldw... yes checking for dwarf_next_unit in -ldw... yes configure: stap will link -lc -lrpm -lc -lrpmio -Wl,--start-group -ldw -Wl,--end-group -lelf checking for elf_getshdrstrndx in -lelf... yes configure: staprun will link -lelf configure: stapbpf will link -lelf checking for boost/utility/string_ref.hpp... yes checking need for -lboost_system library... yup checking for TBB_runtime_interface_version in -ltbb... yes configure: checking dyninst support checking for dyninst/BPatch_object.h... yes configure: dyninst support available checking for libvirt... yes checking for libxml2... yes checking for python2-config... /usr/bin/python2-config checking for Python.h... yes checking for python3-config... /usr/bin/python3-config checking for Python.h... yes checking for jsonc... yes checking for ncurses... yes checking to see if the language server is supported... yes checking for assembler .section "?" flags support... yes checking for x86_64-pld-linux-gnux32-gcc options needed to detect all undeclared functions... none needed checking whether BPF_PROG_TYPE_PERF_EVENT is declared... yes checking whether BPF_PROG_TYPE_RAW_TRACEPOINT is declared... yes checking for selinux... yes checking whether F_SETPIPE_SZ is declared... yes checking for javac... /usr/libx32/jvm/openjdk11/bin/javac checking for jar... /usr/libx32/jvm/openjdk11/bin/jar java found, will try to configure Byteman support configure: Adding extra version checking for libmicrohttpd... yes checking for uuid... yes checking for libcurl... yes checking that generated files are newer than configure... done configure: creating ./config.status config.status: creating includes/sys/sdt-config.h config.status: creating po/Makefile.in config.status: creating Makefile config.status: creating doc/Makefile config.status: creating man/Makefile config.status: creating man/cs/Makefile config.status: creating doc/beginners/Makefile config.status: creating doc/SystemTap_Tapset_Reference/Makefile config.status: creating man/stap.1 config.status: creating man/stappaths.7 config.status: creating man/systemtap-service.8 config.status: creating man/cs/stap.1 config.status: creating man/cs/stappaths.7 config.status: creating man/cs/systemtap.8 config.status: creating initscript/config.systemtap config.status: creating initscript/config.stap-server config.status: creating initscript/systemtap config.status: creating initscript/stap-server config.status: creating initscript/99stap/module-setup.sh config.status: creating initscript/99stap/install config.status: creating initscript/99stap/check config.status: creating run-stap config.status: creating dtrace config.status: creating stapdyn/Makefile config.status: creating java/Makefile config.status: creating java/stapbm config.status: creating java/org/systemtap/byteman/helper/HelperSDT.java config.status: creating python/Makefile config.status: creating interactive-notebook/Makefile config.status: creating interactive-notebook/stap-jupyter-container config.status: creating interactive-notebook/stap-jupyter-install config.status: creating staprun/Makefile config.status: creating stapbpf/Makefile config.status: creating httpd/Makefile config.status: creating httpd/docker/Makefile config.status: creating staprun/run-staprun config.status: creating staprun/guest/stapshd config.status: creating staprun/guest/stapsh-daemon config.status: creating staprun/guest/stapsh@.service config.status: creating stap-exporter/Makefile config.status: creating stap-profile-annotate config.status: creating config.h config.status: executing depfiles commands config.status: executing po-directories commands config.status: creating po/POTFILES config.status: creating po/Makefile config.status: executing doc/beginners commands === configuring in testsuite (/tmp/B.1d0q341v/BUILD/systemtap-5.1/testsuite) configure: running /bin/sh ./configure --disable-option-checking '--prefix=/usr' 'LDFLAGS=-Wl,--as-needed -Wl,--no-copy-dt-needed-entries -Wl,-z,relro -Wl,-z,combreloc ' 'CFLAGS=-O2 -fwrapv -pipe -Wformat -Werror=format-security -gdwarf-4 -fno-debug-types-section -fvar-tracking-assignments -g2 -Wp,-D_FORTIFY_SOURCE=2 -fstack-protector-strong --param=ssp-buffer-size=4 -Werror=trampolines -fPIC -mtune=generic -march=x86-64 -gdwarf-4 -fno-debug-types-section -fvar-tracking-assignments -g2 ' 'CXXFLAGS=-O2 -fwrapv -pipe -Wformat -Werror=format-security -gdwarf-4 -fno-debug-types-section -fvar-tracking-assignments -g2 -Wp,-D_FORTIFY_SOURCE=2 -fstack-protector-strong --param=ssp-buffer-size=4 -Werror=trampolines -fPIC -mtune=generic -march=x86-64 -gdwarf-4 -fno-debug-types-section -fvar-tracking-assignments -g2 ' 'FFLAGS=-O2 -fwrapv -pipe -Wformat -Werror=format-security -gdwarf-4 -fno-debug-types-section -fvar-tracking-assignments -g2 -Wp,-D_FORTIFY_SOURCE=2 -fstack-protector-strong --param=ssp-buffer-size=4 -Werror=trampolines -fPIC -mtune=generic -march=x86-64 -gdwarf-4 -fno-debug-types-section -fvar-tracking-assignments -g2 ' 'FCFLAGS=-O2 -fwrapv -pipe -Wformat -Werror=format-security -gdwarf-4 -fno-debug-types-section -fvar-tracking-assignments -g2 -Wp,-D_FORTIFY_SOURCE=2 -fstack-protector-strong --param=ssp-buffer-size=4 -Werror=trampolines -fPIC -mtune=generic -march=x86-64 -gdwarf-4 -fno-debug-types-section -fvar-tracking-assignments -g2 ' 'CPPFLAGS=' 'CC=x86_64-pld-linux-gnux32-gcc' 'CXX=x86_64-pld-linux-gnux32-g++' '--host=x86_64-pld-linux-gnux32' '--build=x86_64-pld-linux-gnux32' '--exec-prefix=/usr' '--bindir=/usr/bin' '--sbindir=/usr/sbin' '--sysconfdir=/etc' '--datadir=/usr/share' '--includedir=/usr/include' '--libdir=/usr/libx32' '--libexecdir=/usr/libexec' '--localstatedir=/var' '--sharedstatedir=/var/lib' '--mandir=/usr/share/man' '--infodir=/usr/share/info' '--x-libraries=/usr/libx32' 'CXXFLAGS=-O2 -fwrapv -pipe -Wformat -Werror=format-security -gdwarf-4 -fno-debug-types-section -fvar-tracking-assignments -g2 -Wp,-D_FORTIFY_SOURCE=2 -fstack-protector-strong --param=ssp-buffer-size=4 -Werror=trampolines -fPIC -mtune=generic -march=x86-64 -gdwarf-4 -fno-debug-types-section -fvar-tracking-assignments -g2 -Wno-dangling-pointer' 'have_javac=/usr/libx32/jvm/openjdk11/bin/javac' 'have_jar=/usr/libx32/jvm/openjdk11/bin/jar' '--disable-silent-rules' '--enable-crash' '--enable-docs' '--enable-http' '--enable-pie' '--enable-server' '--enable-sqlite' '--with-dyninst' '--with-java=/usr/libx32/jvm/openjdk11' '--with-python3' 'build_alias=x86_64-pld-linux-gnux32' 'host_alias=x86_64-pld-linux-gnux32' 'PKG_CONFIG_PATH=:/usr/libx32/pkgconfig:/usr/share/pkgconfig' 'python=/usr/bin/python2' 'pyexecdir=${PYTHON_EXEC_PREFIX}/libx32/python2.7/site-packages' 'python3=/usr/bin/python3' 'py3execdir=${exec_prefix}/libx32/python3.10/site-packages' --cache-file=/dev/null --srcdir=. checking for a BSD-compatible install... /usr/bin/install -c checking whether build environment is sane... yes checking for a race-free mkdir -p... /bin/mkdir -p checking for gawk... gawk checking whether make sets $(MAKE)... yes checking whether make supports nested variables... yes checking whether to enable maintainer-specific portions of Makefiles... no configure: Will test no apps from: xulrunner tcl profile-annotate postgres mysql java checking that generated files are newer than configure... done configure: creating ./config.status config.status: creating Makefile + /usr/bin/make -Otarget -j28 'JAVAC=/usr/libx32/jvm/openjdk11/bin/javac' 'JAR=/usr/libx32/jvm/openjdk11/bin/jar' sed -e "s#@pkgdatadir@#/usr/share/systemtap#g" < macros.systemtap.in > macros.systemtap /bin/sh ./git_version.sh -k -s . -o git_version.h git_version.sh: Output is new file, creating git_version.h /usr/bin/make all-recursive Making all in . make[2]: Entering directory '/tmp/B.1d0q341v/BUILD/systemtap-5.1' x86_64-pld-linux-gnux32-gcc -DHAVE_CONFIG_H -I. -DBINDIR='"/usr/bin"' -DSYSCONFDIR='"/etc"' -DPKGDATADIR='"/usr/share/systemtap"' -DPKGLIBDIR='"/usr/libexec/systemtap"' -DLOCALEDIR='"/usr/share/locale"' -DDOCDIR='"/usr/share/doc/systemtap"' -DPYEXECDIR='"/usr/libx32/python2.7/site-packages"' -DPY3EXECDIR='"/usr/libx32/python3.10/site-packages"' -I./includes -I./includes/sys -DSTAP_SDT_V2 -D_REENTRANT -I/usr/include/nss -I/usr/include/nspr -D_GNU_SOURCE -fexceptions -Wall -Wextra -Wunused -Wformat=2 -W -Werror -I/usr/include/nss -I/usr/include/nspr -DSTAP -O2 -fwrapv -pipe -Wformat -Werror=format-security -gdwarf-4 -fno-debug-types-section -fvar-tracking-assignments -g2 -Wp,-D_FORTIFY_SOURCE=2 -fstack-protector-strong --param=ssp-buffer-size=4 -Werror=trampolines -fPIC -mtune=generic -march=x86-64 -gdwarf-4 -fno-debug-types-section -fvar-tracking-assignments -g2 -MT stap-mdfour.o -MD -MP -MF .deps/stap-mdfour.Tpo -c -o stap-mdfour.o `test -f 'mdfour.c' || echo './'`mdfour.c mv -f .deps/stap-mdfour.Tpo .deps/stap-mdfour.Po make[2]: Leaving directory '/tmp/B.1d0q341v/BUILD/systemtap-5.1' make[2]: Entering directory '/tmp/B.1d0q341v/BUILD/systemtap-5.1' x86_64-pld-linux-gnux32-g++ -DHAVE_CONFIG_H -I. -DBINDIR='"/usr/bin"' -DSYSCONFDIR='"/etc"' -DPKGDATADIR='"/usr/share/systemtap"' -DPKGLIBDIR='"/usr/libexec/systemtap"' -DLOCALEDIR='"/usr/share/locale"' -DDOCDIR='"/usr/share/doc/systemtap"' -DPYEXECDIR='"/usr/libx32/python2.7/site-packages"' -DPY3EXECDIR='"/usr/libx32/python3.10/site-packages"' -I./includes -I./includes/sys -DSTAP_SDT_V2 -D_REENTRANT -I/usr/include/nss -I/usr/include/nspr -Wall -Wextra -Werror -faligned-new -I/usr/include/dyninst -D_REENTRANT -I/usr/include/nss -I/usr/include/nspr -O2 -fwrapv -pipe -Wformat -Werror=format-security -gdwarf-4 -fno-debug-types-section -fvar-tracking-assignments -g2 -Wp,-D_FORTIFY_SOURCE=2 -fstack-protector-strong --param=ssp-buffer-size=4 -Werror=trampolines -fPIC -mtune=generic -march=x86-64 -gdwarf-4 -fno-debug-types-section -fvar-tracking-assignments -g2 -Wno-dangling-pointer -MT stap-cmdline.o -MD -MP -MF .deps/stap-cmdline.Tpo -c -o stap-cmdline.o `test -f 'cmdline.cxx' || echo './'`cmdline.cxx mv -f .deps/stap-cmdline.Tpo .deps/stap-cmdline.Po make[2]: Leaving directory '/tmp/B.1d0q341v/BUILD/systemtap-5.1' make[2]: Entering directory '/tmp/B.1d0q341v/BUILD/systemtap-5.1' x86_64-pld-linux-gnux32-g++ -DHAVE_CONFIG_H -I. -DBINDIR='"/usr/bin"' -DSYSCONFDIR='"/etc"' -DPKGDATADIR='"/usr/share/systemtap"' -DPKGLIBDIR='"/usr/libexec/systemtap"' -DLOCALEDIR='"/usr/share/locale"' -DDOCDIR='"/usr/share/doc/systemtap"' -DPYEXECDIR='"/usr/libx32/python2.7/site-packages"' -DPY3EXECDIR='"/usr/libx32/python3.10/site-packages"' -I./includes -I./includes/sys -DSTAP_SDT_V2 -D_REENTRANT -I/usr/include/nss -I/usr/include/nspr -Wall -Wextra -Werror -faligned-new -I/usr/include/dyninst -D_REENTRANT -I/usr/include/nss -I/usr/include/nspr -O2 -fwrapv -pipe -Wformat -Werror=format-security -gdwarf-4 -fno-debug-types-section -fvar-tracking-assignments -g2 -Wp,-D_FORTIFY_SOURCE=2 -fstack-protector-strong --param=ssp-buffer-size=4 -Werror=trampolines -fPIC -mtune=generic -march=x86-64 -gdwarf-4 -fno-debug-types-section -fvar-tracking-assignments -g2 -Wno-dangling-pointer -MT stap-privilege.o -MD -MP -MF .deps/stap-privilege.Tpo -c -o stap-privilege.o `test -f 'privilege.cxx' || echo './'`privilege.cxx mv -f .deps/stap-privilege.Tpo .deps/stap-privilege.Po make[2]: Leaving directory '/tmp/B.1d0q341v/BUILD/systemtap-5.1' make[2]: Entering directory '/tmp/B.1d0q341v/BUILD/systemtap-5.1' x86_64-pld-linux-gnux32-g++ -DHAVE_CONFIG_H -I. -DBINDIR='"/usr/bin"' -DSYSCONFDIR='"/etc"' -DPKGDATADIR='"/usr/share/systemtap"' -DPKGLIBDIR='"/usr/libexec/systemtap"' -DLOCALEDIR='"/usr/share/locale"' -DDOCDIR='"/usr/share/doc/systemtap"' -DPYEXECDIR='"/usr/libx32/python2.7/site-packages"' -DPY3EXECDIR='"/usr/libx32/python3.10/site-packages"' -I./includes -I./includes/sys -DSTAP_SDT_V2 -D_REENTRANT -I/usr/include/nss -I/usr/include/nspr -Wall -Wextra -Werror -faligned-new -I/usr/include/dyninst -D_REENTRANT -I/usr/include/nss -I/usr/include/nspr -O2 -fwrapv -pipe -Wformat -Werror=format-security -gdwarf-4 -fno-debug-types-section -fvar-tracking-assignments -g2 -Wp,-D_FORTIFY_SOURCE=2 -fstack-protector-strong --param=ssp-buffer-size=4 -Werror=trampolines -fPIC -mtune=generic -march=x86-64 -gdwarf-4 -fno-debug-types-section -fvar-tracking-assignments -g2 -Wno-dangling-pointer -MT stap-rpm_finder.o -MD -MP -MF .deps/stap-rpm_finder.Tpo -c -o stap-rpm_finder.o `test -f 'rpm_finder.cxx' || echo './'`rpm_finder.cxx mv -f .deps/stap-rpm_finder.Tpo .deps/stap-rpm_finder.Po make[2]: Leaving directory '/tmp/B.1d0q341v/BUILD/systemtap-5.1' make[2]: Entering directory '/tmp/B.1d0q341v/BUILD/systemtap-5.1' x86_64-pld-linux-gnux32-g++ -DHAVE_CONFIG_H -I. -DBINDIR='"/usr/bin"' -DSYSCONFDIR='"/etc"' -DPKGDATADIR='"/usr/share/systemtap"' -DPKGLIBDIR='"/usr/libexec/systemtap"' -DLOCALEDIR='"/usr/share/locale"' -DDOCDIR='"/usr/share/doc/systemtap"' -DPYEXECDIR='"/usr/libx32/python2.7/site-packages"' -DPY3EXECDIR='"/usr/libx32/python3.10/site-packages"' -I./includes -I./includes/sys -DSTAP_SDT_V2 -D_REENTRANT -I/usr/include/nss -I/usr/include/nspr -Wall -Wextra -Werror -faligned-new -I/usr/include/dyninst -D_REENTRANT -I/usr/include/nss -I/usr/include/nspr -O2 -fwrapv -pipe -Wformat -Werror=format-security -gdwarf-4 -fno-debug-types-section -fvar-tracking-assignments -g2 -Wp,-D_FORTIFY_SOURCE=2 -fstack-protector-strong --param=ssp-buffer-size=4 -Werror=trampolines -fPIC -mtune=generic -march=x86-64 -gdwarf-4 -fno-debug-types-section -fvar-tracking-assignments -g2 -Wno-dangling-pointer -MT stap-dwarf_wrappers.o -MD -MP -MF .deps/stap-dwarf_wrappers.Tpo -c -o stap-dwarf_wrappers.o `test -f 'dwarf_wrappers.cxx' || echo './'`dwarf_wrappers.cxx mv -f .deps/stap-dwarf_wrappers.Tpo .deps/stap-dwarf_wrappers.Po make[2]: Leaving directory '/tmp/B.1d0q341v/BUILD/systemtap-5.1' make[2]: Entering directory '/tmp/B.1d0q341v/BUILD/systemtap-5.1' x86_64-pld-linux-gnux32-g++ -DHAVE_CONFIG_H -I. -DBINDIR='"/usr/bin"' -DSYSCONFDIR='"/etc"' -DPKGDATADIR='"/usr/share/systemtap"' -DPKGLIBDIR='"/usr/libexec/systemtap"' -DLOCALEDIR='"/usr/share/locale"' -DDOCDIR='"/usr/share/doc/systemtap"' -DPYEXECDIR='"/usr/libx32/python2.7/site-packages"' -DPY3EXECDIR='"/usr/libx32/python3.10/site-packages"' -I./includes -I./includes/sys -DSTAP_SDT_V2 -D_REENTRANT -I/usr/include/nss -I/usr/include/nspr -Wall -Wextra -Werror -faligned-new -I/usr/include/dyninst -D_REENTRANT -I/usr/include/nss -I/usr/include/nspr -O2 -fwrapv -pipe -Wformat -Werror=format-security -gdwarf-4 -fno-debug-types-section -fvar-tracking-assignments -g2 -Wp,-D_FORTIFY_SOURCE=2 -fstack-protector-strong --param=ssp-buffer-size=4 -Werror=trampolines -fPIC -mtune=generic -march=x86-64 -gdwarf-4 -fno-debug-types-section -fvar-tracking-assignments -g2 -Wno-dangling-pointer -MT stap-task_finder.o -MD -MP -MF .deps/stap-task_finder.Tpo -c -o stap-task_finder.o `test -f 'task_finder.cxx' || echo './'`task_finder.cxx mv -f .deps/stap-task_finder.Tpo .deps/stap-task_finder.Po make[2]: Leaving directory '/tmp/B.1d0q341v/BUILD/systemtap-5.1' make[2]: Entering directory '/tmp/B.1d0q341v/BUILD/systemtap-5.1' x86_64-pld-linux-gnux32-g++ -DHAVE_CONFIG_H -I. -DBINDIR='"/usr/bin"' -DSYSCONFDIR='"/etc"' -DPKGDATADIR='"/usr/share/systemtap"' -DPKGLIBDIR='"/usr/libexec/systemtap"' -DLOCALEDIR='"/usr/share/locale"' -DDOCDIR='"/usr/share/doc/systemtap"' -DPYEXECDIR='"/usr/libx32/python2.7/site-packages"' -DPY3EXECDIR='"/usr/libx32/python3.10/site-packages"' -I./includes -I./includes/sys -DSTAP_SDT_V2 -D_REENTRANT -I/usr/include/nss -I/usr/include/nspr -Wall -Wextra -Werror -faligned-new -I/usr/include/dyninst -D_REENTRANT -I/usr/include/nss -I/usr/include/nspr -O2 -fwrapv -pipe -Wformat -Werror=format-security -gdwarf-4 -fno-debug-types-section -fvar-tracking-assignments -g2 -Wp,-D_FORTIFY_SOURCE=2 -fstack-protector-strong --param=ssp-buffer-size=4 -Werror=trampolines -fPIC -mtune=generic -march=x86-64 -gdwarf-4 -fno-debug-types-section -fvar-tracking-assignments -g2 -Wno-dangling-pointer -MT stap-translator-output.o -MD -MP -MF .deps/stap-translator-output.Tpo -c -o stap-translator-output.o `test -f 'translator-output.cxx' || echo './'`translator-output.cxx mv -f .deps/stap-translator-output.Tpo .deps/stap-translator-output.Po make[2]: Leaving directory '/tmp/B.1d0q341v/BUILD/systemtap-5.1' make[2]: Entering directory '/tmp/B.1d0q341v/BUILD/systemtap-5.1' x86_64-pld-linux-gnux32-g++ -DHAVE_CONFIG_H -I. -DBINDIR='"/usr/bin"' -DSYSCONFDIR='"/etc"' -DPKGDATADIR='"/usr/share/systemtap"' -DPKGLIBDIR='"/usr/libexec/systemtap"' -DLOCALEDIR='"/usr/share/locale"' -DDOCDIR='"/usr/share/doc/systemtap"' -DPYEXECDIR='"/usr/libx32/python2.7/site-packages"' -DPY3EXECDIR='"/usr/libx32/python3.10/site-packages"' -I./includes -I./includes/sys -DSTAP_SDT_V2 -D_REENTRANT -I/usr/include/nss -I/usr/include/nspr -Wall -Wextra -Werror -faligned-new -I/usr/include/dyninst -D_REENTRANT -I/usr/include/nss -I/usr/include/nspr -O2 -fwrapv -pipe -Wformat -Werror=format-security -gdwarf-4 -fno-debug-types-section -fvar-tracking-assignments -g2 -Wp,-D_FORTIFY_SOURCE=2 -fstack-protector-strong --param=ssp-buffer-size=4 -Werror=trampolines -fPIC -mtune=generic -march=x86-64 -gdwarf-4 -fno-debug-types-section -fvar-tracking-assignments -g2 -Wno-dangling-pointer -MT stap-tapset-dynprobe.o -MD -MP -MF .deps/stap-tapset-dynprobe.Tpo -c -o stap-tapset-dynprobe.o `test -f 'tapset-dynprobe.cxx' || echo './'`tapset-dynprobe.cxx mv -f .deps/stap-tapset-dynprobe.Tpo .deps/stap-tapset-dynprobe.Po make[2]: Leaving directory '/tmp/B.1d0q341v/BUILD/systemtap-5.1' make[2]: Entering directory '/tmp/B.1d0q341v/BUILD/systemtap-5.1' x86_64-pld-linux-gnux32-g++ -DHAVE_CONFIG_H -I. -DBINDIR='"/usr/bin"' -DSYSCONFDIR='"/etc"' -DPKGDATADIR='"/usr/share/systemtap"' -DPKGLIBDIR='"/usr/libexec/systemtap"' -DLOCALEDIR='"/usr/share/locale"' -DDOCDIR='"/usr/share/doc/systemtap"' -DPYEXECDIR='"/usr/libx32/python2.7/site-packages"' -DPY3EXECDIR='"/usr/libx32/python3.10/site-packages"' -I./includes -I./includes/sys -DSTAP_SDT_V2 -D_REENTRANT -I/usr/include/nss -I/usr/include/nspr -Wall -Wextra -Werror -faligned-new -I/usr/include/dyninst -D_REENTRANT -I/usr/include/nss -I/usr/include/nspr -O2 -fwrapv -pipe -Wformat -Werror=format-security -gdwarf-4 -fno-debug-types-section -fvar-tracking-assignments -g2 -Wp,-D_FORTIFY_SOURCE=2 -fstack-protector-strong --param=ssp-buffer-size=4 -Werror=trampolines -fPIC -mtune=generic -march=x86-64 -gdwarf-4 -fno-debug-types-section -fvar-tracking-assignments -g2 -Wno-dangling-pointer -MT stap-cache.o -MD -MP -MF .deps/stap-cache.Tpo -c -o stap-cache.o `test -f 'cache.cxx' || echo './'`cache.cxx mv -f .deps/stap-cache.Tpo .deps/stap-cache.Po make[2]: Leaving directory '/tmp/B.1d0q341v/BUILD/systemtap-5.1' make[2]: Entering directory '/tmp/B.1d0q341v/BUILD/systemtap-5.1' x86_64-pld-linux-gnux32-g++ -DHAVE_CONFIG_H -I. -DBINDIR='"/usr/bin"' -DSYSCONFDIR='"/etc"' -DPKGDATADIR='"/usr/share/systemtap"' -DPKGLIBDIR='"/usr/libexec/systemtap"' -DLOCALEDIR='"/usr/share/locale"' -DDOCDIR='"/usr/share/doc/systemtap"' -DPYEXECDIR='"/usr/libx32/python2.7/site-packages"' -DPY3EXECDIR='"/usr/libx32/python3.10/site-packages"' -I./includes -I./includes/sys -DSTAP_SDT_V2 -D_REENTRANT -I/usr/include/nss -I/usr/include/nspr -Wall -Wextra -Werror -faligned-new -I/usr/include/dyninst -D_REENTRANT -I/usr/include/nss -I/usr/include/nspr -O2 -fwrapv -pipe -Wformat -Werror=format-security -gdwarf-4 -fno-debug-types-section -fvar-tracking-assignments -g2 -Wp,-D_FORTIFY_SOURCE=2 -fstack-protector-strong --param=ssp-buffer-size=4 -Werror=trampolines -fPIC -mtune=generic -march=x86-64 -gdwarf-4 -fno-debug-types-section -fvar-tracking-assignments -g2 -Wno-dangling-pointer -MT stap-tapset-been.o -MD -MP -MF .deps/stap-tapset-been.Tpo -c -o stap-tapset-been.o `test -f 'tapset-been.cxx' || echo './'`tapset-been.cxx mv -f .deps/stap-tapset-been.Tpo .deps/stap-tapset-been.Po make[2]: Leaving directory '/tmp/B.1d0q341v/BUILD/systemtap-5.1' make[2]: Entering directory '/tmp/B.1d0q341v/BUILD/systemtap-5.1' x86_64-pld-linux-gnux32-g++ -DHAVE_CONFIG_H -I. -DBINDIR='"/usr/bin"' -DSYSCONFDIR='"/etc"' -DPKGDATADIR='"/usr/share/systemtap"' -DPKGLIBDIR='"/usr/libexec/systemtap"' -DLOCALEDIR='"/usr/share/locale"' -DDOCDIR='"/usr/share/doc/systemtap"' -DPYEXECDIR='"/usr/libx32/python2.7/site-packages"' -DPY3EXECDIR='"/usr/libx32/python3.10/site-packages"' -I./includes -I./includes/sys -DSTAP_SDT_V2 -D_REENTRANT -I/usr/include/nss -I/usr/include/nspr -Wall -Wextra -Werror -faligned-new -I/usr/include/dyninst -D_REENTRANT -I/usr/include/nss -I/usr/include/nspr -O2 -fwrapv -pipe -Wformat -Werror=format-security -gdwarf-4 -fno-debug-types-section -fvar-tracking-assignments -g2 -Wp,-D_FORTIFY_SOURCE=2 -fstack-protector-strong --param=ssp-buffer-size=4 -Werror=trampolines -fPIC -mtune=generic -march=x86-64 -gdwarf-4 -fno-debug-types-section -fvar-tracking-assignments -g2 -Wno-dangling-pointer -MT stap-coveragedb.o -MD -MP -MF .deps/stap-coveragedb.Tpo -c -o stap-coveragedb.o `test -f 'coveragedb.cxx' || echo './'`coveragedb.cxx mv -f .deps/stap-coveragedb.Tpo .deps/stap-coveragedb.Po make[2]: Leaving directory '/tmp/B.1d0q341v/BUILD/systemtap-5.1' make[2]: Entering directory '/tmp/B.1d0q341v/BUILD/systemtap-5.1' x86_64-pld-linux-gnux32-g++ -DHAVE_CONFIG_H -I. -DBINDIR='"/usr/bin"' -DSYSCONFDIR='"/etc"' -DPKGDATADIR='"/usr/share/systemtap"' -DPKGLIBDIR='"/usr/libexec/systemtap"' -DLOCALEDIR='"/usr/share/locale"' -DDOCDIR='"/usr/share/doc/systemtap"' -DPYEXECDIR='"/usr/libx32/python2.7/site-packages"' -DPY3EXECDIR='"/usr/libx32/python3.10/site-packages"' -I./includes -I./includes/sys -DSTAP_SDT_V2 -D_REENTRANT -I/usr/include/nss -I/usr/include/nspr -Wall -Wextra -Werror -faligned-new -I/usr/include/dyninst -D_REENTRANT -I/usr/include/nss -I/usr/include/nspr -O2 -fwrapv -pipe -Wformat -Werror=format-security -gdwarf-4 -fno-debug-types-section -fvar-tracking-assignments -g2 -Wp,-D_FORTIFY_SOURCE=2 -fstack-protector-strong --param=ssp-buffer-size=4 -Werror=trampolines -fPIC -mtune=generic -march=x86-64 -gdwarf-4 -fno-debug-types-section -fvar-tracking-assignments -g2 -Wno-dangling-pointer -MT stap-hash.o -MD -MP -MF .deps/stap-hash.Tpo -c -o stap-hash.o `test -f 'hash.cxx' || echo './'`hash.cxx mv -f .deps/stap-hash.Tpo .deps/stap-hash.Po make[2]: Leaving directory '/tmp/B.1d0q341v/BUILD/systemtap-5.1' make[2]: Entering directory '/tmp/B.1d0q341v/BUILD/systemtap-5.1' x86_64-pld-linux-gnux32-g++ -DHAVE_CONFIG_H -I. -DBINDIR='"/usr/bin"' -DSYSCONFDIR='"/etc"' -DPKGDATADIR='"/usr/share/systemtap"' -DPKGLIBDIR='"/usr/libexec/systemtap"' -DLOCALEDIR='"/usr/share/locale"' -DDOCDIR='"/usr/share/doc/systemtap"' -DPYEXECDIR='"/usr/libx32/python2.7/site-packages"' -DPY3EXECDIR='"/usr/libx32/python3.10/site-packages"' -I./includes -I./includes/sys -DSTAP_SDT_V2 -D_REENTRANT -I/usr/include/nss -I/usr/include/nspr -Wall -Wextra -Werror -faligned-new -I/usr/include/dyninst -D_REENTRANT -I/usr/include/nss -I/usr/include/nspr -O2 -fwrapv -pipe -Wformat -Werror=format-security -gdwarf-4 -fno-debug-types-section -fvar-tracking-assignments -g2 -Wp,-D_FORTIFY_SOURCE=2 -fstack-protector-strong --param=ssp-buffer-size=4 -Werror=trampolines -fPIC -mtune=generic -march=x86-64 -gdwarf-4 -fno-debug-types-section -fvar-tracking-assignments -g2 -Wno-dangling-pointer -MT stap-tapset-perfmon.o -MD -MP -MF .deps/stap-tapset-perfmon.Tpo -c -o stap-tapset-perfmon.o `test -f 'tapset-perfmon.cxx' || echo './'`tapset-perfmon.cxx mv -f .deps/stap-tapset-perfmon.Tpo .deps/stap-tapset-perfmon.Po make[2]: Leaving directory '/tmp/B.1d0q341v/BUILD/systemtap-5.1' make[2]: Entering directory '/tmp/B.1d0q341v/BUILD/systemtap-5.1' x86_64-pld-linux-gnux32-g++ -DHAVE_CONFIG_H -I. -DBINDIR='"/usr/bin"' -DSYSCONFDIR='"/etc"' -DPKGDATADIR='"/usr/share/systemtap"' -DPKGLIBDIR='"/usr/libexec/systemtap"' -DLOCALEDIR='"/usr/share/locale"' -DDOCDIR='"/usr/share/doc/systemtap"' -DPYEXECDIR='"/usr/libx32/python2.7/site-packages"' -DPY3EXECDIR='"/usr/libx32/python3.10/site-packages"' -I./includes -I./includes/sys -DSTAP_SDT_V2 -D_REENTRANT -I/usr/include/nss -I/usr/include/nspr -Wall -Wextra -Werror -faligned-new -I/usr/include/dyninst -D_REENTRANT -I/usr/include/nss -I/usr/include/nspr -O2 -fwrapv -pipe -Wformat -Werror=format-security -gdwarf-4 -fno-debug-types-section -fvar-tracking-assignments -g2 -Wp,-D_FORTIFY_SOURCE=2 -fstack-protector-strong --param=ssp-buffer-size=4 -Werror=trampolines -fPIC -mtune=generic -march=x86-64 -gdwarf-4 -fno-debug-types-section -fvar-tracking-assignments -g2 -Wno-dangling-pointer -MT stap-tapset-timers.o -MD -MP -MF .deps/stap-tapset-timers.Tpo -c -o stap-tapset-timers.o `test -f 'tapset-timers.cxx' || echo './'`tapset-timers.cxx mv -f .deps/stap-tapset-timers.Tpo .deps/stap-tapset-timers.Po make[2]: Leaving directory '/tmp/B.1d0q341v/BUILD/systemtap-5.1' make[2]: Entering directory '/tmp/B.1d0q341v/BUILD/systemtap-5.1' x86_64-pld-linux-gnux32-g++ -DHAVE_CONFIG_H -I. -DBINDIR='"/usr/bin"' -DSYSCONFDIR='"/etc"' -DPKGDATADIR='"/usr/share/systemtap"' -DPKGLIBDIR='"/usr/libexec/systemtap"' -DLOCALEDIR='"/usr/share/locale"' -DDOCDIR='"/usr/share/doc/systemtap"' -DPYEXECDIR='"/usr/libx32/python2.7/site-packages"' -DPY3EXECDIR='"/usr/libx32/python3.10/site-packages"' -I./includes -I./includes/sys -DSTAP_SDT_V2 -D_REENTRANT -I/usr/include/nss -I/usr/include/nspr -Wall -Wextra -Werror -faligned-new -I/usr/include/dyninst -D_REENTRANT -I/usr/include/nss -I/usr/include/nspr -O2 -fwrapv -pipe -Wformat -Werror=format-security -gdwarf-4 -fno-debug-types-section -fvar-tracking-assignments -g2 -Wp,-D_FORTIFY_SOURCE=2 -fstack-protector-strong --param=ssp-buffer-size=4 -Werror=trampolines -fPIC -mtune=generic -march=x86-64 -gdwarf-4 -fno-debug-types-section -fvar-tracking-assignments -g2 -Wno-dangling-pointer -MT stap-setupdwfl.o -MD -MP -MF .deps/stap-setupdwfl.Tpo -c -o stap-setupdwfl.o `test -f 'setupdwfl.cxx' || echo './'`setupdwfl.cxx mv -f .deps/stap-setupdwfl.Tpo .deps/stap-setupdwfl.Po make[2]: Leaving directory '/tmp/B.1d0q341v/BUILD/systemtap-5.1' make[2]: Entering directory '/tmp/B.1d0q341v/BUILD/systemtap-5.1' x86_64-pld-linux-gnux32-g++ -DHAVE_CONFIG_H -I. -DBINDIR='"/usr/bin"' -DSYSCONFDIR='"/etc"' -DPKGDATADIR='"/usr/share/systemtap"' -DPKGLIBDIR='"/usr/libexec/systemtap"' -DLOCALEDIR='"/usr/share/locale"' -DDOCDIR='"/usr/share/doc/systemtap"' -DPYEXECDIR='"/usr/libx32/python2.7/site-packages"' -DPY3EXECDIR='"/usr/libx32/python3.10/site-packages"' -I./includes -I./includes/sys -DSTAP_SDT_V2 -D_REENTRANT -I/usr/include/nss -I/usr/include/nspr -Wall -Wextra -Werror -faligned-new -I/usr/include/dyninst -D_REENTRANT -I/usr/include/nss -I/usr/include/nspr -O2 -fwrapv -pipe -Wformat -Werror=format-security -gdwarf-4 -fno-debug-types-section -fvar-tracking-assignments -g2 -Wp,-D_FORTIFY_SOURCE=2 -fstack-protector-strong --param=ssp-buffer-size=4 -Werror=trampolines -fPIC -mtune=generic -march=x86-64 -gdwarf-4 -fno-debug-types-section -fvar-tracking-assignments -g2 -Wno-dangling-pointer -MT stap-stringtable.o -MD -MP -MF .deps/stap-stringtable.Tpo -c -o stap-stringtable.o `test -f 'stringtable.cxx' || echo './'`stringtable.cxx mv -f .deps/stap-stringtable.Tpo .deps/stap-stringtable.Po make[2]: Leaving directory '/tmp/B.1d0q341v/BUILD/systemtap-5.1' make[2]: Entering directory '/tmp/B.1d0q341v/BUILD/systemtap-5.1' x86_64-pld-linux-gnux32-g++ -DHAVE_CONFIG_H -I. -DBINDIR='"/usr/bin"' -DSYSCONFDIR='"/etc"' -DPKGDATADIR='"/usr/share/systemtap"' -DPKGLIBDIR='"/usr/libexec/systemtap"' -DLOCALEDIR='"/usr/share/locale"' -DDOCDIR='"/usr/share/doc/systemtap"' -DPYEXECDIR='"/usr/libx32/python2.7/site-packages"' -DPY3EXECDIR='"/usr/libx32/python3.10/site-packages"' -I./includes -I./includes/sys -DSTAP_SDT_V2 -D_REENTRANT -I/usr/include/nss -I/usr/include/nspr -Wall -Wextra -Werror -faligned-new -I/usr/include/dyninst -D_REENTRANT -I/usr/include/nss -I/usr/include/nspr -O2 -fwrapv -pipe -Wformat -Werror=format-security -gdwarf-4 -fno-debug-types-section -fvar-tracking-assignments -g2 -Wp,-D_FORTIFY_SOURCE=2 -fstack-protector-strong --param=ssp-buffer-size=4 -Werror=trampolines -fPIC -mtune=generic -march=x86-64 -gdwarf-4 -fno-debug-types-section -fvar-tracking-assignments -g2 -Wno-dangling-pointer -MT stap-stapregex.o -MD -MP -MF .deps/stap-stapregex.Tpo -c -o stap-stapregex.o `test -f 'stapregex.cxx' || echo './'`stapregex.cxx mv -f .deps/stap-stapregex.Tpo .deps/stap-stapregex.Po make[2]: Leaving directory '/tmp/B.1d0q341v/BUILD/systemtap-5.1' make[2]: Entering directory '/tmp/B.1d0q341v/BUILD/systemtap-5.1' x86_64-pld-linux-gnux32-g++ -DHAVE_CONFIG_H -I. -DBINDIR='"/usr/bin"' -DSYSCONFDIR='"/etc"' -DPKGDATADIR='"/usr/share/systemtap"' -DPKGLIBDIR='"/usr/libexec/systemtap"' -DLOCALEDIR='"/usr/share/locale"' -DDOCDIR='"/usr/share/doc/systemtap"' -DPYEXECDIR='"/usr/libx32/python2.7/site-packages"' -DPY3EXECDIR='"/usr/libx32/python3.10/site-packages"' -I./includes -I./includes/sys -DSTAP_SDT_V2 -D_REENTRANT -I/usr/include/nss -I/usr/include/nspr -Wall -Wextra -Werror -faligned-new -I/usr/include/dyninst -D_REENTRANT -I/usr/include/nss -I/usr/include/nspr -O2 -fwrapv -pipe -Wformat -Werror=format-security -gdwarf-4 -fno-debug-types-section -fvar-tracking-assignments -g2 -Wp,-D_FORTIFY_SOURCE=2 -fstack-protector-strong --param=ssp-buffer-size=4 -Werror=trampolines -fPIC -mtune=generic -march=x86-64 -gdwarf-4 -fno-debug-types-section -fvar-tracking-assignments -g2 -Wno-dangling-pointer -MT stap-tapset-netfilter.o -MD -MP -MF .deps/stap-tapset-netfilter.Tpo -c -o stap-tapset-netfilter.o `test -f 'tapset-netfilter.cxx' || echo './'`tapset-netfilter.cxx mv -f .deps/stap-tapset-netfilter.Tpo .deps/stap-tapset-netfilter.Po make[2]: Leaving directory '/tmp/B.1d0q341v/BUILD/systemtap-5.1' make[2]: Entering directory '/tmp/B.1d0q341v/BUILD/systemtap-5.1' x86_64-pld-linux-gnux32-g++ -DHAVE_CONFIG_H -I. -DBINDIR='"/usr/bin"' -DSYSCONFDIR='"/etc"' -DPKGDATADIR='"/usr/share/systemtap"' -DPKGLIBDIR='"/usr/libexec/systemtap"' -DLOCALEDIR='"/usr/share/locale"' -DDOCDIR='"/usr/share/doc/systemtap"' -DPYEXECDIR='"/usr/libx32/python2.7/site-packages"' -DPY3EXECDIR='"/usr/libx32/python3.10/site-packages"' -I./includes -I./includes/sys -DSTAP_SDT_V2 -D_REENTRANT -I/usr/include/nss -I/usr/include/nspr -Wall -Wextra -Werror -faligned-new -I/usr/include/dyninst -D_REENTRANT -I/usr/include/nss -I/usr/include/nspr -O2 -fwrapv -pipe -Wformat -Werror=format-security -gdwarf-4 -fno-debug-types-section -fvar-tracking-assignments -g2 -Wp,-D_FORTIFY_SOURCE=2 -fstack-protector-strong --param=ssp-buffer-size=4 -Werror=trampolines -fPIC -mtune=generic -march=x86-64 -gdwarf-4 -fno-debug-types-section -fvar-tracking-assignments -g2 -Wno-dangling-pointer -MT stap-bpf-bitset.o -MD -MP -MF .deps/stap-bpf-bitset.Tpo -c -o stap-bpf-bitset.o `test -f 'bpf-bitset.cxx' || echo './'`bpf-bitset.cxx mv -f .deps/stap-bpf-bitset.Tpo .deps/stap-bpf-bitset.Po make[2]: Leaving directory '/tmp/B.1d0q341v/BUILD/systemtap-5.1' make[2]: Entering directory '/tmp/B.1d0q341v/BUILD/systemtap-5.1' x86_64-pld-linux-gnux32-g++ -DHAVE_CONFIG_H -I. -DBINDIR='"/usr/bin"' -DSYSCONFDIR='"/etc"' -DPKGDATADIR='"/usr/share/systemtap"' -DPKGLIBDIR='"/usr/libexec/systemtap"' -DLOCALEDIR='"/usr/share/locale"' -DDOCDIR='"/usr/share/doc/systemtap"' -DPYEXECDIR='"/usr/libx32/python2.7/site-packages"' -DPY3EXECDIR='"/usr/libx32/python3.10/site-packages"' -I./includes -I./includes/sys -DSTAP_SDT_V2 -D_REENTRANT -I/usr/include/nss -I/usr/include/nspr -Wall -Wextra -Werror -faligned-new -I/usr/include/dyninst -D_REENTRANT -I/usr/include/nss -I/usr/include/nspr -O2 -fwrapv -pipe -Wformat -Werror=format-security -gdwarf-4 -fno-debug-types-section -fvar-tracking-assignments -g2 -Wp,-D_FORTIFY_SOURCE=2 -fstack-protector-strong --param=ssp-buffer-size=4 -Werror=trampolines -fPIC -mtune=generic -march=x86-64 -gdwarf-4 -fno-debug-types-section -fvar-tracking-assignments -g2 -Wno-dangling-pointer -MT stap-tapset-debuginfod.o -MD -MP -MF .deps/stap-tapset-debuginfod.Tpo -c -o stap-tapset-debuginfod.o `test -f 'tapset-debuginfod.cxx' || echo './'`tapset-debuginfod.cxx mv -f .deps/stap-tapset-debuginfod.Tpo .deps/stap-tapset-debuginfod.Po make[2]: Leaving directory '/tmp/B.1d0q341v/BUILD/systemtap-5.1' make[2]: Entering directory '/tmp/B.1d0q341v/BUILD/systemtap-5.1' x86_64-pld-linux-gnux32-g++ -DHAVE_CONFIG_H -I. -DBINDIR='"/usr/bin"' -DSYSCONFDIR='"/etc"' -DPKGDATADIR='"/usr/share/systemtap"' -DPKGLIBDIR='"/usr/libexec/systemtap"' -DLOCALEDIR='"/usr/share/locale"' -DDOCDIR='"/usr/share/doc/systemtap"' -DPYEXECDIR='"/usr/libx32/python2.7/site-packages"' -DPY3EXECDIR='"/usr/libx32/python3.10/site-packages"' -I./includes -I./includes/sys -DSTAP_SDT_V2 -D_REENTRANT -I/usr/include/nss -I/usr/include/nspr -Wall -Wextra -Werror -faligned-new -I/usr/include/dyninst -D_REENTRANT -I/usr/include/nss -I/usr/include/nspr -O2 -fwrapv -pipe -Wformat -Werror=format-security -gdwarf-4 -fno-debug-types-section -fvar-tracking-assignments -g2 -Wp,-D_FORTIFY_SOURCE=2 -fstack-protector-strong --param=ssp-buffer-size=4 -Werror=trampolines -fPIC -mtune=generic -march=x86-64 -gdwarf-4 -fno-debug-types-section -fvar-tracking-assignments -g2 -Wno-dangling-pointer -MT stap-tapset-mark.o -MD -MP -MF .deps/stap-tapset-mark.Tpo -c -o stap-tapset-mark.o `test -f 'tapset-mark.cxx' || echo './'`tapset-mark.cxx mv -f .deps/stap-tapset-mark.Tpo .deps/stap-tapset-mark.Po make[2]: Leaving directory '/tmp/B.1d0q341v/BUILD/systemtap-5.1' make[2]: Entering directory '/tmp/B.1d0q341v/BUILD/systemtap-5.1' x86_64-pld-linux-gnux32-g++ -DHAVE_CONFIG_H -I. -DBINDIR='"/usr/bin"' -DSYSCONFDIR='"/etc"' -DPKGDATADIR='"/usr/share/systemtap"' -DPKGLIBDIR='"/usr/libexec/systemtap"' -DLOCALEDIR='"/usr/share/locale"' -DDOCDIR='"/usr/share/doc/systemtap"' -DPYEXECDIR='"/usr/libx32/python2.7/site-packages"' -DPY3EXECDIR='"/usr/libx32/python3.10/site-packages"' -I./includes -I./includes/sys -DSTAP_SDT_V2 -D_REENTRANT -I/usr/include/nss -I/usr/include/nspr -Wall -Wextra -Werror -faligned-new -I/usr/include/dyninst -D_REENTRANT -I/usr/include/nss -I/usr/include/nspr -O2 -fwrapv -pipe -Wformat -Werror=format-security -gdwarf-4 -fno-debug-types-section -fvar-tracking-assignments -g2 -Wp,-D_FORTIFY_SOURCE=2 -fstack-protector-strong --param=ssp-buffer-size=4 -Werror=trampolines -fPIC -mtune=generic -march=x86-64 -gdwarf-4 -fno-debug-types-section -fvar-tracking-assignments -g2 -Wno-dangling-pointer -MT stap-tapset-method.o -MD -MP -MF .deps/stap-tapset-method.Tpo -c -o stap-tapset-method.o `test -f 'tapset-method.cxx' || echo './'`tapset-method.cxx mv -f .deps/stap-tapset-method.Tpo .deps/stap-tapset-method.Po make[2]: Leaving directory '/tmp/B.1d0q341v/BUILD/systemtap-5.1' make[2]: Entering directory '/tmp/B.1d0q341v/BUILD/systemtap-5.1' x86_64-pld-linux-gnux32-g++ -DHAVE_CONFIG_H -I. -DBINDIR='"/usr/bin"' -DSYSCONFDIR='"/etc"' -DPKGDATADIR='"/usr/share/systemtap"' -DPKGLIBDIR='"/usr/libexec/systemtap"' -DLOCALEDIR='"/usr/share/locale"' -DDOCDIR='"/usr/share/doc/systemtap"' -DPYEXECDIR='"/usr/libx32/python2.7/site-packages"' -DPY3EXECDIR='"/usr/libx32/python3.10/site-packages"' -I./includes -I./includes/sys -DSTAP_SDT_V2 -D_REENTRANT -I/usr/include/nss -I/usr/include/nspr -Wall -Wextra -Werror -faligned-new -I/usr/include/dyninst -D_REENTRANT -I/usr/include/nss -I/usr/include/nspr -O2 -fwrapv -pipe -Wformat -Werror=format-security -gdwarf-4 -fno-debug-types-section -fvar-tracking-assignments -g2 -Wp,-D_FORTIFY_SOURCE=2 -fstack-protector-strong --param=ssp-buffer-size=4 -Werror=trampolines -fPIC -mtune=generic -march=x86-64 -gdwarf-4 -fno-debug-types-section -fvar-tracking-assignments -g2 -Wno-dangling-pointer -MT stap-util.o -MD -MP -MF .deps/stap-util.Tpo -c -o stap-util.o `test -f 'util.cxx' || echo './'`util.cxx mv -f .deps/stap-util.Tpo .deps/stap-util.Po make[2]: Leaving directory '/tmp/B.1d0q341v/BUILD/systemtap-5.1' make[2]: Entering directory '/tmp/B.1d0q341v/BUILD/systemtap-5.1' x86_64-pld-linux-gnux32-g++ -DHAVE_CONFIG_H -I. -DBINDIR='"/usr/bin"' -DSYSCONFDIR='"/etc"' -DPKGDATADIR='"/usr/share/systemtap"' -DPKGLIBDIR='"/usr/libexec/systemtap"' -DLOCALEDIR='"/usr/share/locale"' -DDOCDIR='"/usr/share/doc/systemtap"' -DPYEXECDIR='"/usr/libx32/python2.7/site-packages"' -DPY3EXECDIR='"/usr/libx32/python3.10/site-packages"' -I./includes -I./includes/sys -DSTAP_SDT_V2 -D_REENTRANT -I/usr/include/nss -I/usr/include/nspr -Wall -Wextra -Werror -faligned-new -I/usr/include/dyninst -D_REENTRANT -I/usr/include/nss -I/usr/include/nspr -O2 -fwrapv -pipe -Wformat -Werror=format-security -gdwarf-4 -fno-debug-types-section -fvar-tracking-assignments -g2 -Wp,-D_FORTIFY_SOURCE=2 -fstack-protector-strong --param=ssp-buffer-size=4 -Werror=trampolines -fPIC -mtune=generic -march=x86-64 -gdwarf-4 -fno-debug-types-section -fvar-tracking-assignments -g2 -Wno-dangling-pointer -MT stap-stapregex-tree.o -MD -MP -MF .deps/stap-stapregex-tree.Tpo -c -o stap-stapregex-tree.o `test -f 'stapregex-tree.cxx' || echo './'`stapregex-tree.cxx mv -f .deps/stap-stapregex-tree.Tpo .deps/stap-stapregex-tree.Po make[2]: Leaving directory '/tmp/B.1d0q341v/BUILD/systemtap-5.1' make[2]: Entering directory '/tmp/B.1d0q341v/BUILD/systemtap-5.1' x86_64-pld-linux-gnux32-g++ -DHAVE_CONFIG_H -I. -DBINDIR='"/usr/bin"' -DSYSCONFDIR='"/etc"' -DPKGDATADIR='"/usr/share/systemtap"' -DPKGLIBDIR='"/usr/libexec/systemtap"' -DLOCALEDIR='"/usr/share/locale"' -DDOCDIR='"/usr/share/doc/systemtap"' -DPYEXECDIR='"/usr/libx32/python2.7/site-packages"' -DPY3EXECDIR='"/usr/libx32/python3.10/site-packages"' -I./includes -I./includes/sys -DSTAP_SDT_V2 -D_REENTRANT -I/usr/include/nss -I/usr/include/nspr -Wall -Wextra -Werror -faligned-new -I/usr/include/dyninst -D_REENTRANT -I/usr/include/nss -I/usr/include/nspr -O2 -fwrapv -pipe -Wformat -Werror=format-security -gdwarf-4 -fno-debug-types-section -fvar-tracking-assignments -g2 -Wp,-D_FORTIFY_SOURCE=2 -fstack-protector-strong --param=ssp-buffer-size=4 -Werror=trampolines -fPIC -mtune=generic -march=x86-64 -gdwarf-4 -fno-debug-types-section -fvar-tracking-assignments -g2 -Wno-dangling-pointer -MT stap-tapset-procfs.o -MD -MP -MF .deps/stap-tapset-procfs.Tpo -c -o stap-tapset-procfs.o `test -f 'tapset-procfs.cxx' || echo './'`tapset-procfs.cxx mv -f .deps/stap-tapset-procfs.Tpo .deps/stap-tapset-procfs.Po make[2]: Leaving directory '/tmp/B.1d0q341v/BUILD/systemtap-5.1' make[2]: Entering directory '/tmp/B.1d0q341v/BUILD/systemtap-5.1' x86_64-pld-linux-gnux32-g++ -DHAVE_CONFIG_H -I. -DBINDIR='"/usr/bin"' -DSYSCONFDIR='"/etc"' -DPKGDATADIR='"/usr/share/systemtap"' -DPKGLIBDIR='"/usr/libexec/systemtap"' -DLOCALEDIR='"/usr/share/locale"' -DDOCDIR='"/usr/share/doc/systemtap"' -DPYEXECDIR='"/usr/libx32/python2.7/site-packages"' -DPY3EXECDIR='"/usr/libx32/python3.10/site-packages"' -I./includes -I./includes/sys -DSTAP_SDT_V2 -D_REENTRANT -I/usr/include/nss -I/usr/include/nspr -Wall -Wextra -Werror -faligned-new -I/usr/include/dyninst -D_REENTRANT -I/usr/include/nss -I/usr/include/nspr -O2 -fwrapv -pipe -Wformat -Werror=format-security -gdwarf-4 -fno-debug-types-section -fvar-tracking-assignments -g2 -Wp,-D_FORTIFY_SOURCE=2 -fstack-protector-strong --param=ssp-buffer-size=4 -Werror=trampolines -fPIC -mtune=generic -march=x86-64 -gdwarf-4 -fno-debug-types-section -fvar-tracking-assignments -g2 -Wno-dangling-pointer -MT stap-stapregex-parse.o -MD -MP -MF .deps/stap-stapregex-parse.Tpo -c -o stap-stapregex-parse.o `test -f 'stapregex-parse.cxx' || echo './'`stapregex-parse.cxx mv -f .deps/stap-stapregex-parse.Tpo .deps/stap-stapregex-parse.Po make[2]: Leaving directory '/tmp/B.1d0q341v/BUILD/systemtap-5.1' make[2]: Entering directory '/tmp/B.1d0q341v/BUILD/systemtap-5.1' x86_64-pld-linux-gnux32-g++ -DHAVE_CONFIG_H -I. -DBINDIR='"/usr/bin"' -DSYSCONFDIR='"/etc"' -DPKGDATADIR='"/usr/share/systemtap"' -DPKGLIBDIR='"/usr/libexec/systemtap"' -DLOCALEDIR='"/usr/share/locale"' -DDOCDIR='"/usr/share/doc/systemtap"' -DPYEXECDIR='"/usr/libx32/python2.7/site-packages"' -DPY3EXECDIR='"/usr/libx32/python3.10/site-packages"' -I./includes -I./includes/sys -DSTAP_SDT_V2 -D_REENTRANT -I/usr/include/nss -I/usr/include/nspr -Wall -Wextra -Werror -faligned-new -I/usr/include/dyninst -D_REENTRANT -I/usr/include/nss -I/usr/include/nspr -O2 -fwrapv -pipe -Wformat -Werror=format-security -gdwarf-4 -fno-debug-types-section -fvar-tracking-assignments -g2 -Wp,-D_FORTIFY_SOURCE=2 -fstack-protector-strong --param=ssp-buffer-size=4 -Werror=trampolines -fPIC -mtune=generic -march=x86-64 -gdwarf-4 -fno-debug-types-section -fvar-tracking-assignments -g2 -Wno-dangling-pointer -MT stap-remote.o -MD -MP -MF .deps/stap-remote.Tpo -c -o stap-remote.o `test -f 'remote.cxx' || echo './'`remote.cxx mv -f .deps/stap-remote.Tpo .deps/stap-remote.Po make[2]: Leaving directory '/tmp/B.1d0q341v/BUILD/systemtap-5.1' make[2]: Entering directory '/tmp/B.1d0q341v/BUILD/systemtap-5.1' x86_64-pld-linux-gnux32-gcc -DHAVE_CONFIG_H -I. -DBINDIR='"/usr/bin"' -DSYSCONFDIR='"/etc"' -DPKGDATADIR='"/usr/share/systemtap"' -DPKGLIBDIR='"/usr/libexec/systemtap"' -DLOCALEDIR='"/usr/share/locale"' -DDOCDIR='"/usr/share/doc/systemtap"' -DPYEXECDIR='"/usr/libx32/python2.7/site-packages"' -DPY3EXECDIR='"/usr/libx32/python3.10/site-packages"' -I./includes -I./includes/sys -D_GNU_SOURCE -fexceptions -Wall -Wextra -Wunused -Wformat=2 -W -Werror -I/usr/include/libxml2 -O2 -fwrapv -pipe -Wformat -Werror=format-security -gdwarf-4 -fno-debug-types-section -fvar-tracking-assignments -g2 -Wp,-D_FORTIFY_SOURCE=2 -fstack-protector-strong --param=ssp-buffer-size=4 -Werror=trampolines -fPIC -mtune=generic -march=x86-64 -gdwarf-4 -fno-debug-types-section -fvar-tracking-assignments -g2 -MT stapvirt-stapvirt.o -MD -MP -MF .deps/stapvirt-stapvirt.Tpo -c -o stapvirt-stapvirt.o `test -f 'stapvirt.c' || echo './'`stapvirt.c mv -f .deps/stapvirt-stapvirt.Tpo .deps/stapvirt-stapvirt.Po make[2]: Leaving directory '/tmp/B.1d0q341v/BUILD/systemtap-5.1' make[2]: Entering directory '/tmp/B.1d0q341v/BUILD/systemtap-5.1' x86_64-pld-linux-gnux32-g++ -DHAVE_CONFIG_H -I. -DBINDIR='"/usr/bin"' -DSYSCONFDIR='"/etc"' -DPKGDATADIR='"/usr/share/systemtap"' -DPKGLIBDIR='"/usr/libexec/systemtap"' -DLOCALEDIR='"/usr/share/locale"' -DDOCDIR='"/usr/share/doc/systemtap"' -DPYEXECDIR='"/usr/libx32/python2.7/site-packages"' -DPY3EXECDIR='"/usr/libx32/python3.10/site-packages"' -I./includes -I./includes/sys -DSTAP_SDT_V2 -D_REENTRANT -I/usr/include/nss -I/usr/include/nspr -Wall -Wextra -Werror -faligned-new -I/usr/include/dyninst -D_REENTRANT -I/usr/include/nss -I/usr/include/nspr -O2 -fwrapv -pipe -Wformat -Werror=format-security -gdwarf-4 -fno-debug-types-section -fvar-tracking-assignments -g2 -Wp,-D_FORTIFY_SOURCE=2 -fstack-protector-strong --param=ssp-buffer-size=4 -Werror=trampolines -fPIC -mtune=generic -march=x86-64 -gdwarf-4 -fno-debug-types-section -fvar-tracking-assignments -g2 -Wno-dangling-pointer -MT stap-csclient.o -MD -MP -MF .deps/stap-csclient.Tpo -c -o stap-csclient.o `test -f 'csclient.cxx' || echo './'`csclient.cxx mv -f .deps/stap-csclient.Tpo .deps/stap-csclient.Po make[2]: Leaving directory '/tmp/B.1d0q341v/BUILD/systemtap-5.1' make[2]: Entering directory '/tmp/B.1d0q341v/BUILD/systemtap-5.1' x86_64-pld-linux-gnux32-g++ -DHAVE_CONFIG_H -I. -DBINDIR='"/usr/bin"' -DSYSCONFDIR='"/etc"' -DPKGDATADIR='"/usr/share/systemtap"' -DPKGLIBDIR='"/usr/libexec/systemtap"' -DLOCALEDIR='"/usr/share/locale"' -DDOCDIR='"/usr/share/doc/systemtap"' -DPYEXECDIR='"/usr/libx32/python2.7/site-packages"' -DPY3EXECDIR='"/usr/libx32/python3.10/site-packages"' -I./includes -I./includes/sys -DSTAP_SDT_V2 -D_REENTRANT -I/usr/include/nss -I/usr/include/nspr -Wall -Wextra -Werror -faligned-new -I/usr/include/dyninst -D_REENTRANT -I/usr/include/nss -I/usr/include/nspr -O2 -fwrapv -pipe -Wformat -Werror=format-security -gdwarf-4 -fno-debug-types-section -fvar-tracking-assignments -g2 -Wp,-D_FORTIFY_SOURCE=2 -fstack-protector-strong --param=ssp-buffer-size=4 -Werror=trampolines -fPIC -mtune=generic -march=x86-64 -gdwarf-4 -fno-debug-types-section -fvar-tracking-assignments -g2 -Wno-dangling-pointer -MT stap-tapset-utrace.o -MD -MP -MF .deps/stap-tapset-utrace.Tpo -c -o stap-tapset-utrace.o `test -f 'tapset-utrace.cxx' || echo './'`tapset-utrace.cxx mv -f .deps/stap-tapset-utrace.Tpo .deps/stap-tapset-utrace.Po make[2]: Leaving directory '/tmp/B.1d0q341v/BUILD/systemtap-5.1' make[2]: Entering directory '/tmp/B.1d0q341v/BUILD/systemtap-5.1' x86_64-pld-linux-gnux32-g++ -DHAVE_CONFIG_H -I. -DBINDIR='"/usr/bin"' -DSYSCONFDIR='"/etc"' -DPKGDATADIR='"/usr/share/systemtap"' -DPKGLIBDIR='"/usr/libexec/systemtap"' -DLOCALEDIR='"/usr/share/locale"' -DDOCDIR='"/usr/share/doc/systemtap"' -DPYEXECDIR='"/usr/libx32/python2.7/site-packages"' -DPY3EXECDIR='"/usr/libx32/python3.10/site-packages"' -I./includes -I./includes/sys -DSTAP_SDT_V2 -D_REENTRANT -I/usr/include/nss -I/usr/include/nspr -Wall -Wextra -Werror -faligned-new -I/usr/include/dyninst -D_REENTRANT -I/usr/include/nss -I/usr/include/nspr -O2 -fwrapv -pipe -Wformat -Werror=format-security -gdwarf-4 -fno-debug-types-section -fvar-tracking-assignments -g2 -Wp,-D_FORTIFY_SOURCE=2 -fstack-protector-strong --param=ssp-buffer-size=4 -Werror=trampolines -fPIC -mtune=generic -march=x86-64 -gdwarf-4 -fno-debug-types-section -fvar-tracking-assignments -g2 -Wno-dangling-pointer -MT stap-buildrun.o -MD -MP -MF .deps/stap-buildrun.Tpo -c -o stap-buildrun.o `test -f 'buildrun.cxx' || echo './'`buildrun.cxx mv -f .deps/stap-buildrun.Tpo .deps/stap-buildrun.Po make[2]: Leaving directory '/tmp/B.1d0q341v/BUILD/systemtap-5.1' make[2]: Entering directory '/tmp/B.1d0q341v/BUILD/systemtap-5.1' x86_64-pld-linux-gnux32-g++ -DHAVE_CONFIG_H -I. -DBINDIR='"/usr/bin"' -DSYSCONFDIR='"/etc"' -DPKGDATADIR='"/usr/share/systemtap"' -DPKGLIBDIR='"/usr/libexec/systemtap"' -DLOCALEDIR='"/usr/share/locale"' -DDOCDIR='"/usr/share/doc/systemtap"' -DPYEXECDIR='"/usr/libx32/python2.7/site-packages"' -DPY3EXECDIR='"/usr/libx32/python3.10/site-packages"' -I./includes -I./includes/sys -Wall -Wextra -Werror -I/usr/include/nss -I/usr/include/nspr -O2 -fwrapv -pipe -Wformat -Werror=format-security -gdwarf-4 -fno-debug-types-section -fvar-tracking-assignments -g2 -Wp,-D_FORTIFY_SOURCE=2 -fstack-protector-strong --param=ssp-buffer-size=4 -Werror=trampolines -fPIC -mtune=generic -march=x86-64 -gdwarf-4 -fno-debug-types-section -fvar-tracking-assignments -g2 -Wno-dangling-pointer -MT stap_sign_module-stap-sign-module.o -MD -MP -MF .deps/stap_sign_module-stap-sign-module.Tpo -c -o stap_sign_module-stap-sign-module.o `test -f 'stap-sign-module.cxx' || echo './'`stap-sign-module.cxx mv -f .deps/stap_sign_module-stap-sign-module.Tpo .deps/stap_sign_module-stap-sign-module.Po make[2]: Leaving directory '/tmp/B.1d0q341v/BUILD/systemtap-5.1' make[2]: Entering directory '/tmp/B.1d0q341v/BUILD/systemtap-5.1' x86_64-pld-linux-gnux32-g++ -DHAVE_CONFIG_H -I. -DBINDIR='"/usr/bin"' -DSYSCONFDIR='"/etc"' -DPKGDATADIR='"/usr/share/systemtap"' -DPKGLIBDIR='"/usr/libexec/systemtap"' -DLOCALEDIR='"/usr/share/locale"' -DDOCDIR='"/usr/share/doc/systemtap"' -DPYEXECDIR='"/usr/libx32/python2.7/site-packages"' -DPY3EXECDIR='"/usr/libx32/python3.10/site-packages"' -I./includes -I./includes/sys -DSTAP_SDT_V2 -D_REENTRANT -I/usr/include/nss -I/usr/include/nspr -Wall -Wextra -Werror -faligned-new -I/usr/include/dyninst -D_REENTRANT -I/usr/include/nss -I/usr/include/nspr -O2 -fwrapv -pipe -Wformat -Werror=format-security -gdwarf-4 -fno-debug-types-section -fvar-tracking-assignments -g2 -Wp,-D_FORTIFY_SOURCE=2 -fstack-protector-strong --param=ssp-buffer-size=4 -Werror=trampolines -fPIC -mtune=generic -march=x86-64 -gdwarf-4 -fno-debug-types-section -fvar-tracking-assignments -g2 -Wno-dangling-pointer -MT stap-cscommon.o -MD -MP -MF .deps/stap-cscommon.Tpo -c -o stap-cscommon.o `test -f 'cscommon.cxx' || echo './'`cscommon.cxx mv -f .deps/stap-cscommon.Tpo .deps/stap-cscommon.Po make[2]: Leaving directory '/tmp/B.1d0q341v/BUILD/systemtap-5.1' make[2]: Entering directory '/tmp/B.1d0q341v/BUILD/systemtap-5.1' x86_64-pld-linux-gnux32-g++ -DHAVE_CONFIG_H -I. -DBINDIR='"/usr/bin"' -DSYSCONFDIR='"/etc"' -DPKGDATADIR='"/usr/share/systemtap"' -DPKGLIBDIR='"/usr/libexec/systemtap"' -DLOCALEDIR='"/usr/share/locale"' -DDOCDIR='"/usr/share/doc/systemtap"' -DPYEXECDIR='"/usr/libx32/python2.7/site-packages"' -DPY3EXECDIR='"/usr/libx32/python3.10/site-packages"' -I./includes -I./includes/sys -Wall -Wextra -Werror -I/usr/include/nss -I/usr/include/nspr -O2 -fwrapv -pipe -Wformat -Werror=format-security -gdwarf-4 -fno-debug-types-section -fvar-tracking-assignments -g2 -Wp,-D_FORTIFY_SOURCE=2 -fstack-protector-strong --param=ssp-buffer-size=4 -Werror=trampolines -fPIC -mtune=generic -march=x86-64 -gdwarf-4 -fno-debug-types-section -fvar-tracking-assignments -g2 -Wno-dangling-pointer -MT stap_authorize_cert-stap-authorize-cert.o -MD -MP -MF .deps/stap_authorize_cert-stap-authorize-cert.Tpo -c -o stap_authorize_cert-stap-authorize-cert.o `test -f 'stap-authorize-cert.cxx' || echo './'`stap-authorize-cert.cxx mv -f .deps/stap_authorize_cert-stap-authorize-cert.Tpo .deps/stap_authorize_cert-stap-authorize-cert.Po make[2]: Leaving directory '/tmp/B.1d0q341v/BUILD/systemtap-5.1' make[2]: Entering directory '/tmp/B.1d0q341v/BUILD/systemtap-5.1' x86_64-pld-linux-gnux32-g++ -DHAVE_CONFIG_H -I. -DBINDIR='"/usr/bin"' -DSYSCONFDIR='"/etc"' -DPKGDATADIR='"/usr/share/systemtap"' -DPKGLIBDIR='"/usr/libexec/systemtap"' -DLOCALEDIR='"/usr/share/locale"' -DDOCDIR='"/usr/share/doc/systemtap"' -DPYEXECDIR='"/usr/libx32/python2.7/site-packages"' -DPY3EXECDIR='"/usr/libx32/python3.10/site-packages"' -I./includes -I./includes/sys -DSTAP_SDT_V2 -D_REENTRANT -I/usr/include/nss -I/usr/include/nspr -Wall -Wextra -Werror -faligned-new -I/usr/include/dyninst -D_REENTRANT -I/usr/include/nss -I/usr/include/nspr -O2 -fwrapv -pipe -Wformat -Werror=format-security -gdwarf-4 -fno-debug-types-section -fvar-tracking-assignments -g2 -Wp,-D_FORTIFY_SOURCE=2 -fstack-protector-strong --param=ssp-buffer-size=4 -Werror=trampolines -fPIC -mtune=generic -march=x86-64 -gdwarf-4 -fno-debug-types-section -fvar-tracking-assignments -g2 -Wno-dangling-pointer -MT stap-main.o -MD -MP -MF .deps/stap-main.Tpo -c -o stap-main.o `test -f 'main.cxx' || echo './'`main.cxx mv -f .deps/stap-main.Tpo .deps/stap-main.Po make[2]: Leaving directory '/tmp/B.1d0q341v/BUILD/systemtap-5.1' make[2]: Entering directory '/tmp/B.1d0q341v/BUILD/systemtap-5.1' x86_64-pld-linux-gnux32-g++ -DHAVE_CONFIG_H -I. -DBINDIR='"/usr/bin"' -DSYSCONFDIR='"/etc"' -DPKGDATADIR='"/usr/share/systemtap"' -DPKGLIBDIR='"/usr/libexec/systemtap"' -DLOCALEDIR='"/usr/share/locale"' -DDOCDIR='"/usr/share/doc/systemtap"' -DPYEXECDIR='"/usr/libx32/python2.7/site-packages"' -DPY3EXECDIR='"/usr/libx32/python3.10/site-packages"' -I./includes -I./includes/sys -DSTAP_SDT_V2 -D_REENTRANT -I/usr/include/nss -I/usr/include/nspr -Wall -Wextra -Werror -faligned-new -I/usr/include/dyninst -D_REENTRANT -I/usr/include/nss -I/usr/include/nspr -O2 -fwrapv -pipe -Wformat -Werror=format-security -gdwarf-4 -fno-debug-types-section -fvar-tracking-assignments -g2 -Wp,-D_FORTIFY_SOURCE=2 -fstack-protector-strong --param=ssp-buffer-size=4 -Werror=trampolines -fPIC -mtune=generic -march=x86-64 -gdwarf-4 -fno-debug-types-section -fvar-tracking-assignments -g2 -Wno-dangling-pointer -MT stap-tapset-python.o -MD -MP -MF .deps/stap-tapset-python.Tpo -c -o stap-tapset-python.o `test -f 'tapset-python.cxx' || echo './'`tapset-python.cxx mv -f .deps/stap-tapset-python.Tpo .deps/stap-tapset-python.Po make[2]: Leaving directory '/tmp/B.1d0q341v/BUILD/systemtap-5.1' make[2]: Entering directory '/tmp/B.1d0q341v/BUILD/systemtap-5.1' x86_64-pld-linux-gnux32-g++ -DHAVE_CONFIG_H -I. -DBINDIR='"/usr/bin"' -DSYSCONFDIR='"/etc"' -DPKGDATADIR='"/usr/share/systemtap"' -DPKGLIBDIR='"/usr/libexec/systemtap"' -DLOCALEDIR='"/usr/share/locale"' -DDOCDIR='"/usr/share/doc/systemtap"' -DPYEXECDIR='"/usr/libx32/python2.7/site-packages"' -DPY3EXECDIR='"/usr/libx32/python3.10/site-packages"' -I./includes -I./includes/sys -DSTAP_SDT_V2 -D_REENTRANT -I/usr/include/nss -I/usr/include/nspr -Wall -Wextra -Werror -faligned-new -I/usr/include/dyninst -D_REENTRANT -I/usr/include/nss -I/usr/include/nspr -O2 -fwrapv -pipe -Wformat -Werror=format-security -gdwarf-4 -fno-debug-types-section -fvar-tracking-assignments -g2 -Wp,-D_FORTIFY_SOURCE=2 -fstack-protector-strong --param=ssp-buffer-size=4 -Werror=trampolines -fPIC -mtune=generic -march=x86-64 -gdwarf-4 -fno-debug-types-section -fvar-tracking-assignments -g2 -Wno-dangling-pointer -MT stap-nsscommon.o -MD -MP -MF .deps/stap-nsscommon.Tpo -c -o stap-nsscommon.o `test -f 'nsscommon.cxx' || echo './'`nsscommon.cxx mv -f .deps/stap-nsscommon.Tpo .deps/stap-nsscommon.Po make[2]: Leaving directory '/tmp/B.1d0q341v/BUILD/systemtap-5.1' make[2]: Entering directory '/tmp/B.1d0q341v/BUILD/systemtap-5.1' x86_64-pld-linux-gnux32-g++ -DHAVE_CONFIG_H -I. -DBINDIR='"/usr/bin"' -DSYSCONFDIR='"/etc"' -DPKGDATADIR='"/usr/share/systemtap"' -DPKGLIBDIR='"/usr/libexec/systemtap"' -DLOCALEDIR='"/usr/share/locale"' -DDOCDIR='"/usr/share/doc/systemtap"' -DPYEXECDIR='"/usr/libx32/python2.7/site-packages"' -DPY3EXECDIR='"/usr/libx32/python3.10/site-packages"' -I./includes -I./includes/sys -DSTAP_SDT_V2 -D_REENTRANT -I/usr/include/nss -I/usr/include/nspr -Wall -Wextra -Werror -faligned-new -I/usr/include/dyninst -D_REENTRANT -I/usr/include/nss -I/usr/include/nspr -O2 -fwrapv -pipe -Wformat -Werror=format-security -gdwarf-4 -fno-debug-types-section -fvar-tracking-assignments -g2 -Wp,-D_FORTIFY_SOURCE=2 -fstack-protector-strong --param=ssp-buffer-size=4 -Werror=trampolines -fPIC -mtune=generic -march=x86-64 -gdwarf-4 -fno-debug-types-section -fvar-tracking-assignments -g2 -Wno-dangling-pointer -MT stap-staptree.o -MD -MP -MF .deps/stap-staptree.Tpo -c -o stap-staptree.o `test -f 'staptree.cxx' || echo './'`staptree.cxx mv -f .deps/stap-staptree.Tpo .deps/stap-staptree.Po make[2]: Leaving directory '/tmp/B.1d0q341v/BUILD/systemtap-5.1' make[2]: Entering directory '/tmp/B.1d0q341v/BUILD/systemtap-5.1' x86_64-pld-linux-gnux32-g++ -DHAVE_CONFIG_H -I. -DBINDIR='"/usr/bin"' -DSYSCONFDIR='"/etc"' -DPKGDATADIR='"/usr/share/systemtap"' -DPKGLIBDIR='"/usr/libexec/systemtap"' -DLOCALEDIR='"/usr/share/locale"' -DDOCDIR='"/usr/share/doc/systemtap"' -DPYEXECDIR='"/usr/libx32/python2.7/site-packages"' -DPY3EXECDIR='"/usr/libx32/python3.10/site-packages"' -I./includes -I./includes/sys -Wall -Wextra -Werror -I/usr/include/nss -I/usr/include/nspr -D_REENTRANT -O2 -fwrapv -pipe -Wformat -Werror=format-security -gdwarf-4 -fno-debug-types-section -fvar-tracking-assignments -g2 -Wp,-D_FORTIFY_SOURCE=2 -fstack-protector-strong --param=ssp-buffer-size=4 -Werror=trampolines -fPIC -mtune=generic -march=x86-64 -gdwarf-4 -fno-debug-types-section -fvar-tracking-assignments -g2 -Wno-dangling-pointer -MT stap_serverd-cmdline.o -MD -MP -MF .deps/stap_serverd-cmdline.Tpo -c -o stap_serverd-cmdline.o `test -f 'cmdline.cxx' || echo './'`cmdline.cxx mv -f .deps/stap_serverd-cmdline.Tpo .deps/stap_serverd-cmdline.Po make[2]: Leaving directory '/tmp/B.1d0q341v/BUILD/systemtap-5.1' make[2]: Entering directory '/tmp/B.1d0q341v/BUILD/systemtap-5.1' x86_64-pld-linux-gnux32-g++ -DHAVE_CONFIG_H -I. -DBINDIR='"/usr/bin"' -DSYSCONFDIR='"/etc"' -DPKGDATADIR='"/usr/share/systemtap"' -DPKGLIBDIR='"/usr/libexec/systemtap"' -DLOCALEDIR='"/usr/share/locale"' -DDOCDIR='"/usr/share/doc/systemtap"' -DPYEXECDIR='"/usr/libx32/python2.7/site-packages"' -DPY3EXECDIR='"/usr/libx32/python3.10/site-packages"' -I./includes -I./includes/sys -DSTAP_SDT_V2 -D_REENTRANT -I/usr/include/nss -I/usr/include/nspr -Wall -Wextra -Werror -faligned-new -I/usr/include/dyninst -D_REENTRANT -I/usr/include/nss -I/usr/include/nspr -O2 -fwrapv -pipe -Wformat -Werror=format-security -gdwarf-4 -fno-debug-types-section -fvar-tracking-assignments -g2 -Wp,-D_FORTIFY_SOURCE=2 -fstack-protector-strong --param=ssp-buffer-size=4 -Werror=trampolines -fPIC -mtune=generic -march=x86-64 -gdwarf-4 -fno-debug-types-section -fvar-tracking-assignments -g2 -Wno-dangling-pointer -MT stap-bpf-opt.o -MD -MP -MF .deps/stap-bpf-opt.Tpo -c -o stap-bpf-opt.o `test -f 'bpf-opt.cxx' || echo './'`bpf-opt.cxx mv -f .deps/stap-bpf-opt.Tpo .deps/stap-bpf-opt.Po make[2]: Leaving directory '/tmp/B.1d0q341v/BUILD/systemtap-5.1' make[2]: Entering directory '/tmp/B.1d0q341v/BUILD/systemtap-5.1' x86_64-pld-linux-gnux32-g++ -DHAVE_CONFIG_H -I. -DBINDIR='"/usr/bin"' -DSYSCONFDIR='"/etc"' -DPKGDATADIR='"/usr/share/systemtap"' -DPKGLIBDIR='"/usr/libexec/systemtap"' -DLOCALEDIR='"/usr/share/locale"' -DDOCDIR='"/usr/share/doc/systemtap"' -DPYEXECDIR='"/usr/libx32/python2.7/site-packages"' -DPY3EXECDIR='"/usr/libx32/python3.10/site-packages"' -I./includes -I./includes/sys -Wall -Wextra -Werror -I/usr/include/nss -I/usr/include/nspr -D_REENTRANT -O2 -fwrapv -pipe -Wformat -Werror=format-security -gdwarf-4 -fno-debug-types-section -fvar-tracking-assignments -g2 -Wp,-D_FORTIFY_SOURCE=2 -fstack-protector-strong --param=ssp-buffer-size=4 -Werror=trampolines -fPIC -mtune=generic -march=x86-64 -gdwarf-4 -fno-debug-types-section -fvar-tracking-assignments -g2 -Wno-dangling-pointer -MT stap_serverd-privilege.o -MD -MP -MF .deps/stap_serverd-privilege.Tpo -c -o stap_serverd-privilege.o `test -f 'privilege.cxx' || echo './'`privilege.cxx mv -f .deps/stap_serverd-privilege.Tpo .deps/stap_serverd-privilege.Po make[2]: Leaving directory '/tmp/B.1d0q341v/BUILD/systemtap-5.1' make[2]: Entering directory '/tmp/B.1d0q341v/BUILD/systemtap-5.1' x86_64-pld-linux-gnux32-g++ -DHAVE_CONFIG_H -I. -DBINDIR='"/usr/bin"' -DSYSCONFDIR='"/etc"' -DPKGDATADIR='"/usr/share/systemtap"' -DPKGLIBDIR='"/usr/libexec/systemtap"' -DLOCALEDIR='"/usr/share/locale"' -DDOCDIR='"/usr/share/doc/systemtap"' -DPYEXECDIR='"/usr/libx32/python2.7/site-packages"' -DPY3EXECDIR='"/usr/libx32/python3.10/site-packages"' -I./includes -I./includes/sys -Wall -Wextra -Werror -I/usr/include/nss -I/usr/include/nspr -O2 -fwrapv -pipe -Wformat -Werror=format-security -gdwarf-4 -fno-debug-types-section -fvar-tracking-assignments -g2 -Wp,-D_FORTIFY_SOURCE=2 -fstack-protector-strong --param=ssp-buffer-size=4 -Werror=trampolines -fPIC -mtune=generic -march=x86-64 -gdwarf-4 -fno-debug-types-section -fvar-tracking-assignments -g2 -Wno-dangling-pointer -MT stap_sign_module-nsscommon.o -MD -MP -MF .deps/stap_sign_module-nsscommon.Tpo -c -o stap_sign_module-nsscommon.o `test -f 'nsscommon.cxx' || echo './'`nsscommon.cxx mv -f .deps/stap_sign_module-nsscommon.Tpo .deps/stap_sign_module-nsscommon.Po make[2]: Leaving directory '/tmp/B.1d0q341v/BUILD/systemtap-5.1' make[2]: Entering directory '/tmp/B.1d0q341v/BUILD/systemtap-5.1' x86_64-pld-linux-gnux32-gcc -D_GNU_SOURCE -fexceptions -Wall -Wextra -Wunused -Wformat=2 -W -Werror -O2 -fwrapv -pipe -Wformat -Werror=format-security -gdwarf-4 -fno-debug-types-section -fvar-tracking-assignments -g2 -Wp,-D_FORTIFY_SOURCE=2 -fstack-protector-strong --param=ssp-buffer-size=4 -Werror=trampolines -fPIC -mtune=generic -march=x86-64 -gdwarf-4 -fno-debug-types-section -fvar-tracking-assignments -g2 -shared -rdynamic \ -Wl,--as-needed -Wl,--no-copy-dt-needed-entries -Wl,-z,relro -Wl,-z,combreloc -fPIC -o staplog.so staplog.c make[2]: Leaving directory '/tmp/B.1d0q341v/BUILD/systemtap-5.1' make[2]: Entering directory '/tmp/B.1d0q341v/BUILD/systemtap-5.1' x86_64-pld-linux-gnux32-g++ -DHAVE_CONFIG_H -I. -DBINDIR='"/usr/bin"' -DSYSCONFDIR='"/etc"' -DPKGDATADIR='"/usr/share/systemtap"' -DPKGLIBDIR='"/usr/libexec/systemtap"' -DLOCALEDIR='"/usr/share/locale"' -DDOCDIR='"/usr/share/doc/systemtap"' -DPYEXECDIR='"/usr/libx32/python2.7/site-packages"' -DPY3EXECDIR='"/usr/libx32/python3.10/site-packages"' -I./includes -I./includes/sys -DSTAP_SDT_V2 -D_REENTRANT -I/usr/include/nss -I/usr/include/nspr -Wall -Wextra -Werror -faligned-new -I/usr/include/dyninst -D_REENTRANT -I/usr/include/nss -I/usr/include/nspr -O2 -fwrapv -pipe -Wformat -Werror=format-security -gdwarf-4 -fno-debug-types-section -fvar-tracking-assignments -g2 -Wp,-D_FORTIFY_SOURCE=2 -fstack-protector-strong --param=ssp-buffer-size=4 -Werror=trampolines -fPIC -mtune=generic -march=x86-64 -gdwarf-4 -fno-debug-types-section -fvar-tracking-assignments -g2 -Wno-dangling-pointer -MT stap-stapregex-dfa.o -MD -MP -MF .deps/stap-stapregex-dfa.Tpo -c -o stap-stapregex-dfa.o `test -f 'stapregex-dfa.cxx' || echo './'`stapregex-dfa.cxx mv -f .deps/stap-stapregex-dfa.Tpo .deps/stap-stapregex-dfa.Po make[2]: Leaving directory '/tmp/B.1d0q341v/BUILD/systemtap-5.1' make[2]: Entering directory '/tmp/B.1d0q341v/BUILD/systemtap-5.1' x86_64-pld-linux-gnux32-g++ -DHAVE_CONFIG_H -I. -DBINDIR='"/usr/bin"' -DSYSCONFDIR='"/etc"' -DPKGDATADIR='"/usr/share/systemtap"' -DPKGLIBDIR='"/usr/libexec/systemtap"' -DLOCALEDIR='"/usr/share/locale"' -DDOCDIR='"/usr/share/doc/systemtap"' -DPYEXECDIR='"/usr/libx32/python2.7/site-packages"' -DPY3EXECDIR='"/usr/libx32/python3.10/site-packages"' -I./includes -I./includes/sys -DSTAP_SDT_V2 -D_REENTRANT -I/usr/include/nss -I/usr/include/nspr -Wall -Wextra -Werror -faligned-new -I/usr/include/dyninst -D_REENTRANT -I/usr/include/nss -I/usr/include/nspr -O2 -fwrapv -pipe -Wformat -Werror=format-security -gdwarf-4 -fno-debug-types-section -fvar-tracking-assignments -g2 -Wp,-D_FORTIFY_SOURCE=2 -fstack-protector-strong --param=ssp-buffer-size=4 -Werror=trampolines -fPIC -mtune=generic -march=x86-64 -gdwarf-4 -fno-debug-types-section -fvar-tracking-assignments -g2 -Wno-dangling-pointer -MT stap-loc2stap.o -MD -MP -MF .deps/stap-loc2stap.Tpo -c -o stap-loc2stap.o `test -f 'loc2stap.cxx' || echo './'`loc2stap.cxx mv -f .deps/stap-loc2stap.Tpo .deps/stap-loc2stap.Po make[2]: Leaving directory '/tmp/B.1d0q341v/BUILD/systemtap-5.1' make[2]: Entering directory '/tmp/B.1d0q341v/BUILD/systemtap-5.1' x86_64-pld-linux-gnux32-gcc -D_GNU_SOURCE -fexceptions -Wall -Wextra -Wunused -Wformat=2 -W -Werror -I/usr/include/libxml2 -O2 -fwrapv -pipe -Wformat -Werror=format-security -gdwarf-4 -fno-debug-types-section -fvar-tracking-assignments -g2 -Wp,-D_FORTIFY_SOURCE=2 -fstack-protector-strong --param=ssp-buffer-size=4 -Werror=trampolines -fPIC -mtune=generic -march=x86-64 -gdwarf-4 -fno-debug-types-section -fvar-tracking-assignments -g2 -Wl,--as-needed -Wl,--no-copy-dt-needed-entries -Wl,-z,relro -Wl,-z,combreloc -o stapvirt stapvirt-stapvirt.o -lvirt -lxml2 make[2]: Leaving directory '/tmp/B.1d0q341v/BUILD/systemtap-5.1' make[2]: Entering directory '/tmp/B.1d0q341v/BUILD/systemtap-5.1' x86_64-pld-linux-gnux32-g++ -DHAVE_CONFIG_H -I. -DBINDIR='"/usr/bin"' -DSYSCONFDIR='"/etc"' -DPKGDATADIR='"/usr/share/systemtap"' -DPKGLIBDIR='"/usr/libexec/systemtap"' -DLOCALEDIR='"/usr/share/locale"' -DDOCDIR='"/usr/share/doc/systemtap"' -DPYEXECDIR='"/usr/libx32/python2.7/site-packages"' -DPY3EXECDIR='"/usr/libx32/python3.10/site-packages"' -I./includes -I./includes/sys -Wall -Wextra -Werror -I/usr/include/nss -I/usr/include/nspr -D_REENTRANT -O2 -fwrapv -pipe -Wformat -Werror=format-security -gdwarf-4 -fno-debug-types-section -fvar-tracking-assignments -g2 -Wp,-D_FORTIFY_SOURCE=2 -fstack-protector-strong --param=ssp-buffer-size=4 -Werror=trampolines -fPIC -mtune=generic -march=x86-64 -gdwarf-4 -fno-debug-types-section -fvar-tracking-assignments -g2 -Wno-dangling-pointer -MT stap_serverd-cscommon.o -MD -MP -MF .deps/stap_serverd-cscommon.Tpo -c -o stap_serverd-cscommon.o `test -f 'cscommon.cxx' || echo './'`cscommon.cxx mv -f .deps/stap_serverd-cscommon.Tpo .deps/stap_serverd-cscommon.Po make[2]: Leaving directory '/tmp/B.1d0q341v/BUILD/systemtap-5.1' make[2]: Entering directory '/tmp/B.1d0q341v/BUILD/systemtap-5.1' x86_64-pld-linux-gnux32-g++ -DHAVE_CONFIG_H -I. -DBINDIR='"/usr/bin"' -DSYSCONFDIR='"/etc"' -DPKGDATADIR='"/usr/share/systemtap"' -DPKGLIBDIR='"/usr/libexec/systemtap"' -DLOCALEDIR='"/usr/share/locale"' -DDOCDIR='"/usr/share/doc/systemtap"' -DPYEXECDIR='"/usr/libx32/python2.7/site-packages"' -DPY3EXECDIR='"/usr/libx32/python3.10/site-packages"' -I./includes -I./includes/sys -Wall -Wextra -Werror -I/usr/include/nss -I/usr/include/nspr -O2 -fwrapv -pipe -Wformat -Werror=format-security -gdwarf-4 -fno-debug-types-section -fvar-tracking-assignments -g2 -Wp,-D_FORTIFY_SOURCE=2 -fstack-protector-strong --param=ssp-buffer-size=4 -Werror=trampolines -fPIC -mtune=generic -march=x86-64 -gdwarf-4 -fno-debug-types-section -fvar-tracking-assignments -g2 -Wno-dangling-pointer -MT stap_gen_cert-stap-gen-cert.o -MD -MP -MF .deps/stap_gen_cert-stap-gen-cert.Tpo -c -o stap_gen_cert-stap-gen-cert.o `test -f 'stap-gen-cert.cxx' || echo './'`stap-gen-cert.cxx mv -f .deps/stap_gen_cert-stap-gen-cert.Tpo .deps/stap_gen_cert-stap-gen-cert.Po make[2]: Leaving directory '/tmp/B.1d0q341v/BUILD/systemtap-5.1' make[2]: Entering directory '/tmp/B.1d0q341v/BUILD/systemtap-5.1' x86_64-pld-linux-gnux32-g++ -DHAVE_CONFIG_H -I. -DBINDIR='"/usr/bin"' -DSYSCONFDIR='"/etc"' -DPKGDATADIR='"/usr/share/systemtap"' -DPKGLIBDIR='"/usr/libexec/systemtap"' -DLOCALEDIR='"/usr/share/locale"' -DDOCDIR='"/usr/share/doc/systemtap"' -DPYEXECDIR='"/usr/libx32/python2.7/site-packages"' -DPY3EXECDIR='"/usr/libx32/python3.10/site-packages"' -I./includes -I./includes/sys -Wall -Wextra -Werror -I/usr/include/nss -I/usr/include/nspr -O2 -fwrapv -pipe -Wformat -Werror=format-security -gdwarf-4 -fno-debug-types-section -fvar-tracking-assignments -g2 -Wp,-D_FORTIFY_SOURCE=2 -fstack-protector-strong --param=ssp-buffer-size=4 -Werror=trampolines -fPIC -mtune=generic -march=x86-64 -gdwarf-4 -fno-debug-types-section -fvar-tracking-assignments -g2 -Wno-dangling-pointer -MT stap_authorize_cert-nsscommon.o -MD -MP -MF .deps/stap_authorize_cert-nsscommon.Tpo -c -o stap_authorize_cert-nsscommon.o `test -f 'nsscommon.cxx' || echo './'`nsscommon.cxx mv -f .deps/stap_authorize_cert-nsscommon.Tpo .deps/stap_authorize_cert-nsscommon.Po make[2]: Leaving directory '/tmp/B.1d0q341v/BUILD/systemtap-5.1' make[2]: Entering directory '/tmp/B.1d0q341v/BUILD/systemtap-5.1' x86_64-pld-linux-gnux32-g++ -DHAVE_CONFIG_H -I. -DBINDIR='"/usr/bin"' -DSYSCONFDIR='"/etc"' -DPKGDATADIR='"/usr/share/systemtap"' -DPKGLIBDIR='"/usr/libexec/systemtap"' -DLOCALEDIR='"/usr/share/locale"' -DDOCDIR='"/usr/share/doc/systemtap"' -DPYEXECDIR='"/usr/libx32/python2.7/site-packages"' -DPY3EXECDIR='"/usr/libx32/python3.10/site-packages"' -I./includes -I./includes/sys -DSTAP_SDT_V2 -D_REENTRANT -I/usr/include/nss -I/usr/include/nspr -Wall -Wextra -Werror -faligned-new -I/usr/include/dyninst -D_REENTRANT -I/usr/include/nss -I/usr/include/nspr -O2 -fwrapv -pipe -Wformat -Werror=format-security -gdwarf-4 -fno-debug-types-section -fvar-tracking-assignments -g2 -Wp,-D_FORTIFY_SOURCE=2 -fstack-protector-strong --param=ssp-buffer-size=4 -Werror=trampolines -fPIC -mtune=generic -march=x86-64 -gdwarf-4 -fno-debug-types-section -fvar-tracking-assignments -g2 -Wno-dangling-pointer -MT language-server/stap-jsonrpc.o -MD -MP -MF language-server/.deps/stap-jsonrpc.Tpo -c -o language-server/stap-jsonrpc.o `test -f 'language-server/jsonrpc.cxx' || echo './'`language-server/jsonrpc.cxx mv -f language-server/.deps/stap-jsonrpc.Tpo language-server/.deps/stap-jsonrpc.Po make[2]: Leaving directory '/tmp/B.1d0q341v/BUILD/systemtap-5.1' make[2]: Entering directory '/tmp/B.1d0q341v/BUILD/systemtap-5.1' x86_64-pld-linux-gnux32-g++ -DHAVE_CONFIG_H -I. -DBINDIR='"/usr/bin"' -DSYSCONFDIR='"/etc"' -DPKGDATADIR='"/usr/share/systemtap"' -DPKGLIBDIR='"/usr/libexec/systemtap"' -DLOCALEDIR='"/usr/share/locale"' -DDOCDIR='"/usr/share/doc/systemtap"' -DPYEXECDIR='"/usr/libx32/python2.7/site-packages"' -DPY3EXECDIR='"/usr/libx32/python3.10/site-packages"' -I./includes -I./includes/sys -DSTAP_SDT_V2 -D_REENTRANT -I/usr/include/nss -I/usr/include/nspr -Wall -Wextra -Werror -faligned-new -I/usr/include/dyninst -D_REENTRANT -I/usr/include/nss -I/usr/include/nspr -O2 -fwrapv -pipe -Wformat -Werror=format-security -gdwarf-4 -fno-debug-types-section -fvar-tracking-assignments -g2 -Wp,-D_FORTIFY_SOURCE=2 -fstack-protector-strong --param=ssp-buffer-size=4 -Werror=trampolines -fPIC -mtune=generic -march=x86-64 -gdwarf-4 -fno-debug-types-section -fvar-tracking-assignments -g2 -Wno-dangling-pointer -MT stap-session.o -MD -MP -MF .deps/stap-session.Tpo -c -o stap-session.o `test -f 'session.cxx' || echo './'`session.cxx mv -f .deps/stap-session.Tpo .deps/stap-session.Po make[2]: Leaving directory '/tmp/B.1d0q341v/BUILD/systemtap-5.1' make[2]: Entering directory '/tmp/B.1d0q341v/BUILD/systemtap-5.1' x86_64-pld-linux-gnux32-g++ -DHAVE_CONFIG_H -I. -DBINDIR='"/usr/bin"' -DSYSCONFDIR='"/etc"' -DPKGDATADIR='"/usr/share/systemtap"' -DPKGLIBDIR='"/usr/libexec/systemtap"' -DLOCALEDIR='"/usr/share/locale"' -DDOCDIR='"/usr/share/doc/systemtap"' -DPYEXECDIR='"/usr/libx32/python2.7/site-packages"' -DPY3EXECDIR='"/usr/libx32/python3.10/site-packages"' -I./includes -I./includes/sys -Wall -Wextra -Werror -I/usr/include/nss -I/usr/include/nspr -D_REENTRANT -O2 -fwrapv -pipe -Wformat -Werror=format-security -gdwarf-4 -fno-debug-types-section -fvar-tracking-assignments -g2 -Wp,-D_FORTIFY_SOURCE=2 -fstack-protector-strong --param=ssp-buffer-size=4 -Werror=trampolines -fPIC -mtune=generic -march=x86-64 -gdwarf-4 -fno-debug-types-section -fvar-tracking-assignments -g2 -Wno-dangling-pointer -MT stap_serverd-nsscommon.o -MD -MP -MF .deps/stap_serverd-nsscommon.Tpo -c -o stap_serverd-nsscommon.o `test -f 'nsscommon.cxx' || echo './'`nsscommon.cxx mv -f .deps/stap_serverd-nsscommon.Tpo .deps/stap_serverd-nsscommon.Po make[2]: Leaving directory '/tmp/B.1d0q341v/BUILD/systemtap-5.1' make[2]: Entering directory '/tmp/B.1d0q341v/BUILD/systemtap-5.1' x86_64-pld-linux-gnux32-g++ -DHAVE_CONFIG_H -I. -DBINDIR='"/usr/bin"' -DSYSCONFDIR='"/etc"' -DPKGDATADIR='"/usr/share/systemtap"' -DPKGLIBDIR='"/usr/libexec/systemtap"' -DLOCALEDIR='"/usr/share/locale"' -DDOCDIR='"/usr/share/doc/systemtap"' -DPYEXECDIR='"/usr/libx32/python2.7/site-packages"' -DPY3EXECDIR='"/usr/libx32/python3.10/site-packages"' -I./includes -I./includes/sys -DSTAP_SDT_V2 -D_REENTRANT -I/usr/include/nss -I/usr/include/nspr -Wall -Wextra -Werror -faligned-new -I/usr/include/dyninst -D_REENTRANT -I/usr/include/nss -I/usr/include/nspr -O2 -fwrapv -pipe -Wformat -Werror=format-security -gdwarf-4 -fno-debug-types-section -fvar-tracking-assignments -g2 -Wp,-D_FORTIFY_SOURCE=2 -fstack-protector-strong --param=ssp-buffer-size=4 -Werror=trampolines -fPIC -mtune=generic -march=x86-64 -gdwarf-4 -fno-debug-types-section -fvar-tracking-assignments -g2 -Wno-dangling-pointer -MT stap-client-nss.o -MD -MP -MF .deps/stap-client-nss.Tpo -c -o stap-client-nss.o `test -f 'client-nss.cxx' || echo './'`client-nss.cxx mv -f .deps/stap-client-nss.Tpo .deps/stap-client-nss.Po make[2]: Leaving directory '/tmp/B.1d0q341v/BUILD/systemtap-5.1' make[2]: Entering directory '/tmp/B.1d0q341v/BUILD/systemtap-5.1' x86_64-pld-linux-gnux32-g++ -DHAVE_CONFIG_H -I. -DBINDIR='"/usr/bin"' -DSYSCONFDIR='"/etc"' -DPKGDATADIR='"/usr/share/systemtap"' -DPKGLIBDIR='"/usr/libexec/systemtap"' -DLOCALEDIR='"/usr/share/locale"' -DDOCDIR='"/usr/share/doc/systemtap"' -DPYEXECDIR='"/usr/libx32/python2.7/site-packages"' -DPY3EXECDIR='"/usr/libx32/python3.10/site-packages"' -I./includes -I./includes/sys -DSTAP_SDT_V2 -D_REENTRANT -I/usr/include/nss -I/usr/include/nspr -Wall -Wextra -Werror -faligned-new -I/usr/include/dyninst -D_REENTRANT -I/usr/include/nss -I/usr/include/nspr -O2 -fwrapv -pipe -Wformat -Werror=format-security -gdwarf-4 -fno-debug-types-section -fvar-tracking-assignments -g2 -Wp,-D_FORTIFY_SOURCE=2 -fstack-protector-strong --param=ssp-buffer-size=4 -Werror=trampolines -fPIC -mtune=generic -march=x86-64 -gdwarf-4 -fno-debug-types-section -fvar-tracking-assignments -g2 -Wno-dangling-pointer -MT stap-interactive.o -MD -MP -MF .deps/stap-interactive.Tpo -c -o stap-interactive.o `test -f 'interactive.cxx' || echo './'`interactive.cxx mv -f .deps/stap-interactive.Tpo .deps/stap-interactive.Po make[2]: Leaving directory '/tmp/B.1d0q341v/BUILD/systemtap-5.1' make[2]: Entering directory '/tmp/B.1d0q341v/BUILD/systemtap-5.1' x86_64-pld-linux-gnux32-g++ -DHAVE_CONFIG_H -I. -DBINDIR='"/usr/bin"' -DSYSCONFDIR='"/etc"' -DPKGDATADIR='"/usr/share/systemtap"' -DPKGLIBDIR='"/usr/libexec/systemtap"' -DLOCALEDIR='"/usr/share/locale"' -DDOCDIR='"/usr/share/doc/systemtap"' -DPYEXECDIR='"/usr/libx32/python2.7/site-packages"' -DPY3EXECDIR='"/usr/libx32/python3.10/site-packages"' -I./includes -I./includes/sys -Wall -Wextra -Werror -I/usr/include/nss -I/usr/include/nspr -O2 -fwrapv -pipe -Wformat -Werror=format-security -gdwarf-4 -fno-debug-types-section -fvar-tracking-assignments -g2 -Wp,-D_FORTIFY_SOURCE=2 -fstack-protector-strong --param=ssp-buffer-size=4 -Werror=trampolines -fPIC -mtune=generic -march=x86-64 -gdwarf-4 -fno-debug-types-section -fvar-tracking-assignments -g2 -Wno-dangling-pointer -MT stap_gen_cert-nsscommon.o -MD -MP -MF .deps/stap_gen_cert-nsscommon.Tpo -c -o stap_gen_cert-nsscommon.o `test -f 'nsscommon.cxx' || echo './'`nsscommon.cxx mv -f .deps/stap_gen_cert-nsscommon.Tpo .deps/stap_gen_cert-nsscommon.Po make[2]: Leaving directory '/tmp/B.1d0q341v/BUILD/systemtap-5.1' make[2]: Entering directory '/tmp/B.1d0q341v/BUILD/systemtap-5.1' x86_64-pld-linux-gnux32-g++ -DHAVE_CONFIG_H -I. -DBINDIR='"/usr/bin"' -DSYSCONFDIR='"/etc"' -DPKGDATADIR='"/usr/share/systemtap"' -DPKGLIBDIR='"/usr/libexec/systemtap"' -DLOCALEDIR='"/usr/share/locale"' -DDOCDIR='"/usr/share/doc/systemtap"' -DPYEXECDIR='"/usr/libx32/python2.7/site-packages"' -DPY3EXECDIR='"/usr/libx32/python3.10/site-packages"' -I./includes -I./includes/sys -DSTAP_SDT_V2 -D_REENTRANT -I/usr/include/nss -I/usr/include/nspr -Wall -Wextra -Werror -faligned-new -I/usr/include/dyninst -D_REENTRANT -I/usr/include/nss -I/usr/include/nspr -O2 -fwrapv -pipe -Wformat -Werror=format-security -gdwarf-4 -fno-debug-types-section -fvar-tracking-assignments -g2 -Wp,-D_FORTIFY_SOURCE=2 -fstack-protector-strong --param=ssp-buffer-size=4 -Werror=trampolines -fPIC -mtune=generic -march=x86-64 -gdwarf-4 -fno-debug-types-section -fvar-tracking-assignments -g2 -Wno-dangling-pointer -MT stap-nss-server-info.o -MD -MP -MF .deps/stap-nss-server-info.Tpo -c -o stap-nss-server-info.o `test -f 'nss-server-info.cxx' || echo './'`nss-server-info.cxx mv -f .deps/stap-nss-server-info.Tpo .deps/stap-nss-server-info.Po make[2]: Leaving directory '/tmp/B.1d0q341v/BUILD/systemtap-5.1' make[2]: Entering directory '/tmp/B.1d0q341v/BUILD/systemtap-5.1' x86_64-pld-linux-gnux32-g++ -DHAVE_CONFIG_H -I. -DBINDIR='"/usr/bin"' -DSYSCONFDIR='"/etc"' -DPKGDATADIR='"/usr/share/systemtap"' -DPKGLIBDIR='"/usr/libexec/systemtap"' -DLOCALEDIR='"/usr/share/locale"' -DDOCDIR='"/usr/share/doc/systemtap"' -DPYEXECDIR='"/usr/libx32/python2.7/site-packages"' -DPY3EXECDIR='"/usr/libx32/python3.10/site-packages"' -I./includes -I./includes/sys -Wall -Wextra -Werror -I/usr/include/nss -I/usr/include/nspr -O2 -fwrapv -pipe -Wformat -Werror=format-security -gdwarf-4 -fno-debug-types-section -fvar-tracking-assignments -g2 -Wp,-D_FORTIFY_SOURCE=2 -fstack-protector-strong --param=ssp-buffer-size=4 -Werror=trampolines -fPIC -mtune=generic -march=x86-64 -gdwarf-4 -fno-debug-types-section -fvar-tracking-assignments -g2 -Wno-dangling-pointer -MT stap_sign_module-util.o -MD -MP -MF .deps/stap_sign_module-util.Tpo -c -o stap_sign_module-util.o `test -f 'util.cxx' || echo './'`util.cxx mv -f .deps/stap_sign_module-util.Tpo .deps/stap_sign_module-util.Po make[2]: Leaving directory '/tmp/B.1d0q341v/BUILD/systemtap-5.1' make[2]: Entering directory '/tmp/B.1d0q341v/BUILD/systemtap-5.1' x86_64-pld-linux-gnux32-g++ -DHAVE_CONFIG_H -I. -DBINDIR='"/usr/bin"' -DSYSCONFDIR='"/etc"' -DPKGDATADIR='"/usr/share/systemtap"' -DPKGLIBDIR='"/usr/libexec/systemtap"' -DLOCALEDIR='"/usr/share/locale"' -DDOCDIR='"/usr/share/doc/systemtap"' -DPYEXECDIR='"/usr/libx32/python2.7/site-packages"' -DPY3EXECDIR='"/usr/libx32/python3.10/site-packages"' -I./includes -I./includes/sys -DSTAP_SDT_V2 -D_REENTRANT -I/usr/include/nss -I/usr/include/nspr -Wall -Wextra -Werror -faligned-new -I/usr/include/dyninst -D_REENTRANT -I/usr/include/nss -I/usr/include/nspr -O2 -fwrapv -pipe -Wformat -Werror=format-security -gdwarf-4 -fno-debug-types-section -fvar-tracking-assignments -g2 -Wp,-D_FORTIFY_SOURCE=2 -fstack-protector-strong --param=ssp-buffer-size=4 -Werror=trampolines -fPIC -mtune=generic -march=x86-64 -gdwarf-4 -fno-debug-types-section -fvar-tracking-assignments -g2 -Wno-dangling-pointer -MT stap-analysis.o -MD -MP -MF .deps/stap-analysis.Tpo -c -o stap-analysis.o `test -f 'analysis.cxx' || echo './'`analysis.cxx mv -f .deps/stap-analysis.Tpo .deps/stap-analysis.Po make[2]: Leaving directory '/tmp/B.1d0q341v/BUILD/systemtap-5.1' make[2]: Entering directory '/tmp/B.1d0q341v/BUILD/systemtap-5.1' x86_64-pld-linux-gnux32-g++ -Wall -Wextra -Werror -I/usr/include/nss -I/usr/include/nspr -O2 -fwrapv -pipe -Wformat -Werror=format-security -gdwarf-4 -fno-debug-types-section -fvar-tracking-assignments -g2 -Wp,-D_FORTIFY_SOURCE=2 -fstack-protector-strong --param=ssp-buffer-size=4 -Werror=trampolines -fPIC -mtune=generic -march=x86-64 -gdwarf-4 -fno-debug-types-section -fvar-tracking-assignments -g2 -Wno-dangling-pointer -Wl,--as-needed -Wl,--no-copy-dt-needed-entries -Wl,-z,relro -Wl,-z,combreloc -o stap-sign-module stap_sign_module-stap-sign-module.o stap_sign_module-nsscommon.o stap_sign_module-util.o -lnss3 -lnssutil3 -lsmime3 -lssl3 -lsoftokn3 -lplds4 -lplc4 -lnspr4 -ldebuginfod -lssl -lcrypto make[2]: Leaving directory '/tmp/B.1d0q341v/BUILD/systemtap-5.1' make[2]: Entering directory '/tmp/B.1d0q341v/BUILD/systemtap-5.1' x86_64-pld-linux-gnux32-g++ -DHAVE_CONFIG_H -I. -DBINDIR='"/usr/bin"' -DSYSCONFDIR='"/etc"' -DPKGDATADIR='"/usr/share/systemtap"' -DPKGLIBDIR='"/usr/libexec/systemtap"' -DLOCALEDIR='"/usr/share/locale"' -DDOCDIR='"/usr/share/doc/systemtap"' -DPYEXECDIR='"/usr/libx32/python2.7/site-packages"' -DPY3EXECDIR='"/usr/libx32/python3.10/site-packages"' -I./includes -I./includes/sys -DSTAP_SDT_V2 -D_REENTRANT -I/usr/include/nss -I/usr/include/nspr -Wall -Wextra -Werror -faligned-new -I/usr/include/dyninst -D_REENTRANT -I/usr/include/nss -I/usr/include/nspr -O2 -fwrapv -pipe -Wformat -Werror=format-security -gdwarf-4 -fno-debug-types-section -fvar-tracking-assignments -g2 -Wp,-D_FORTIFY_SOURCE=2 -fstack-protector-strong --param=ssp-buffer-size=4 -Werror=trampolines -fPIC -mtune=generic -march=x86-64 -gdwarf-4 -fno-debug-types-section -fvar-tracking-assignments -g2 -Wno-dangling-pointer -MT stap-client-http.o -MD -MP -MF .deps/stap-client-http.Tpo -c -o stap-client-http.o `test -f 'client-http.cxx' || echo './'`client-http.cxx client-http.cxx: In member function 'bool http_client::post(const std::string&, std::vector<std::tuple<std::__cxx11::basic_string<char, std::char_traits<char>, std::allocator<char> >, std::__cxx11::basic_string<char, std::char_traits<char>, std::allocator<char> > > >&)': client-http.cxx:707:21: error: 'CURLFORM_COPYNAME' is deprecated: since 7.56.0. Use curl_mime_name() [-Werror=deprecated-declarations] 707 | CURLFORM_COPYNAME, filebase.c_str(), | ^~~~~~~~~~~~~~~~~ In file included from client-http.cxx:28: /usr/include/curl/curl.h:2509:3: note: declared here 2509 | CURLFORM_COPYNAME CURL_DEPRECATED(7.56.0, "Use curl_mime_name()"), | ^~~~~~~~~~~~~~~~~ client-http.cxx:708:21: error: 'CURLFORM_FILE' is deprecated: since 7.56.0. Use curl_mime_filedata() [-Werror=deprecated-declarations] 708 | CURLFORM_FILE, filename.c_str(), | ^~~~~~~~~~~~~ /usr/include/curl/curl.h:2518:3: note: declared here 2518 | CURLFORM_FILE CURL_DEPRECATED(7.56.0, "Use curl_mime_filedata()"), | ^~~~~~~~~~~~~ client-http.cxx:706:20: error: 'CURLFORMcode curl_formadd(curl_httppost**, curl_httppost**, ...)' is deprecated: since 7.56.0. Use curl_mime_init() [-Werror=deprecated-declarations] 706 | curl_formadd (&formpost, &lastptr, | ~~~~~~~~~~~~~^~~~~~~~~~~~~~~~~~~~~ 707 | CURLFORM_COPYNAME, filebase.c_str(), | ~~~~~~~~~~~~~~~~~~~~~~~~~~~~~~~~~~~~ 708 | CURLFORM_FILE, filename.c_str(), | ~~~~~~~~~~~~~~~~~~~~~~~~~~~~~~~~ 709 | CURLFORM_END); | ~~~~~~~~~~~~~ /usr/include/curl/curl.h:2584:1: note: declared here 2584 | curl_formadd(struct curl_httppost **httppost, | ^~~~~~~~~~~~ client-http.cxx:711:21: error: 'CURLFORM_COPYNAME' is deprecated: since 7.56.0. Use curl_mime_name() [-Werror=deprecated-declarations] 711 | CURLFORM_COPYNAME, "files", | ^~~~~~~~~~~~~~~~~ /usr/include/curl/curl.h:2509:3: note: declared here 2509 | CURLFORM_COPYNAME CURL_DEPRECATED(7.56.0, "Use curl_mime_name()"), | ^~~~~~~~~~~~~~~~~ client-http.cxx:712:21: error: 'CURLFORM_COPYCONTENTS' is deprecated: since 7.56.0. Use curl_mime_data() [-Werror=deprecated-declarations] 712 | CURLFORM_COPYCONTENTS, filename.c_str(), | ^~~~~~~~~~~~~~~~~~~~~ /usr/include/curl/curl.h:2512:3: note: declared here 2512 | CURLFORM_COPYCONTENTS CURL_DEPRECATED(7.56.0, "Use curl_mime_data()"), | ^~~~~~~~~~~~~~~~~~~~~ client-http.cxx:710:20: error: 'CURLFORMcode curl_formadd(curl_httppost**, curl_httppost**, ...)' is deprecated: since 7.56.0. Use curl_mime_init() [-Werror=deprecated-declarations] 710 | curl_formadd (&formpost, &lastptr, | ~~~~~~~~~~~~~^~~~~~~~~~~~~~~~~~~~~ 711 | CURLFORM_COPYNAME, "files", | ~~~~~~~~~~~~~~~~~~~~~~~~~~~ 712 | CURLFORM_COPYCONTENTS, filename.c_str(), | ~~~~~~~~~~~~~~~~~~~~~~~~~~~~~~~~~~~~~~~~ 713 | CURLFORM_END); | ~~~~~~~~~~~~~ /usr/include/curl/curl.h:2584:1: note: declared here 2584 | curl_formadd(struct curl_httppost **httppost, | ^~~~~~~~~~~~ client-http.cxx:762:7: error: 'CURLFORM_COPYNAME' is deprecated: since 7.56.0. Use curl_mime_name() [-Werror=deprecated-declarations] 762 | CURLFORM_COPYNAME, "command_environment", | ^~~~~~~~~~~~~~~~~ /usr/include/curl/curl.h:2509:3: note: declared here 2509 | CURLFORM_COPYNAME CURL_DEPRECATED(7.56.0, "Use curl_mime_name()"), | ^~~~~~~~~~~~~~~~~ client-http.cxx:763:7: error: 'CURLFORM_CONTENTTYPE' is deprecated: since 7.56.0. Use curl_mime_type() [-Werror=deprecated-declarations] 763 | CURLFORM_CONTENTTYPE, "application/json", | ^~~~~~~~~~~~~~~~~~~~ /usr/include/curl/curl.h:2524:3: note: declared here 2524 | CURLFORM_CONTENTTYPE CURL_DEPRECATED(7.56.0, "Use curl_mime_type()"), | ^~~~~~~~~~~~~~~~~~~~ client-http.cxx:764:7: error: 'CURLFORM_COPYCONTENTS' is deprecated: since 7.56.0. Use curl_mime_data() [-Werror=deprecated-declarations] 764 | CURLFORM_COPYCONTENTS, | ^~~~~~~~~~~~~~~~~~~~~ /usr/include/curl/curl.h:2512:3: note: declared here 2512 | CURLFORM_COPYCONTENTS CURL_DEPRECATED(7.56.0, "Use curl_mime_data()"), | ^~~~~~~~~~~~~~~~~~~~~ client-http.cxx:761:16: error: 'CURLFORMcode curl_formadd(curl_httppost**, curl_httppost**, ...)' is deprecated: since 7.56.0. Use curl_mime_init() [-Werror=deprecated-declarations] 761 | curl_formadd (&formpost, &lastptr, | ~~~~~~~~~~~~~^~~~~~~~~~~~~~~~~~~~~ 762 | CURLFORM_COPYNAME, "command_environment", | ~~~~~~~~~~~~~~~~~~~~~~~~~~~~~~~~~~~~~~~~~ 763 | CURLFORM_CONTENTTYPE, "application/json", | ~~~~~~~~~~~~~~~~~~~~~~~~~~~~~~~~~~~~~~~~~ 764 | CURLFORM_COPYCONTENTS, | ~~~~~~~~~~~~~~~~~~~~~~ 765 | json_object_to_json_string_ext (jobj, JSON_C_TO_STRING_PLAIN), | ~~~~~~~~~~~~~~~~~~~~~~~~~~~~~~~~~~~~~~~~~~~~~~~~~~~~~~~~~~~~~~ 766 | CURLFORM_END); | ~~~~~~~~~~~~~ /usr/include/curl/curl.h:2584:1: note: declared here 2584 | curl_formadd(struct curl_httppost **httppost, | ^~~~~~~~~~~~ client-http.cxx:773:27: error: 'CURLOPT_HTTPPOST' is deprecated: since 7.56.0. Use CURLOPT_MIMEPOST [-Werror=deprecated-declarations] 773 | curl_easy_setopt (curl, CURLOPT_HTTPPOST, formpost); | ^~~~~~~~~~~~~~~~ /usr/include/curl/curl.h:1195:3: note: declared here 1195 | CURLOPTDEPRECATED(CURLOPT_HTTPPOST, CURLOPTTYPE_OBJECTPOINT, 24, | ^~~~~~~~~~~~~~~~~ client-http.cxx:843:17: error: 'void curl_formfree(curl_httppost*)' is deprecated: since 7.56.0. Use curl_mime_free() [-Werror=deprecated-declarations] 843 | curl_formfree (formpost); | ~~~~~~~~~~~~~~^~~~~~~~~~ /usr/include/curl/curl.h:2620:1: note: declared here 2620 | curl_formfree(struct curl_httppost *form); | ^~~~~~~~~~~~~ cc1plus: all warnings being treated as errors make[2]: *** [Makefile:1970: stap-client-http.o] Error 1 make[2]: Leaving directory '/tmp/B.1d0q341v/BUILD/systemtap-5.1' make[2]: *** Waiting for unfinished jobs.... make[2]: Entering directory '/tmp/B.1d0q341v/BUILD/systemtap-5.1' x86_64-pld-linux-gnux32-g++ -DHAVE_CONFIG_H -I. -DBINDIR='"/usr/bin"' -DSYSCONFDIR='"/etc"' -DPKGDATADIR='"/usr/share/systemtap"' -DPKGLIBDIR='"/usr/libexec/systemtap"' -DLOCALEDIR='"/usr/share/locale"' -DDOCDIR='"/usr/share/doc/systemtap"' -DPYEXECDIR='"/usr/libx32/python2.7/site-packages"' -DPY3EXECDIR='"/usr/libx32/python3.10/site-packages"' -I./includes -I./includes/sys -DSTAP_SDT_V2 -D_REENTRANT -I/usr/include/nss -I/usr/include/nspr -Wall -Wextra -Werror -faligned-new -I/usr/include/dyninst -D_REENTRANT -I/usr/include/nss -I/usr/include/nspr -O2 -fwrapv -pipe -Wformat -Werror=format-security -gdwarf-4 -fno-debug-types-section -fvar-tracking-assignments -g2 -Wp,-D_FORTIFY_SOURCE=2 -fstack-protector-strong --param=ssp-buffer-size=4 -Werror=trampolines -fPIC -mtune=generic -march=x86-64 -gdwarf-4 -fno-debug-types-section -fvar-tracking-assignments -g2 -Wno-dangling-pointer -MT stap-bpf-base.o -MD -MP -MF .deps/stap-bpf-base.Tpo -c -o stap-bpf-base.o `test -f 'bpf-base.cxx' || echo './'`bpf-base.cxx mv -f .deps/stap-bpf-base.Tpo .deps/stap-bpf-base.Po make[2]: Leaving directory '/tmp/B.1d0q341v/BUILD/systemtap-5.1' make[2]: Entering directory '/tmp/B.1d0q341v/BUILD/systemtap-5.1' x86_64-pld-linux-gnux32-g++ -DHAVE_CONFIG_H -I. -DBINDIR='"/usr/bin"' -DSYSCONFDIR='"/etc"' -DPKGDATADIR='"/usr/share/systemtap"' -DPKGLIBDIR='"/usr/libexec/systemtap"' -DLOCALEDIR='"/usr/share/locale"' -DDOCDIR='"/usr/share/doc/systemtap"' -DPYEXECDIR='"/usr/libx32/python2.7/site-packages"' -DPY3EXECDIR='"/usr/libx32/python3.10/site-packages"' -I./includes -I./includes/sys -Wall -Wextra -Werror -I/usr/include/nss -I/usr/include/nspr -O2 -fwrapv -pipe -Wformat -Werror=format-security -gdwarf-4 -fno-debug-types-section -fvar-tracking-assignments -g2 -Wp,-D_FORTIFY_SOURCE=2 -fstack-protector-strong --param=ssp-buffer-size=4 -Werror=trampolines -fPIC -mtune=generic -march=x86-64 -gdwarf-4 -fno-debug-types-section -fvar-tracking-assignments -g2 -Wno-dangling-pointer -MT stap_authorize_cert-util.o -MD -MP -MF .deps/stap_authorize_cert-util.Tpo -c -o stap_authorize_cert-util.o `test -f 'util.cxx' || echo './'`util.cxx mv -f .deps/stap_authorize_cert-util.Tpo .deps/stap_authorize_cert-util.Po make[2]: Leaving directory '/tmp/B.1d0q341v/BUILD/systemtap-5.1' make[2]: Entering directory '/tmp/B.1d0q341v/BUILD/systemtap-5.1' x86_64-pld-linux-gnux32-g++ -DHAVE_CONFIG_H -I. -DBINDIR='"/usr/bin"' -DSYSCONFDIR='"/etc"' -DPKGDATADIR='"/usr/share/systemtap"' -DPKGLIBDIR='"/usr/libexec/systemtap"' -DLOCALEDIR='"/usr/share/locale"' -DDOCDIR='"/usr/share/doc/systemtap"' -DPYEXECDIR='"/usr/libx32/python2.7/site-packages"' -DPY3EXECDIR='"/usr/libx32/python3.10/site-packages"' -I./includes -I./includes/sys -Wall -Wextra -Werror -I/usr/include/nss -I/usr/include/nspr -D_REENTRANT -O2 -fwrapv -pipe -Wformat -Werror=format-security -gdwarf-4 -fno-debug-types-section -fvar-tracking-assignments -g2 -Wp,-D_FORTIFY_SOURCE=2 -fstack-protector-strong --param=ssp-buffer-size=4 -Werror=trampolines -fPIC -mtune=generic -march=x86-64 -gdwarf-4 -fno-debug-types-section -fvar-tracking-assignments -g2 -Wno-dangling-pointer -MT stap_serverd-stap-serverd.o -MD -MP -MF .deps/stap_serverd-stap-serverd.Tpo -c -o stap_serverd-stap-serverd.o `test -f 'stap-serverd.cxx' || echo './'`stap-serverd.cxx mv -f .deps/stap_serverd-stap-serverd.Tpo .deps/stap_serverd-stap-serverd.Po make[2]: Leaving directory '/tmp/B.1d0q341v/BUILD/systemtap-5.1' make[2]: Entering directory '/tmp/B.1d0q341v/BUILD/systemtap-5.1' x86_64-pld-linux-gnux32-g++ -DHAVE_CONFIG_H -I. -DBINDIR='"/usr/bin"' -DSYSCONFDIR='"/etc"' -DPKGDATADIR='"/usr/share/systemtap"' -DPKGLIBDIR='"/usr/libexec/systemtap"' -DLOCALEDIR='"/usr/share/locale"' -DDOCDIR='"/usr/share/doc/systemtap"' -DPYEXECDIR='"/usr/libx32/python2.7/site-packages"' -DPY3EXECDIR='"/usr/libx32/python3.10/site-packages"' -I./includes -I./includes/sys -DSTAP_SDT_V2 -D_REENTRANT -I/usr/include/nss -I/usr/include/nspr -Wall -Wextra -Werror -faligned-new -I/usr/include/dyninst -D_REENTRANT -I/usr/include/nss -I/usr/include/nspr -O2 -fwrapv -pipe -Wformat -Werror=format-security -gdwarf-4 -fno-debug-types-section -fvar-tracking-assignments -g2 -Wp,-D_FORTIFY_SOURCE=2 -fstack-protector-strong --param=ssp-buffer-size=4 -Werror=trampolines -fPIC -mtune=generic -march=x86-64 -gdwarf-4 -fno-debug-types-section -fvar-tracking-assignments -g2 -Wno-dangling-pointer -MT stap-parse.o -MD -MP -MF .deps/stap-parse.Tpo -c -o stap-parse.o `test -f 'parse.cxx' || echo './'`parse.cxx mv -f .deps/stap-parse.Tpo .deps/stap-parse.Po make[2]: Leaving directory '/tmp/B.1d0q341v/BUILD/systemtap-5.1' make[2]: Entering directory '/tmp/B.1d0q341v/BUILD/systemtap-5.1' x86_64-pld-linux-gnux32-g++ -DHAVE_CONFIG_H -I. -DBINDIR='"/usr/bin"' -DSYSCONFDIR='"/etc"' -DPKGDATADIR='"/usr/share/systemtap"' -DPKGLIBDIR='"/usr/libexec/systemtap"' -DLOCALEDIR='"/usr/share/locale"' -DDOCDIR='"/usr/share/doc/systemtap"' -DPYEXECDIR='"/usr/libx32/python2.7/site-packages"' -DPY3EXECDIR='"/usr/libx32/python3.10/site-packages"' -I./includes -I./includes/sys -Wall -Wextra -Werror -I/usr/include/nss -I/usr/include/nspr -D_REENTRANT -O2 -fwrapv -pipe -Wformat -Werror=format-security -gdwarf-4 -fno-debug-types-section -fvar-tracking-assignments -g2 -Wp,-D_FORTIFY_SOURCE=2 -fstack-protector-strong --param=ssp-buffer-size=4 -Werror=trampolines -fPIC -mtune=generic -march=x86-64 -gdwarf-4 -fno-debug-types-section -fvar-tracking-assignments -g2 -Wno-dangling-pointer -MT stap_serverd-util.o -MD -MP -MF .deps/stap_serverd-util.Tpo -c -o stap_serverd-util.o `test -f 'util.cxx' || echo './'`util.cxx mv -f .deps/stap_serverd-util.Tpo .deps/stap_serverd-util.Po make[2]: Leaving directory '/tmp/B.1d0q341v/BUILD/systemtap-5.1' make[2]: Entering directory '/tmp/B.1d0q341v/BUILD/systemtap-5.1' x86_64-pld-linux-gnux32-g++ -DHAVE_CONFIG_H -I. -DBINDIR='"/usr/bin"' -DSYSCONFDIR='"/etc"' -DPKGDATADIR='"/usr/share/systemtap"' -DPKGLIBDIR='"/usr/libexec/systemtap"' -DLOCALEDIR='"/usr/share/locale"' -DDOCDIR='"/usr/share/doc/systemtap"' -DPYEXECDIR='"/usr/libx32/python2.7/site-packages"' -DPY3EXECDIR='"/usr/libx32/python3.10/site-packages"' -I./includes -I./includes/sys -Wall -Wextra -Werror -I/usr/include/nss -I/usr/include/nspr -O2 -fwrapv -pipe -Wformat -Werror=format-security -gdwarf-4 -fno-debug-types-section -fvar-tracking-assignments -g2 -Wp,-D_FORTIFY_SOURCE=2 -fstack-protector-strong --param=ssp-buffer-size=4 -Werror=trampolines -fPIC -mtune=generic -march=x86-64 -gdwarf-4 -fno-debug-types-section -fvar-tracking-assignments -g2 -Wno-dangling-pointer -MT stap_gen_cert-util.o -MD -MP -MF .deps/stap_gen_cert-util.Tpo -c -o stap_gen_cert-util.o `test -f 'util.cxx' || echo './'`util.cxx mv -f .deps/stap_gen_cert-util.Tpo .deps/stap_gen_cert-util.Po make[2]: Leaving directory '/tmp/B.1d0q341v/BUILD/systemtap-5.1' make[2]: Entering directory '/tmp/B.1d0q341v/BUILD/systemtap-5.1' x86_64-pld-linux-gnux32-g++ -DHAVE_CONFIG_H -I. -DBINDIR='"/usr/bin"' -DSYSCONFDIR='"/etc"' -DPKGDATADIR='"/usr/share/systemtap"' -DPKGLIBDIR='"/usr/libexec/systemtap"' -DLOCALEDIR='"/usr/share/locale"' -DDOCDIR='"/usr/share/doc/systemtap"' -DPYEXECDIR='"/usr/libx32/python2.7/site-packages"' -DPY3EXECDIR='"/usr/libx32/python3.10/site-packages"' -I./includes -I./includes/sys -DSTAP_SDT_V2 -D_REENTRANT -I/usr/include/nss -I/usr/include/nspr -Wall -Wextra -Werror -faligned-new -I/usr/include/dyninst -D_REENTRANT -I/usr/include/nss -I/usr/include/nspr -O2 -fwrapv -pipe -Wformat -Werror=format-security -gdwarf-4 -fno-debug-types-section -fvar-tracking-assignments -g2 -Wp,-D_FORTIFY_SOURCE=2 -fstack-protector-strong --param=ssp-buffer-size=4 -Werror=trampolines -fPIC -mtune=generic -march=x86-64 -gdwarf-4 -fno-debug-types-section -fvar-tracking-assignments -g2 -Wno-dangling-pointer -MT language-server/stap-stap-code-completion.o -MD -MP -MF language-server/.deps/stap-stap-code-completion.Tpo -c -o language-server/stap-stap-code-completion.o `test -f 'language-server/stap-code-completion.cxx' || echo './'`language-server/stap-code-completion.cxx mv -f language-server/.deps/stap-stap-code-completion.Tpo language-server/.deps/stap-stap-code-completion.Po make[2]: Leaving directory '/tmp/B.1d0q341v/BUILD/systemtap-5.1' make[2]: Entering directory '/tmp/B.1d0q341v/BUILD/systemtap-5.1' x86_64-pld-linux-gnux32-g++ -DHAVE_CONFIG_H -I. -DBINDIR='"/usr/bin"' -DSYSCONFDIR='"/etc"' -DPKGDATADIR='"/usr/share/systemtap"' -DPKGLIBDIR='"/usr/libexec/systemtap"' -DLOCALEDIR='"/usr/share/locale"' -DDOCDIR='"/usr/share/doc/systemtap"' -DPYEXECDIR='"/usr/libx32/python2.7/site-packages"' -DPY3EXECDIR='"/usr/libx32/python3.10/site-packages"' -I./includes -I./includes/sys -DSTAP_SDT_V2 -D_REENTRANT -I/usr/include/nss -I/usr/include/nspr -Wall -Wextra -Werror -faligned-new -I/usr/include/dyninst -D_REENTRANT -I/usr/include/nss -I/usr/include/nspr -O2 -fwrapv -pipe -Wformat -Werror=format-security -gdwarf-4 -fno-debug-types-section -fvar-tracking-assignments -g2 -Wp,-D_FORTIFY_SOURCE=2 -fstack-protector-strong --param=ssp-buffer-size=4 -Werror=trampolines -fPIC -mtune=generic -march=x86-64 -gdwarf-4 -fno-debug-types-section -fvar-tracking-assignments -g2 -Wno-dangling-pointer -MT stap-dwflpp.o -MD -MP -MF .deps/stap-dwflpp.Tpo -c -o stap-dwflpp.o `test -f 'dwflpp.cxx' || echo './'`dwflpp.cxx mv -f .deps/stap-dwflpp.Tpo .deps/stap-dwflpp.Po make[2]: Leaving directory '/tmp/B.1d0q341v/BUILD/systemtap-5.1' make[2]: Entering directory '/tmp/B.1d0q341v/BUILD/systemtap-5.1' x86_64-pld-linux-gnux32-g++ -DHAVE_CONFIG_H -I. -DBINDIR='"/usr/bin"' -DSYSCONFDIR='"/etc"' -DPKGDATADIR='"/usr/share/systemtap"' -DPKGLIBDIR='"/usr/libexec/systemtap"' -DLOCALEDIR='"/usr/share/locale"' -DDOCDIR='"/usr/share/doc/systemtap"' -DPYEXECDIR='"/usr/libx32/python2.7/site-packages"' -DPY3EXECDIR='"/usr/libx32/python3.10/site-packages"' -I./includes -I./includes/sys -DSTAP_SDT_V2 -D_REENTRANT -I/usr/include/nss -I/usr/include/nspr -Wall -Wextra -Werror -faligned-new -I/usr/include/dyninst -D_REENTRANT -I/usr/include/nss -I/usr/include/nspr -O2 -fwrapv -pipe -Wformat -Werror=format-security -gdwarf-4 -fno-debug-types-section -fvar-tracking-assignments -g2 -Wp,-D_FORTIFY_SOURCE=2 -fstack-protector-strong --param=ssp-buffer-size=4 -Werror=trampolines -fPIC -mtune=generic -march=x86-64 -gdwarf-4 -fno-debug-types-section -fvar-tracking-assignments -g2 -Wno-dangling-pointer -MT language-server/stap-stap-language-server.o -MD -MP -MF language-server/.deps/stap-stap-language-server.Tpo -c -o language-server/stap-stap-language-server.o `test -f 'language-server/stap-language-server.cxx' || echo './'`language-server/stap-language-server.cxx mv -f language-server/.deps/stap-stap-language-server.Tpo language-server/.deps/stap-stap-language-server.Po make[2]: Leaving directory '/tmp/B.1d0q341v/BUILD/systemtap-5.1' make[2]: Entering directory '/tmp/B.1d0q341v/BUILD/systemtap-5.1' x86_64-pld-linux-gnux32-g++ -DHAVE_CONFIG_H -I. -DBINDIR='"/usr/bin"' -DSYSCONFDIR='"/etc"' -DPKGDATADIR='"/usr/share/systemtap"' -DPKGLIBDIR='"/usr/libexec/systemtap"' -DLOCALEDIR='"/usr/share/locale"' -DDOCDIR='"/usr/share/doc/systemtap"' -DPYEXECDIR='"/usr/libx32/python2.7/site-packages"' -DPY3EXECDIR='"/usr/libx32/python3.10/site-packages"' -I./includes -I./includes/sys -DSTAP_SDT_V2 -D_REENTRANT -I/usr/include/nss -I/usr/include/nspr -Wall -Wextra -Werror -faligned-new -I/usr/include/dyninst -D_REENTRANT -I/usr/include/nss -I/usr/include/nspr -O2 -fwrapv -pipe -Wformat -Werror=format-security -gdwarf-4 -fno-debug-types-section -fvar-tracking-assignments -g2 -Wp,-D_FORTIFY_SOURCE=2 -fstack-protector-strong --param=ssp-buffer-size=4 -Werror=trampolines -fPIC -mtune=generic -march=x86-64 -gdwarf-4 -fno-debug-types-section -fvar-tracking-assignments -g2 -Wno-dangling-pointer -MT stap-bpf-translate.o -MD -MP -MF .deps/stap-bpf-translate.Tpo -c -o stap-bpf-translate.o `test -f 'bpf-translate.cxx' || echo './'`bpf-translate.cxx mv -f .deps/stap-bpf-translate.Tpo .deps/stap-bpf-translate.Po make[2]: Leaving directory '/tmp/B.1d0q341v/BUILD/systemtap-5.1' make[2]: Entering directory '/tmp/B.1d0q341v/BUILD/systemtap-5.1' x86_64-pld-linux-gnux32-g++ -DHAVE_CONFIG_H -I. -DBINDIR='"/usr/bin"' -DSYSCONFDIR='"/etc"' -DPKGDATADIR='"/usr/share/systemtap"' -DPKGLIBDIR='"/usr/libexec/systemtap"' -DLOCALEDIR='"/usr/share/locale"' -DDOCDIR='"/usr/share/doc/systemtap"' -DPYEXECDIR='"/usr/libx32/python2.7/site-packages"' -DPY3EXECDIR='"/usr/libx32/python3.10/site-packages"' -I./includes -I./includes/sys -DSTAP_SDT_V2 -D_REENTRANT -I/usr/include/nss -I/usr/include/nspr -Wall -Wextra -Werror -faligned-new -I/usr/include/dyninst -D_REENTRANT -I/usr/include/nss -I/usr/include/nspr -O2 -fwrapv -pipe -Wformat -Werror=format-security -gdwarf-4 -fno-debug-types-section -fvar-tracking-assignments -g2 -Wp,-D_FORTIFY_SOURCE=2 -fstack-protector-strong --param=ssp-buffer-size=4 -Werror=trampolines -fPIC -mtune=generic -march=x86-64 -gdwarf-4 -fno-debug-types-section -fvar-tracking-assignments -g2 -Wno-dangling-pointer -MT stap-elaborate.o -MD -MP -MF .deps/stap-elaborate.Tpo -c -o stap-elaborate.o `test -f 'elaborate.cxx' || echo './'`elaborate.cxx mv -f .deps/stap-elaborate.Tpo .deps/stap-elaborate.Po make[2]: Leaving directory '/tmp/B.1d0q341v/BUILD/systemtap-5.1' make[2]: Entering directory '/tmp/B.1d0q341v/BUILD/systemtap-5.1' x86_64-pld-linux-gnux32-g++ -DHAVE_CONFIG_H -I. -DBINDIR='"/usr/bin"' -DSYSCONFDIR='"/etc"' -DPKGDATADIR='"/usr/share/systemtap"' -DPKGLIBDIR='"/usr/libexec/systemtap"' -DLOCALEDIR='"/usr/share/locale"' -DDOCDIR='"/usr/share/doc/systemtap"' -DPYEXECDIR='"/usr/libx32/python2.7/site-packages"' -DPY3EXECDIR='"/usr/libx32/python3.10/site-packages"' -I./includes -I./includes/sys -DSTAP_SDT_V2 -D_REENTRANT -I/usr/include/nss -I/usr/include/nspr -Wall -Wextra -Werror -faligned-new -I/usr/include/dyninst -D_REENTRANT -I/usr/include/nss -I/usr/include/nspr -O2 -fwrapv -pipe -Wformat -Werror=format-security -gdwarf-4 -fno-debug-types-section -fvar-tracking-assignments -g2 -Wp,-D_FORTIFY_SOURCE=2 -fstack-protector-strong --param=ssp-buffer-size=4 -Werror=trampolines -fPIC -mtune=generic -march=x86-64 -gdwarf-4 -fno-debug-types-section -fvar-tracking-assignments -g2 -Wno-dangling-pointer -MT stap-translate.o -MD -MP -MF .deps/stap-translate.Tpo -c -o stap-translate.o `test -f 'translate.cxx' || echo './'`translate.cxx mv -f .deps/stap-translate.Tpo .deps/stap-translate.Po make[2]: Leaving directory '/tmp/B.1d0q341v/BUILD/systemtap-5.1' make[2]: Entering directory '/tmp/B.1d0q341v/BUILD/systemtap-5.1' x86_64-pld-linux-gnux32-g++ -DHAVE_CONFIG_H -I. -DBINDIR='"/usr/bin"' -DSYSCONFDIR='"/etc"' -DPKGDATADIR='"/usr/share/systemtap"' -DPKGLIBDIR='"/usr/libexec/systemtap"' -DLOCALEDIR='"/usr/share/locale"' -DDOCDIR='"/usr/share/doc/systemtap"' -DPYEXECDIR='"/usr/libx32/python2.7/site-packages"' -DPY3EXECDIR='"/usr/libx32/python3.10/site-packages"' -I./includes -I./includes/sys -DSTAP_SDT_V2 -D_REENTRANT -I/usr/include/nss -I/usr/include/nspr -Wall -Wextra -Werror -faligned-new -I/usr/include/dyninst -D_REENTRANT -I/usr/include/nss -I/usr/include/nspr -O2 -fwrapv -pipe -Wformat -Werror=format-security -gdwarf-4 -fno-debug-types-section -fvar-tracking-assignments -g2 -Wp,-D_FORTIFY_SOURCE=2 -fstack-protector-strong --param=ssp-buffer-size=4 -Werror=trampolines -fPIC -mtune=generic -march=x86-64 -gdwarf-4 -fno-debug-types-section -fvar-tracking-assignments -g2 -Wno-dangling-pointer -MT stap-tapsets.o -MD -MP -MF .deps/stap-tapsets.Tpo -c -o stap-tapsets.o `test -f 'tapsets.cxx' || echo './'`tapsets.cxx mv -f .deps/stap-tapsets.Tpo .deps/stap-tapsets.Po make[2]: Leaving directory '/tmp/B.1d0q341v/BUILD/systemtap-5.1' make[1]: *** [Makefile:2221: all-recursive] Error 1 make: *** [Makefile:821: all] Error 2 error: Bad exit status from /tmp/B.1d0q341v/BUILD/tmp/rpm-tmp.A3xuf7 (%build) RPM build errors: Bad exit status from /tmp/B.1d0q341v/BUILD/tmp/rpm-tmp.A3xuf7 (%build) ended at: Sun Jun 30 22:34:34 2024, done in 0:01:09.644085 error: No files produced. + chmod -R u+rwX /tmp/B.1d0q341v/BUILD + rm -rf /tmp/B.1d0q341v/tmp /tmp/B.1d0q341v/BUILD + rm -rf /tmp/B.1d0q341v Begin-PLD-Builder-Info Build-Time: user:464.70s sys:34.31s real:89.79s (faults io:10 non-io:4942175) End-PLD-Builder-Info
[Back to list of logs] [View rpm -qa of builder]