FailedOk

th/SRPMS[OK]
th/x32[OK]
th/i686[OK]
th/x86_64[OK]

ac/SRPMS[OK]
ac/i386[OK]
ac/i586[OK]
ac/i686[OK]
ac/alpha[OK]
ac/amd64[OK]
ac/athlon[OK]
ac/ppc[OK]
ac/sparc[OK]
ac/sparc64[OK]

Advanced Search
main()
Powered by PLD Linux
(c) 2002-2022 PLD Team
$Revision: 1.37 $
Powered by PDP-11.
Your IP: 54.80.252.84

widelands 5a243cc7-ec39-49a0-aa96-0d71198bb6f9

Status:Failed
Source URL:https://buildlogs.pld-linux.org/pld/th/x32/FAIL/widelands,5a243cc7-ec39-49a0-aa96-0d71198bb6f9.bz2
text/plain URL:View!
full text:View!
rpm -qa of builder:View!
Date:2022/01/14 20:35:32
Runtime:0:04:46.284026

Toc:

  • error 1
  • /tmp/B.yxahbxry/BUILD/widelands-1.0/src/network/bufferedconnection.h:313:14: error: 'map' in namespace 'std' does not name a template type
  • error 2
  • /tmp/B.yxahbxry/BUILD/widelands-1.0/src/network/bufferedconnection.h:221:17: error: 'buffers_to_send_' was not declared in this scope
  • error 3
  • make[2]: *** [src/ui_fsmenu/CMakeFiles/ui_fsmenu.dir/build.make:190: src/ui_fsmenu/CMakeFiles/ui_fsmenu.dir/internet_lobby.cc.o] Error 1
  • error 4
  • make[1]: *** [CMakeFiles/Makefile2:30674: src/ui_fsmenu/CMakeFiles/ui_fsmenu.dir/all] Error 2
  • error 5
  • error: Bad exit status from /tmp/B.yxahbxry/BUILD/tmp/rpm-tmp.sunX66 (%build)
  • error 6
  • RPM build errors:
  • error 7
  • error: No files produced.

Content:

make[2]: Entering directory '/tmp/B.yxahbxry/BUILD/widelands-1.0/build'
[ 80%] Linking CXX static library libwui_chat_ui.a
cd /tmp/B.yxahbxry/BUILD/widelands-1.0/build/src/wui && /usr/bin/cmake -P CMakeFiles/wui_chat_ui.dir/cmake_clean_target.cmake
cd /tmp/B.yxahbxry/BUILD/widelands-1.0/build/src/wui && /usr/bin/cmake -E cmake_link_script CMakeFiles/wui_chat_ui.dir/link.txt --verbose=1
/usr/bin/ar qc libwui_chat_ui.a  CMakeFiles/wui_chat_ui.dir/chat_overlay.cc.o CMakeFiles/wui_chat_ui.dir/game_chat_menu.cc.o CMakeFiles/wui_chat_ui.dir/game_chat_panel.cc.o CMakeFiles/wui_chat_ui.dir/chat_msg_layout.cc.o
/usr/bin/ranlib libwui_chat_ui.a
make[2]: Leaving directory '/tmp/B.yxahbxry/BUILD/widelands-1.0/build'
make[1]: Entering directory '/tmp/B.yxahbxry/BUILD/widelands-1.0/build'
[ 80%] Built target wui_chat_ui
make[1]: Leaving directory '/tmp/B.yxahbxry/BUILD/widelands-1.0/build'
/usr/bin/make  -f src/wui/CMakeFiles/wui_common_mapdetails.dir/build.make src/wui/CMakeFiles/wui_common_mapdetails.dir/depend
make[2]: Entering directory '/tmp/B.yxahbxry/BUILD/widelands-1.0/build'
cd /tmp/B.yxahbxry/BUILD/widelands-1.0/build && /usr/bin/cmake -E cmake_depends "Unix Makefiles" /tmp/B.yxahbxry/BUILD/widelands-1.0 /tmp/B.yxahbxry/BUILD/widelands-1.0/src/wui /tmp/B.yxahbxry/BUILD/widelands-1.0/build /tmp/B.yxahbxry/BUILD/widelands-1.0/build/src/wui /tmp/B.yxahbxry/BUILD/widelands-1.0/build/src/wui/CMakeFiles/wui_common_mapdetails.dir/DependInfo.cmake --color=
Scanning dependencies of target wui_common_mapdetails
make[2]: Leaving directory '/tmp/B.yxahbxry/BUILD/widelands-1.0/build'
/usr/bin/make  -f src/wui/CMakeFiles/wui_common_mapdetails.dir/build.make src/wui/CMakeFiles/wui_common_mapdetails.dir/build
make[2]: Entering directory '/tmp/B.yxahbxry/BUILD/widelands-1.0/build'
[ 80%] Building CXX object src/wui/CMakeFiles/wui_common_mapdetails.dir/map_tags.cc.o
cd /tmp/B.yxahbxry/BUILD/widelands-1.0/build/src/wui && /usr/bin/x86_64-pld-linux-gnux32-g++  -DUSE_XDG -DWL_USE_GLVND -I/tmp/B.yxahbxry/BUILD/widelands-1.0/src -I/tmp/B.yxahbxry/BUILD/widelands-1.0/build/src -isystem /usr/include/SDL2  -O2 -fwrapv -pipe -Wformat -Werror=format-security -gdwarf-4 -fno-debug-types-section -fvar-tracking-assignments -g2 -Wp,-D_FORTIFY_SOURCE=2 -fstack-protector-strong --param=ssp-buffer-size=4 -Werror=trampolines -fPIC -mtune=generic -march=x86-64 -gdwarf-4 -fno-debug-types-section -fvar-tracking-assignments -g2  -DNDEBUG -DQT_NO_DEBUG    -fext-numeric-literals -std=c++11  -DNDEBUG -DNOPARACHUTE -Wredundant-decls -Wall -Wpedantic -Wdeprecated-declarations -Wextra -Wformat -Wformat-nonliteral -Wformat-security -Wformat-y2k -Winit-self -Winvalid-pch -Wlogical-op -Wmissing-include-dirs -Wno-undef -Wold-style-cast -Woverlength-strings -Wpacked -Wpointer-arith -Wsign-promo -Wsync-nand -Wtrampolines -Wundef -Wunused -Wunused-macros -Werror=format-security -Werror=return-type -Werror=shadow -Werror=uninitialized -o CMakeFiles/wui_common_mapdetails.dir/map_tags.cc.o -c /tmp/B.yxahbxry/BUILD/widelands-1.0/src/wui/map_tags.cc
make[2]: Leaving directory '/tmp/B.yxahbxry/BUILD/widelands-1.0/build'
make[2]: Entering directory '/tmp/B.yxahbxry/BUILD/widelands-1.0/build'
[ 80%] Building CXX object src/wui/CMakeFiles/wui_common_mapdetails.dir/maptable.cc.o
cd /tmp/B.yxahbxry/BUILD/widelands-1.0/build/src/wui && /usr/bin/x86_64-pld-linux-gnux32-g++  -DUSE_XDG -DWL_USE_GLVND -I/tmp/B.yxahbxry/BUILD/widelands-1.0/src -I/tmp/B.yxahbxry/BUILD/widelands-1.0/build/src -isystem /usr/include/SDL2  -O2 -fwrapv -pipe -Wformat -Werror=format-security -gdwarf-4 -fno-debug-types-section -fvar-tracking-assignments -g2 -Wp,-D_FORTIFY_SOURCE=2 -fstack-protector-strong --param=ssp-buffer-size=4 -Werror=trampolines -fPIC -mtune=generic -march=x86-64 -gdwarf-4 -fno-debug-types-section -fvar-tracking-assignments -g2  -DNDEBUG -DQT_NO_DEBUG    -fext-numeric-literals -std=c++11  -DNDEBUG -DNOPARACHUTE -Wredundant-decls -Wall -Wpedantic -Wdeprecated-declarations -Wextra -Wformat -Wformat-nonliteral -Wformat-security -Wformat-y2k -Winit-self -Winvalid-pch -Wlogical-op -Wmissing-include-dirs -Wno-undef -Wold-style-cast -Woverlength-strings -Wpacked -Wpointer-arith -Wsign-promo -Wsync-nand -Wtrampolines -Wundef -Wunused -Wunused-macros -Werror=format-security -Werror=return-type -Werror=shadow -Werror=uninitialized -o CMakeFiles/wui_common_mapdetails.dir/maptable.cc.o -c /tmp/B.yxahbxry/BUILD/widelands-1.0/src/wui/maptable.cc
make[2]: Leaving directory '/tmp/B.yxahbxry/BUILD/widelands-1.0/build'
make[2]: Entering directory '/tmp/B.yxahbxry/BUILD/widelands-1.0/build'
[ 80%] Building CXX object src/wui/CMakeFiles/wui_common_mapdetails.dir/mapdata.cc.o
cd /tmp/B.yxahbxry/BUILD/widelands-1.0/build/src/wui && /usr/bin/x86_64-pld-linux-gnux32-g++  -DUSE_XDG -DWL_USE_GLVND -I/tmp/B.yxahbxry/BUILD/widelands-1.0/src -I/tmp/B.yxahbxry/BUILD/widelands-1.0/build/src -isystem /usr/include/SDL2  -O2 -fwrapv -pipe -Wformat -Werror=format-security -gdwarf-4 -fno-debug-types-section -fvar-tracking-assignments -g2 -Wp,-D_FORTIFY_SOURCE=2 -fstack-protector-strong --param=ssp-buffer-size=4 -Werror=trampolines -fPIC -mtune=generic -march=x86-64 -gdwarf-4 -fno-debug-types-section -fvar-tracking-assignments -g2  -DNDEBUG -DQT_NO_DEBUG    -fext-numeric-literals -std=c++11  -DNDEBUG -DNOPARACHUTE -Wredundant-decls -Wall -Wpedantic -Wdeprecated-declarations -Wextra -Wformat -Wformat-nonliteral -Wformat-security -Wformat-y2k -Winit-self -Winvalid-pch -Wlogical-op -Wmissing-include-dirs -Wno-undef -Wold-style-cast -Woverlength-strings -Wpacked -Wpointer-arith -Wsign-promo -Wsync-nand -Wtrampolines -Wundef -Wunused -Wunused-macros -Werror=format-security -Werror=return-type -Werror=shadow -Werror=uninitialized -o CMakeFiles/wui_common_mapdetails.dir/mapdata.cc.o -c /tmp/B.yxahbxry/BUILD/widelands-1.0/src/wui/mapdata.cc
make[2]: Leaving directory '/tmp/B.yxahbxry/BUILD/widelands-1.0/build'
make[2]: Entering directory '/tmp/B.yxahbxry/BUILD/widelands-1.0/build'
[ 80%] Building CXX object src/wui/CMakeFiles/wui_common_mapdetails.dir/mapdetails.cc.o
cd /tmp/B.yxahbxry/BUILD/widelands-1.0/build/src/wui && /usr/bin/x86_64-pld-linux-gnux32-g++  -DUSE_XDG -DWL_USE_GLVND -I/tmp/B.yxahbxry/BUILD/widelands-1.0/src -I/tmp/B.yxahbxry/BUILD/widelands-1.0/build/src -isystem /usr/include/SDL2  -O2 -fwrapv -pipe -Wformat -Werror=format-security -gdwarf-4 -fno-debug-types-section -fvar-tracking-assignments -g2 -Wp,-D_FORTIFY_SOURCE=2 -fstack-protector-strong --param=ssp-buffer-size=4 -Werror=trampolines -fPIC -mtune=generic -march=x86-64 -gdwarf-4 -fno-debug-types-section -fvar-tracking-assignments -g2  -DNDEBUG -DQT_NO_DEBUG    -fext-numeric-literals -std=c++11  -DNDEBUG -DNOPARACHUTE -Wredundant-decls -Wall -Wpedantic -Wdeprecated-declarations -Wextra -Wformat -Wformat-nonliteral -Wformat-security -Wformat-y2k -Winit-self -Winvalid-pch -Wlogical-op -Wmissing-include-dirs -Wno-undef -Wold-style-cast -Woverlength-strings -Wpacked -Wpointer-arith -Wsign-promo -Wsync-nand -Wtrampolines -Wundef -Wunused -Wunused-macros -Werror=format-security -Werror=return-type -Werror=shadow -Werror=uninitialized -o CMakeFiles/wui_common_mapdetails.dir/mapdetails.cc.o -c /tmp/B.yxahbxry/BUILD/widelands-1.0/src/wui/mapdetails.cc
make[2]: Leaving directory '/tmp/B.yxahbxry/BUILD/widelands-1.0/build'
make[2]: Entering directory '/tmp/B.yxahbxry/BUILD/widelands-1.0/build'
[ 80%] Linking CXX static library libwui_common_mapdetails.a
cd /tmp/B.yxahbxry/BUILD/widelands-1.0/build/src/wui && /usr/bin/cmake -P CMakeFiles/wui_common_mapdetails.dir/cmake_clean_target.cmake
cd /tmp/B.yxahbxry/BUILD/widelands-1.0/build/src/wui && /usr/bin/cmake -E cmake_link_script CMakeFiles/wui_common_mapdetails.dir/link.txt --verbose=1
/usr/bin/ar qc libwui_common_mapdetails.a  CMakeFiles/wui_common_mapdetails.dir/mapdetails.cc.o CMakeFiles/wui_common_mapdetails.dir/mapdata.cc.o CMakeFiles/wui_common_mapdetails.dir/maptable.cc.o CMakeFiles/wui_common_mapdetails.dir/map_tags.cc.o
/usr/bin/ranlib libwui_common_mapdetails.a
make[2]: Leaving directory '/tmp/B.yxahbxry/BUILD/widelands-1.0/build'
make[1]: Entering directory '/tmp/B.yxahbxry/BUILD/widelands-1.0/build'
[ 80%] Built target wui_common_mapdetails
make[1]: Leaving directory '/tmp/B.yxahbxry/BUILD/widelands-1.0/build'
/usr/bin/make  -f src/wui/CMakeFiles/wui_common_suggested_teams.dir/build.make src/wui/CMakeFiles/wui_common_suggested_teams.dir/depend
make[2]: Entering directory '/tmp/B.yxahbxry/BUILD/widelands-1.0/build'
cd /tmp/B.yxahbxry/BUILD/widelands-1.0/build && /usr/bin/cmake -E cmake_depends "Unix Makefiles" /tmp/B.yxahbxry/BUILD/widelands-1.0 /tmp/B.yxahbxry/BUILD/widelands-1.0/src/wui /tmp/B.yxahbxry/BUILD/widelands-1.0/build /tmp/B.yxahbxry/BUILD/widelands-1.0/build/src/wui /tmp/B.yxahbxry/BUILD/widelands-1.0/build/src/wui/CMakeFiles/wui_common_suggested_teams.dir/DependInfo.cmake --color=
Scanning dependencies of target wui_common_suggested_teams
make[2]: Leaving directory '/tmp/B.yxahbxry/BUILD/widelands-1.0/build'
/usr/bin/make  -f src/wui/CMakeFiles/wui_common_suggested_teams.dir/build.make src/wui/CMakeFiles/wui_common_suggested_teams.dir/build
make[2]: Entering directory '/tmp/B.yxahbxry/BUILD/widelands-1.0/build'
[ 80%] Building CXX object src/wui/CMakeFiles/wui_common_suggested_teams.dir/suggested_teams_box.cc.o
cd /tmp/B.yxahbxry/BUILD/widelands-1.0/build/src/wui && /usr/bin/x86_64-pld-linux-gnux32-g++  -DUSE_XDG -DWL_USE_GLVND -I/tmp/B.yxahbxry/BUILD/widelands-1.0/src -I/tmp/B.yxahbxry/BUILD/widelands-1.0/build/src -isystem /usr/include/SDL2  -O2 -fwrapv -pipe -Wformat -Werror=format-security -gdwarf-4 -fno-debug-types-section -fvar-tracking-assignments -g2 -Wp,-D_FORTIFY_SOURCE=2 -fstack-protector-strong --param=ssp-buffer-size=4 -Werror=trampolines -fPIC -mtune=generic -march=x86-64 -gdwarf-4 -fno-debug-types-section -fvar-tracking-assignments -g2  -DNDEBUG -DQT_NO_DEBUG    -fext-numeric-literals -std=c++11  -DNDEBUG -DNOPARACHUTE -Wredundant-decls -Wall -Wpedantic -Wdeprecated-declarations -Wextra -Wformat -Wformat-nonliteral -Wformat-security -Wformat-y2k -Winit-self -Winvalid-pch -Wlogical-op -Wmissing-include-dirs -Wno-undef -Wold-style-cast -Woverlength-strings -Wpacked -Wpointer-arith -Wsign-promo -Wsync-nand -Wtrampolines -Wundef -Wunused -Wunused-macros -Werror=format-security -Werror=return-type -Werror=shadow -Werror=uninitialized -o CMakeFiles/wui_common_suggested_teams.dir/suggested_teams_box.cc.o -c /tmp/B.yxahbxry/BUILD/widelands-1.0/src/wui/suggested_teams_box.cc
make[2]: Leaving directory '/tmp/B.yxahbxry/BUILD/widelands-1.0/build'
make[2]: Entering directory '/tmp/B.yxahbxry/BUILD/widelands-1.0/build'
[ 80%] Linking CXX static library libwui_common_suggested_teams.a
cd /tmp/B.yxahbxry/BUILD/widelands-1.0/build/src/wui && /usr/bin/cmake -P CMakeFiles/wui_common_suggested_teams.dir/cmake_clean_target.cmake
cd /tmp/B.yxahbxry/BUILD/widelands-1.0/build/src/wui && /usr/bin/cmake -E cmake_link_script CMakeFiles/wui_common_suggested_teams.dir/link.txt --verbose=1
/usr/bin/ar qc libwui_common_suggested_teams.a  CMakeFiles/wui_common_suggested_teams.dir/suggested_teams_box.cc.o
/usr/bin/ranlib libwui_common_suggested_teams.a
make[2]: Leaving directory '/tmp/B.yxahbxry/BUILD/widelands-1.0/build'
make[1]: Entering directory '/tmp/B.yxahbxry/BUILD/widelands-1.0/build'
[ 80%] Built target wui_common_suggested_teams
make[1]: Leaving directory '/tmp/B.yxahbxry/BUILD/widelands-1.0/build'
/usr/bin/make  -f src/wui/CMakeFiles/wui_mapview.dir/build.make src/wui/CMakeFiles/wui_mapview.dir/depend
make[2]: Entering directory '/tmp/B.yxahbxry/BUILD/widelands-1.0/build'
cd /tmp/B.yxahbxry/BUILD/widelands-1.0/build && /usr/bin/cmake -E cmake_depends "Unix Makefiles" /tmp/B.yxahbxry/BUILD/widelands-1.0 /tmp/B.yxahbxry/BUILD/widelands-1.0/src/wui /tmp/B.yxahbxry/BUILD/widelands-1.0/build /tmp/B.yxahbxry/BUILD/widelands-1.0/build/src/wui /tmp/B.yxahbxry/BUILD/widelands-1.0/build/src/wui/CMakeFiles/wui_mapview.dir/DependInfo.cmake --color=
Scanning dependencies of target wui_mapview
make[2]: Leaving directory '/tmp/B.yxahbxry/BUILD/widelands-1.0/build'
/usr/bin/make  -f src/wui/CMakeFiles/wui_mapview.dir/build.make src/wui/CMakeFiles/wui_mapview.dir/build
make[2]: Entering directory '/tmp/B.yxahbxry/BUILD/widelands-1.0/build'
[ 80%] Building CXX object src/wui/CMakeFiles/wui_mapview.dir/mapview.cc.o
cd /tmp/B.yxahbxry/BUILD/widelands-1.0/build/src/wui && /usr/bin/x86_64-pld-linux-gnux32-g++  -DUSE_XDG -DWL_USE_GLVND -I/tmp/B.yxahbxry/BUILD/widelands-1.0/src -I/tmp/B.yxahbxry/BUILD/widelands-1.0/build/src -isystem /usr/include/SDL2  -O2 -fwrapv -pipe -Wformat -Werror=format-security -gdwarf-4 -fno-debug-types-section -fvar-tracking-assignments -g2 -Wp,-D_FORTIFY_SOURCE=2 -fstack-protector-strong --param=ssp-buffer-size=4 -Werror=trampolines -fPIC -mtune=generic -march=x86-64 -gdwarf-4 -fno-debug-types-section -fvar-tracking-assignments -g2  -DNDEBUG -DQT_NO_DEBUG    -fext-numeric-literals -std=c++11  -DNDEBUG -DNOPARACHUTE -Wredundant-decls -Wall -Wpedantic -Wdeprecated-declarations -Wextra -Wformat -Wformat-nonliteral -Wformat-security -Wformat-y2k -Winit-self -Winvalid-pch -Wlogical-op -Wmissing-include-dirs -Wno-undef -Wold-style-cast -Woverlength-strings -Wpacked -Wpointer-arith -Wsign-promo -Wsync-nand -Wtrampolines -Wundef -Wunused -Wunused-macros -Werror=format-security -Werror=return-type -Werror=shadow -Werror=uninitialized -o CMakeFiles/wui_mapview.dir/mapview.cc.o -c /tmp/B.yxahbxry/BUILD/widelands-1.0/src/wui/mapview.cc
make[2]: Leaving directory '/tmp/B.yxahbxry/BUILD/widelands-1.0/build'
make[2]: Entering directory '/tmp/B.yxahbxry/BUILD/widelands-1.0/build'
[ 80%] Linking CXX static library libwui_mapview.a
cd /tmp/B.yxahbxry/BUILD/widelands-1.0/build/src/wui && /usr/bin/cmake -P CMakeFiles/wui_mapview.dir/cmake_clean_target.cmake
cd /tmp/B.yxahbxry/BUILD/widelands-1.0/build/src/wui && /usr/bin/cmake -E cmake_link_script CMakeFiles/wui_mapview.dir/link.txt --verbose=1
/usr/bin/ar qc libwui_mapview.a  CMakeFiles/wui_mapview.dir/mapview.cc.o
/usr/bin/ranlib libwui_mapview.a
make[2]: Leaving directory '/tmp/B.yxahbxry/BUILD/widelands-1.0/build'
make[1]: Entering directory '/tmp/B.yxahbxry/BUILD/widelands-1.0/build'
[ 80%] Built target wui_mapview
make[1]: Leaving directory '/tmp/B.yxahbxry/BUILD/widelands-1.0/build'
/usr/bin/make  -f src/ui_fsmenu/CMakeFiles/ui_fsmenu.dir/build.make src/ui_fsmenu/CMakeFiles/ui_fsmenu.dir/depend
make[2]: Entering directory '/tmp/B.yxahbxry/BUILD/widelands-1.0/build'
cd /tmp/B.yxahbxry/BUILD/widelands-1.0/build && /usr/bin/cmake -E cmake_depends "Unix Makefiles" /tmp/B.yxahbxry/BUILD/widelands-1.0 /tmp/B.yxahbxry/BUILD/widelands-1.0/src/ui_fsmenu /tmp/B.yxahbxry/BUILD/widelands-1.0/build /tmp/B.yxahbxry/BUILD/widelands-1.0/build/src/ui_fsmenu /tmp/B.yxahbxry/BUILD/widelands-1.0/build/src/ui_fsmenu/CMakeFiles/ui_fsmenu.dir/DependInfo.cmake --color=
Scanning dependencies of target ui_fsmenu
make[2]: Leaving directory '/tmp/B.yxahbxry/BUILD/widelands-1.0/build'
/usr/bin/make  -f src/ui_fsmenu/CMakeFiles/ui_fsmenu.dir/build.make src/ui_fsmenu/CMakeFiles/ui_fsmenu.dir/build
make[2]: Entering directory '/tmp/B.yxahbxry/BUILD/widelands-1.0/build'
[ 82%] Building CXX object src/ui_fsmenu/CMakeFiles/ui_fsmenu.dir/campaigndetails.cc.o
cd /tmp/B.yxahbxry/BUILD/widelands-1.0/build/src/ui_fsmenu && /usr/bin/x86_64-pld-linux-gnux32-g++  -DUSE_XDG -DWL_USE_GLVND -I/tmp/B.yxahbxry/BUILD/widelands-1.0/src -I/tmp/B.yxahbxry/BUILD/widelands-1.0/build/src -isystem /usr/include/SDL2  -O2 -fwrapv -pipe -Wformat -Werror=format-security -gdwarf-4 -fno-debug-types-section -fvar-tracking-assignments -g2 -Wp,-D_FORTIFY_SOURCE=2 -fstack-protector-strong --param=ssp-buffer-size=4 -Werror=trampolines -fPIC -mtune=generic -march=x86-64 -gdwarf-4 -fno-debug-types-section -fvar-tracking-assignments -g2  -DNDEBUG -DQT_NO_DEBUG    -fext-numeric-literals -std=c++11  -DNDEBUG -DNOPARACHUTE -Wredundant-decls -Wall -Wpedantic -Wdeprecated-declarations -Wextra -Wformat -Wformat-nonliteral -Wformat-security -Wformat-y2k -Winit-self -Winvalid-pch -Wlogical-op -Wmissing-include-dirs -Wno-undef -Wold-style-cast -Woverlength-strings -Wpacked -Wpointer-arith -Wsign-promo -Wsync-nand -Wtrampolines -Wundef -Wunused -Wunused-macros -Werror=format-security -Werror=return-type -Werror=shadow -Werror=uninitialized -o CMakeFiles/ui_fsmenu.dir/campaigndetails.cc.o -c /tmp/B.yxahbxry/BUILD/widelands-1.0/src/ui_fsmenu/campaigndetails.cc
make[2]: Leaving directory '/tmp/B.yxahbxry/BUILD/widelands-1.0/build'
make[2]: Entering directory '/tmp/B.yxahbxry/BUILD/widelands-1.0/build'
[ 82%] Building CXX object src/ui_fsmenu/CMakeFiles/ui_fsmenu.dir/internet_lobby.cc.o
cd /tmp/B.yxahbxry/BUILD/widelands-1.0/build/src/ui_fsmenu && /usr/bin/x86_64-pld-linux-gnux32-g++  -DUSE_XDG -DWL_USE_GLVND -I/tmp/B.yxahbxry/BUILD/widelands-1.0/src -I/tmp/B.yxahbxry/BUILD/widelands-1.0/build/src -isystem /usr/include/SDL2  -O2 -fwrapv -pipe -Wformat -Werror=format-security -gdwarf-4 -fno-debug-types-section -fvar-tracking-assignments -g2 -Wp,-D_FORTIFY_SOURCE=2 -fstack-protector-strong --param=ssp-buffer-size=4 -Werror=trampolines -fPIC -mtune=generic -march=x86-64 -gdwarf-4 -fno-debug-types-section -fvar-tracking-assignments -g2  -DNDEBUG -DQT_NO_DEBUG    -fext-numeric-literals -std=c++11  -DNDEBUG -DNOPARACHUTE -Wredundant-decls -Wall -Wpedantic -Wdeprecated-declarations -Wextra -Wformat -Wformat-nonliteral -Wformat-security -Wformat-y2k -Winit-self -Winvalid-pch -Wlogical-op -Wmissing-include-dirs -Wno-undef -Wold-style-cast -Woverlength-strings -Wpacked -Wpointer-arith -Wsign-promo -Wsync-nand -Wtrampolines -Wundef -Wunused -Wunused-macros -Werror=format-security -Werror=return-type -Werror=shadow -Werror=uninitialized -o CMakeFiles/ui_fsmenu.dir/internet_lobby.cc.o -c /tmp/B.yxahbxry/BUILD/widelands-1.0/src/ui_fsmenu/internet_lobby.cc
In file included from /tmp/B.yxahbxry/BUILD/widelands-1.0/src/network/netclient.h:25,
                 from /tmp/B.yxahbxry/BUILD/widelands-1.0/src/network/internet_gaming.h:26,
                 from /tmp/B.yxahbxry/BUILD/widelands-1.0/src/ui_fsmenu/internet_lobby.h:26,
                 from /tmp/B.yxahbxry/BUILD/widelands-1.0/src/ui_fsmenu/internet_lobby.cc:20:
/tmp/B.yxahbxry/BUILD/widelands-1.0/src/network/bufferedconnection.h:313:14: error: 'map' in namespace 'std' does not name a template type
  313 |         std::map<uint8_t, std::queue<std::vector<uint8_t>>> buffers_to_send_;
      |              ^~~
/tmp/B.yxahbxry/BUILD/widelands-1.0/src/network/bufferedconnection.h:29:1: note: 'std::map' is defined in header '<map>'; did you forget to '#include <map>'?
   28 | #include "network/relay_protocol.h"
  +++ |+#include <map>
   29 | 
/tmp/B.yxahbxry/BUILD/widelands-1.0/src/network/bufferedconnection.h: In member function 'void BufferedConnection::send(NetPriority, const Targs& ...)':
/tmp/B.yxahbxry/BUILD/widelands-1.0/src/network/bufferedconnection.h:221:17: error: 'buffers_to_send_' was not declared in this scope
  221 |                 buffers_to_send_[priority].push(v);
      |                 ^~~~~~~~~~~~~~~~
make[2]: *** [src/ui_fsmenu/CMakeFiles/ui_fsmenu.dir/build.make:190: src/ui_fsmenu/CMakeFiles/ui_fsmenu.dir/internet_lobby.cc.o] Error 1
make[2]: Leaving directory '/tmp/B.yxahbxry/BUILD/widelands-1.0/build'
make[2]: *** Waiting for unfinished jobs....
make[2]: Entering directory '/tmp/B.yxahbxry/BUILD/widelands-1.0/build'
[ 82%] Building CXX object src/ui_fsmenu/CMakeFiles/ui_fsmenu.dir/campaigns.cc.o
cd /tmp/B.yxahbxry/BUILD/widelands-1.0/build/src/ui_fsmenu && /usr/bin/x86_64-pld-linux-gnux32-g++  -DUSE_XDG -DWL_USE_GLVND -I/tmp/B.yxahbxry/BUILD/widelands-1.0/src -I/tmp/B.yxahbxry/BUILD/widelands-1.0/build/src -isystem /usr/include/SDL2  -O2 -fwrapv -pipe -Wformat -Werror=format-security -gdwarf-4 -fno-debug-types-section -fvar-tracking-assignments -g2 -Wp,-D_FORTIFY_SOURCE=2 -fstack-protector-strong --param=ssp-buffer-size=4 -Werror=trampolines -fPIC -mtune=generic -march=x86-64 -gdwarf-4 -fno-debug-types-section -fvar-tracking-assignments -g2  -DNDEBUG -DQT_NO_DEBUG    -fext-numeric-literals -std=c++11  -DNDEBUG -DNOPARACHUTE -Wredundant-decls -Wall -Wpedantic -Wdeprecated-declarations -Wextra -Wformat -Wformat-nonliteral -Wformat-security -Wformat-y2k -Winit-self -Winvalid-pch -Wlogical-op -Wmissing-include-dirs -Wno-undef -Wold-style-cast -Woverlength-strings -Wpacked -Wpointer-arith -Wsign-promo -Wsync-nand -Wtrampolines -Wundef -Wunused -Wunused-macros -Werror=format-security -Werror=return-type -Werror=shadow -Werror=uninitialized -o CMakeFiles/ui_fsmenu.dir/campaigns.cc.o -c /tmp/B.yxahbxry/BUILD/widelands-1.0/src/ui_fsmenu/campaigns.cc
make[2]: Leaving directory '/tmp/B.yxahbxry/BUILD/widelands-1.0/build'
make[2]: Entering directory '/tmp/B.yxahbxry/BUILD/widelands-1.0/build'
[ 82%] Building CXX object src/ui_fsmenu/CMakeFiles/ui_fsmenu.dir/about.cc.o
cd /tmp/B.yxahbxry/BUILD/widelands-1.0/build/src/ui_fsmenu && /usr/bin/x86_64-pld-linux-gnux32-g++  -DUSE_XDG -DWL_USE_GLVND -I/tmp/B.yxahbxry/BUILD/widelands-1.0/src -I/tmp/B.yxahbxry/BUILD/widelands-1.0/build/src -isystem /usr/include/SDL2  -O2 -fwrapv -pipe -Wformat -Werror=format-security -gdwarf-4 -fno-debug-types-section -fvar-tracking-assignments -g2 -Wp,-D_FORTIFY_SOURCE=2 -fstack-protector-strong --param=ssp-buffer-size=4 -Werror=trampolines -fPIC -mtune=generic -march=x86-64 -gdwarf-4 -fno-debug-types-section -fvar-tracking-assignments -g2  -DNDEBUG -DQT_NO_DEBUG    -fext-numeric-literals -std=c++11  -DNDEBUG -DNOPARACHUTE -Wredundant-decls -Wall -Wpedantic -Wdeprecated-declarations -Wextra -Wformat -Wformat-nonliteral -Wformat-security -Wformat-y2k -Winit-self -Winvalid-pch -Wlogical-op -Wmissing-include-dirs -Wno-undef -Wold-style-cast -Woverlength-strings -Wpacked -Wpointer-arith -Wsign-promo -Wsync-nand -Wtrampolines -Wundef -Wunused -Wunused-macros -Werror=format-security -Werror=return-type -Werror=shadow -Werror=uninitialized -o CMakeFiles/ui_fsmenu.dir/about.cc.o -c /tmp/B.yxahbxry/BUILD/widelands-1.0/src/ui_fsmenu/about.cc
make[2]: Leaving directory '/tmp/B.yxahbxry/BUILD/widelands-1.0/build'
make[2]: Entering directory '/tmp/B.yxahbxry/BUILD/widelands-1.0/build'
[ 82%] Building CXX object src/ui_fsmenu/CMakeFiles/ui_fsmenu.dir/helpwindow.cc.o
cd /tmp/B.yxahbxry/BUILD/widelands-1.0/build/src/ui_fsmenu && /usr/bin/x86_64-pld-linux-gnux32-g++  -DUSE_XDG -DWL_USE_GLVND -I/tmp/B.yxahbxry/BUILD/widelands-1.0/src -I/tmp/B.yxahbxry/BUILD/widelands-1.0/build/src -isystem /usr/include/SDL2  -O2 -fwrapv -pipe -Wformat -Werror=format-security -gdwarf-4 -fno-debug-types-section -fvar-tracking-assignments -g2 -Wp,-D_FORTIFY_SOURCE=2 -fstack-protector-strong --param=ssp-buffer-size=4 -Werror=trampolines -fPIC -mtune=generic -march=x86-64 -gdwarf-4 -fno-debug-types-section -fvar-tracking-assignments -g2  -DNDEBUG -DQT_NO_DEBUG    -fext-numeric-literals -std=c++11  -DNDEBUG -DNOPARACHUTE -Wredundant-decls -Wall -Wpedantic -Wdeprecated-declarations -Wextra -Wformat -Wformat-nonliteral -Wformat-security -Wformat-y2k -Winit-self -Winvalid-pch -Wlogical-op -Wmissing-include-dirs -Wno-undef -Wold-style-cast -Woverlength-strings -Wpacked -Wpointer-arith -Wsign-promo -Wsync-nand -Wtrampolines -Wundef -Wunused -Wunused-macros -Werror=format-security -Werror=return-type -Werror=shadow -Werror=uninitialized -o CMakeFiles/ui_fsmenu.dir/helpwindow.cc.o -c /tmp/B.yxahbxry/BUILD/widelands-1.0/src/ui_fsmenu/helpwindow.cc
make[2]: Leaving directory '/tmp/B.yxahbxry/BUILD/widelands-1.0/build'
make[2]: Entering directory '/tmp/B.yxahbxry/BUILD/widelands-1.0/build'
[ 82%] Building CXX object src/ui_fsmenu/CMakeFiles/ui_fsmenu.dir/campaign_select.cc.o
cd /tmp/B.yxahbxry/BUILD/widelands-1.0/build/src/ui_fsmenu && /usr/bin/x86_64-pld-linux-gnux32-g++  -DUSE_XDG -DWL_USE_GLVND -I/tmp/B.yxahbxry/BUILD/widelands-1.0/src -I/tmp/B.yxahbxry/BUILD/widelands-1.0/build/src -isystem /usr/include/SDL2  -O2 -fwrapv -pipe -Wformat -Werror=format-security -gdwarf-4 -fno-debug-types-section -fvar-tracking-assignments -g2 -Wp,-D_FORTIFY_SOURCE=2 -fstack-protector-strong --param=ssp-buffer-size=4 -Werror=trampolines -fPIC -mtune=generic -march=x86-64 -gdwarf-4 -fno-debug-types-section -fvar-tracking-assignments -g2  -DNDEBUG -DQT_NO_DEBUG    -fext-numeric-literals -std=c++11  -DNDEBUG -DNOPARACHUTE -Wredundant-decls -Wall -Wpedantic -Wdeprecated-declarations -Wextra -Wformat -Wformat-nonliteral -Wformat-security -Wformat-y2k -Winit-self -Winvalid-pch -Wlogical-op -Wmissing-include-dirs -Wno-undef -Wold-style-cast -Woverlength-strings -Wpacked -Wpointer-arith -Wsign-promo -Wsync-nand -Wtrampolines -Wundef -Wunused -Wunused-macros -Werror=format-security -Werror=return-type -Werror=shadow -Werror=uninitialized -o CMakeFiles/ui_fsmenu.dir/campaign_select.cc.o -c /tmp/B.yxahbxry/BUILD/widelands-1.0/src/ui_fsmenu/campaign_select.cc
make[2]: Leaving directory '/tmp/B.yxahbxry/BUILD/widelands-1.0/build'
make[2]: Entering directory '/tmp/B.yxahbxry/BUILD/widelands-1.0/build'
[ 82%] Building CXX object src/ui_fsmenu/CMakeFiles/ui_fsmenu.dir/addons_packager_box.cc.o
cd /tmp/B.yxahbxry/BUILD/widelands-1.0/build/src/ui_fsmenu && /usr/bin/x86_64-pld-linux-gnux32-g++  -DUSE_XDG -DWL_USE_GLVND -I/tmp/B.yxahbxry/BUILD/widelands-1.0/src -I/tmp/B.yxahbxry/BUILD/widelands-1.0/build/src -isystem /usr/include/SDL2  -O2 -fwrapv -pipe -Wformat -Werror=format-security -gdwarf-4 -fno-debug-types-section -fvar-tracking-assignments -g2 -Wp,-D_FORTIFY_SOURCE=2 -fstack-protector-strong --param=ssp-buffer-size=4 -Werror=trampolines -fPIC -mtune=generic -march=x86-64 -gdwarf-4 -fno-debug-types-section -fvar-tracking-assignments -g2  -DNDEBUG -DQT_NO_DEBUG    -fext-numeric-literals -std=c++11  -DNDEBUG -DNOPARACHUTE -Wredundant-decls -Wall -Wpedantic -Wdeprecated-declarations -Wextra -Wformat -Wformat-nonliteral -Wformat-security -Wformat-y2k -Winit-self -Winvalid-pch -Wlogical-op -Wmissing-include-dirs -Wno-undef -Wold-style-cast -Woverlength-strings -Wpacked -Wpointer-arith -Wsign-promo -Wsync-nand -Wtrampolines -Wundef -Wunused -Wunused-macros -Werror=format-security -Werror=return-type -Werror=shadow -Werror=uninitialized -o CMakeFiles/ui_fsmenu.dir/addons_packager_box.cc.o -c /tmp/B.yxahbxry/BUILD/widelands-1.0/src/ui_fsmenu/addons_packager_box.cc
make[2]: Leaving directory '/tmp/B.yxahbxry/BUILD/widelands-1.0/build'
make[2]: Entering directory '/tmp/B.yxahbxry/BUILD/widelands-1.0/build'
[ 82%] Building CXX object src/ui_fsmenu/CMakeFiles/ui_fsmenu.dir/addons_packager.cc.o
cd /tmp/B.yxahbxry/BUILD/widelands-1.0/build/src/ui_fsmenu && /usr/bin/x86_64-pld-linux-gnux32-g++  -DUSE_XDG -DWL_USE_GLVND -I/tmp/B.yxahbxry/BUILD/widelands-1.0/src -I/tmp/B.yxahbxry/BUILD/widelands-1.0/build/src -isystem /usr/include/SDL2  -O2 -fwrapv -pipe -Wformat -Werror=format-security -gdwarf-4 -fno-debug-types-section -fvar-tracking-assignments -g2 -Wp,-D_FORTIFY_SOURCE=2 -fstack-protector-strong --param=ssp-buffer-size=4 -Werror=trampolines -fPIC -mtune=generic -march=x86-64 -gdwarf-4 -fno-debug-types-section -fvar-tracking-assignments -g2  -DNDEBUG -DQT_NO_DEBUG    -fext-numeric-literals -std=c++11  -DNDEBUG -DNOPARACHUTE -Wredundant-decls -Wall -Wpedantic -Wdeprecated-declarations -Wextra -Wformat -Wformat-nonliteral -Wformat-security -Wformat-y2k -Winit-self -Winvalid-pch -Wlogical-op -Wmissing-include-dirs -Wno-undef -Wold-style-cast -Woverlength-strings -Wpacked -Wpointer-arith -Wsign-promo -Wsync-nand -Wtrampolines -Wundef -Wunused -Wunused-macros -Werror=format-security -Werror=return-type -Werror=shadow -Werror=uninitialized -o CMakeFiles/ui_fsmenu.dir/addons_packager.cc.o -c /tmp/B.yxahbxry/BUILD/widelands-1.0/src/ui_fsmenu/addons_packager.cc
make[2]: Leaving directory '/tmp/B.yxahbxry/BUILD/widelands-1.0/build'
make[2]: Entering directory '/tmp/B.yxahbxry/BUILD/widelands-1.0/build'
[ 82%] Building CXX object src/ui_fsmenu/CMakeFiles/ui_fsmenu.dir/keyboard_options.cc.o
cd /tmp/B.yxahbxry/BUILD/widelands-1.0/build/src/ui_fsmenu && /usr/bin/x86_64-pld-linux-gnux32-g++  -DUSE_XDG -DWL_USE_GLVND -I/tmp/B.yxahbxry/BUILD/widelands-1.0/src -I/tmp/B.yxahbxry/BUILD/widelands-1.0/build/src -isystem /usr/include/SDL2  -O2 -fwrapv -pipe -Wformat -Werror=format-security -gdwarf-4 -fno-debug-types-section -fvar-tracking-assignments -g2 -Wp,-D_FORTIFY_SOURCE=2 -fstack-protector-strong --param=ssp-buffer-size=4 -Werror=trampolines -fPIC -mtune=generic -march=x86-64 -gdwarf-4 -fno-debug-types-section -fvar-tracking-assignments -g2  -DNDEBUG -DQT_NO_DEBUG    -fext-numeric-literals -std=c++11  -DNDEBUG -DNOPARACHUTE -Wredundant-decls -Wall -Wpedantic -Wdeprecated-declarations -Wextra -Wformat -Wformat-nonliteral -Wformat-security -Wformat-y2k -Winit-self -Winvalid-pch -Wlogical-op -Wmissing-include-dirs -Wno-undef -Wold-style-cast -Woverlength-strings -Wpacked -Wpointer-arith -Wsign-promo -Wsync-nand -Wtrampolines -Wundef -Wunused -Wunused-macros -Werror=format-security -Werror=return-type -Werror=shadow -Werror=uninitialized -o CMakeFiles/ui_fsmenu.dir/keyboard_options.cc.o -c /tmp/B.yxahbxry/BUILD/widelands-1.0/src/ui_fsmenu/keyboard_options.cc
make[2]: Leaving directory '/tmp/B.yxahbxry/BUILD/widelands-1.0/build'
make[2]: Entering directory '/tmp/B.yxahbxry/BUILD/widelands-1.0/build'
[ 82%] Building CXX object src/ui_fsmenu/CMakeFiles/ui_fsmenu.dir/addons.cc.o
cd /tmp/B.yxahbxry/BUILD/widelands-1.0/build/src/ui_fsmenu && /usr/bin/x86_64-pld-linux-gnux32-g++  -DUSE_XDG -DWL_USE_GLVND -I/tmp/B.yxahbxry/BUILD/widelands-1.0/src -I/tmp/B.yxahbxry/BUILD/widelands-1.0/build/src -isystem /usr/include/SDL2  -O2 -fwrapv -pipe -Wformat -Werror=format-security -gdwarf-4 -fno-debug-types-section -fvar-tracking-assignments -g2 -Wp,-D_FORTIFY_SOURCE=2 -fstack-protector-strong --param=ssp-buffer-size=4 -Werror=trampolines -fPIC -mtune=generic -march=x86-64 -gdwarf-4 -fno-debug-types-section -fvar-tracking-assignments -g2  -DNDEBUG -DQT_NO_DEBUG    -fext-numeric-literals -std=c++11  -DNDEBUG -DNOPARACHUTE -Wredundant-decls -Wall -Wpedantic -Wdeprecated-declarations -Wextra -Wformat -Wformat-nonliteral -Wformat-security -Wformat-y2k -Winit-self -Winvalid-pch -Wlogical-op -Wmissing-include-dirs -Wno-undef -Wold-style-cast -Woverlength-strings -Wpacked -Wpointer-arith -Wsign-promo -Wsync-nand -Wtrampolines -Wundef -Wunused -Wunused-macros -Werror=format-security -Werror=return-type -Werror=shadow -Werror=uninitialized -o CMakeFiles/ui_fsmenu.dir/addons.cc.o -c /tmp/B.yxahbxry/BUILD/widelands-1.0/src/ui_fsmenu/addons.cc
make[2]: Leaving directory '/tmp/B.yxahbxry/BUILD/widelands-1.0/build'
make[1]: *** [CMakeFiles/Makefile2:30674: src/ui_fsmenu/CMakeFiles/ui_fsmenu.dir/all] Error 2
make: *** [Makefile:164: all] Error 2
error: Bad exit status from /tmp/B.yxahbxry/BUILD/tmp/rpm-tmp.sunX66 (%build)


RPM build errors:
    Bad exit status from /tmp/B.yxahbxry/BUILD/tmp/rpm-tmp.sunX66 (%build)
ended at: Fri Jan 14 20:35:29 2022, done in 0:04:46.284026
error: No files produced.
+ chmod -R u+rwX /tmp/B.yxahbxry/BUILD
+ rm -rf /tmp/B.yxahbxry/tmp /tmp/B.yxahbxry/BUILD
+ rm -rf /tmp/B.yxahbxry
Begin-PLD-Builder-Info
Build-Time: user:1015.52s sys:112.40s real:350.67s (faults io:7239 non-io:14004003)

End-PLD-Builder-Info
[Back to list of logs] [View rpm -qa of builder]