FailedOk

th/SRPMS[OK]
th/x32[OK]
th/i686[OK]
th/x86_64[OK]

ac/SRPMS[OK]
ac/i386[OK]
ac/i586[OK]
ac/i686[OK]
ac/alpha[OK]
ac/amd64[OK]
ac/athlon[OK]
ac/ppc[OK]
ac/sparc[OK]
ac/sparc64[OK]

Advanced Search
main()
Powered by PLD Linux
(c) 2002-2022 PLD Team
$Revision: 1.37 $
Powered by computron.
Your IP: 44.200.169.3

xqilla d79a3f89-c552-49ac-9846-425c28602201

Status:Failed
Source URL:https://buildlogs.pld-linux.org/pld/th/x32/FAIL/xqilla,d79a3f89-c552-49ac-9846-425c28602201.bz2
text/plain URL:View!
rpm -qa of builder:View!
Date:2022/09/24 21:39:18
Runtime:0:00:38.276692

Toc:

  • prep
  • Executing(%prep): /bin/sh -e /tmp/B.ache4phw/BUILD/tmp/rpm-tmp.S4RYDl
  • build
  • Executing(%build): /bin/sh -e /tmp/B.ache4phw/BUILD/tmp/rpm-tmp.tWAJ6R
  • error 1
  • /usr/include/c++/12.2.0/bits/stl_tree.h:770:15: error: static assertion failed: comparison object must be invocable as const
  • error 2
  • make[1]: *** [Makefile:2958: XQDocumentOrder.lo] Error 1
  • error 3
  • error: Bad exit status from /tmp/B.ache4phw/BUILD/tmp/rpm-tmp.tWAJ6R (%build)
  • error 4
  • RPM build errors:
  • error 5
  • error: No files produced.

Content:

request from: qboosh
checking if we should skip the build
started at: Sat Sep 24 21:38:36 2022
killing old processes on a builder
sending signal 9 to pid -1
cleaning up /tmp
fetching https://srcbuilder.pld-linux.org/th//srpms/d79a3f89-c552-49ac-9846-425c28602201/xqilla-2.3.4-2.src.rpm
fetched 15437553 bytes, 13434.6 K/s
installing srpm: xqilla-2.3.4-2.src.rpm
+ install -d /tmp/B.ache4phw/BUILD /tmp/B.ache4phw/RPMS
+ LC_ALL=en_US.UTF-8
+ rpm -qp --changelog xqilla-2.3.4-2.src.rpm
* Sat Sep 24 2022 PLD Linux Team <feedback@pld-linux.org>
- For complete changelog see: http://git.pld-linux.org/?p=packages/xqilla.git;a=log;h=master
* Sat Sep 24 2022 Jakub Bogusz <qboosh@pld-linux.org> 4caf371
- release 2 (tidy soname change) * Sun Mar 07 2021 Jan Rękorajski <baggins@pld-linux.org> 96f502c
- unconditional noarch subpackages * Tue Nov 24 2020 Jakub Bogusz <qboosh@pld-linux.org> 0e6de20
- updated to 2.3.4 - updated soname patch - removed obsolete xerces patches * Thu Dec 14 2017 Jakub Bogusz <qboosh@pld-linux.org> c606cc0
- release 3 (rebuild with tidy 5) * Fri Nov 24 2017 Jakub Bogusz <qboosh@pld-linux.org> 5beb168
- added patches for compatibility with xerces 3.2 - release 2 * Sat May 14 2016 Jakub Bogusz <qboosh@pld-linux.org> 56965b8
- updated to 2.3.3 - updated link patch (don't override LDFLAGS as it killed ours, set proper _LIBADD instead) - updated soname patch (so versioning mistake continued) * Fri Jan 29 2016 Jakub Bogusz <qboosh@pld-linux.org> d531bae
- updated to 2.3.2 - added soname patch (don't decrease soname, probably libtool versioning mistake) * Sun Mar 30 2014 Elan Ruusamäe <glen@delfi.ee> 266a358
- noarch apidocs * Wed Dec 25 2013 Arkadiusz Miśkiewicz <arekm@maven.pl> 8435e73
- release 4 (by relup.sh) * Thu Dec 06 2012 Jan Rękorajski <baggins@pld-linux.org> ac74620
- release 3 (by relup.sh) * Wed Nov 21 2012 Jan Rękorajski <baggins@pld-linux.org> 5c721b2
- release 2 (by relup.sh) * Sun Oct 07 2012 Jakub Bogusz <qboosh@pld-linux.org> 9615bcf
- cleanup * Sat Aug 04 2012 Jakub Bogusz <qboosh@pld-linux.org> 7df9f4d
- enabled faxpp support * Fri Aug 03 2012 Jakub Bogusz <qboosh@pld-linux.org> a0c0ca5
- new + rpm -Uhv --nodeps --define '_topdir /tmp/B.ache4phw' --define '_specdir %{_topdir}' --define '_sourcedir %{_specdir}' --define '_rpmdir %{_topdir}/RPMS' --define '_builddir %{_topdir}/BUILD' xqilla-2.3.4-2.src.rpm Updating / installing... xqilla-2.3.4-2 ######################################## + rm -f xqilla-2.3.4-2.src.rpm + install -m 700 -d /tmp/B.ache4phw/BUILD/tmp + TMPDIR=/tmp/B.ache4phw/BUILD/tmp + exec nice -n 0 rpmbuild -bp --short-circuit --nodeps --define '_topdir /tmp/B.ache4phw' --define '_specdir %{_topdir}' --define '_sourcedir %{_specdir}' --define '_rpmdir %{_topdir}/RPMS' --define '_builddir %{_topdir}/BUILD' --target x32-pld-linux --define 'prep exit 0' /tmp/B.ache4phw/xqilla.spec Building target platforms: x32-pld-linux Building for target x32-pld-linux checking BuildConflict-ing packages rpm: Building target platforms: x32-pld-linux rpm: Building for target x32-pld-linux no BuildConflicts found checking BR rpm: Building target platforms: x32-pld-linux rpm: Building for target x32-pld-linux no BR needed building RPM using: set -ex; : build-id: d79a3f89-c552-49ac-9846-425c28602201; TMPDIR=/tmp/B.ache4phw/BUILD/tmp exec nice -n 0 rpmbuild -bb --define '__jobs 9' --define '_smp_mflags -j9' --define '_make_opts -Otarget' --define '_pld_builder 1' --define '_topdir /tmp/B.ache4phw' --define '_specdir %{_topdir}' --define '_sourcedir %{_specdir}' --define '_rpmdir %{_topdir}/RPMS' --define '_builddir %{_topdir}/BUILD' --target x32-pld-linux /tmp/B.ache4phw/xqilla.spec + : build-id: d79a3f89-c552-49ac-9846-425c28602201 + TMPDIR=/tmp/B.ache4phw/BUILD/tmp + exec nice -n 0 rpmbuild -bb --define '__jobs 9' --define '_smp_mflags -j9' --define '_make_opts -Otarget' --define '_pld_builder 1' --define '_topdir /tmp/B.ache4phw' --define '_specdir %{_topdir}' --define '_sourcedir %{_specdir}' --define '_rpmdir %{_topdir}/RPMS' --define '_builddir %{_topdir}/BUILD' --target x32-pld-linux /tmp/B.ache4phw/xqilla.spec Building target platforms: x32-pld-linux Building for target x32-pld-linux Executing(%prep): /bin/sh -e /tmp/B.ache4phw/BUILD/tmp/rpm-tmp.S4RYDl + umask 022 + cd /tmp/B.ache4phw/BUILD + cd /tmp/B.ache4phw/BUILD + rm -rf XQilla-2.3.4 + /bin/gzip -dc /tmp/B.ache4phw/XQilla-2.3.4.tar.gz + /bin/tar -xof - + STATUS=0 + '[' 0 -ne 0 ']' + cd XQilla-2.3.4 + /bin/chmod -Rf a+rX,u+w,g-w,o-w . + echo 'Patch #0 (xqilla-link.patch):' Patch #0 (xqilla-link.patch): + </tmp/B.ache4phw/xqilla-link.patch + /usr/bin/patch -s -f -p1 '--fuzz=0' + echo 'Patch #1 (xqilla-soname.patch):' Patch #1 (xqilla-soname.patch): + </tmp/B.ache4phw/xqilla-soname.patch + /usr/bin/patch -s -f -p1 '--fuzz=0' + RPM_EC=0 + jobs -p + exit 0 Executing(%build): /bin/sh -e /tmp/B.ache4phw/BUILD/tmp/rpm-tmp.tWAJ6R HOME=/home/users/builder PATH=/home/users/builder/GNUstep/Tools:/bin:/usr/bin:/usr/local/bin TMPDIR=/tmp/B.ache4phw/BUILD/tmp + umask 022 + cd /tmp/B.ache4phw/BUILD + cd XQilla-2.3.4 + libtoolize --copy --force --install libtoolize: putting auxiliary files in AC_CONFIG_AUX_DIR, 'autotools'. libtoolize: copying file 'autotools/config.guess' libtoolize: copying file 'autotools/config.sub' libtoolize: copying file 'autotools/install-sh' libtoolize: copying file 'autotools/ltmain.sh' libtoolize: putting macros in AC_CONFIG_MACRO_DIRS, 'autotools/m4'. libtoolize: copying file 'autotools/m4/libtool.m4' libtoolize: copying file 'autotools/m4/ltoptions.m4' libtoolize: copying file 'autotools/m4/ltsugar.m4' libtoolize: copying file 'autotools/m4/ltversion.m4' libtoolize: copying file 'autotools/m4/lt~obsolete.m4' + aclocal -I autotools/m4 aclocal: warning: autoconf input should be named 'configure.ac', not 'configure.in' + autoconf configure.in:8: warning: AM_INIT_AUTOMAKE: two- and three-arguments forms are deprecated. ./lib/autoconf/general.m4:2434: AC_DIAGNOSE is expanded from... aclocal.m4:429: AM_INIT_AUTOMAKE is expanded from... configure.in:8: the top level configure.in:25: warning: The macro `AC_HELP_STRING' is obsolete. configure.in:25: You should run autoupdate. ./lib/autoconf/general.m4:204: AC_HELP_STRING is expanded from... ./lib/autoconf/general.m4:1534: AC_ARG_ENABLE is expanded from... configure.in:25: the top level configure.in:144: warning: The macro `AC_TRY_COMPILE' is obsolete. configure.in:144: You should run autoupdate. ./lib/autoconf/general.m4:2847: AC_TRY_COMPILE is expanded from... configure.in:144: the top level configure.in:163: warning: The macro `AC_TRY_COMPILE' is obsolete. configure.in:163: You should run autoupdate. ./lib/autoconf/general.m4:2847: AC_TRY_COMPILE is expanded from... configure.in:163: the top level configure.in:260: warning: The macro `AC_PROG_LIBTOOL' is obsolete. configure.in:260: You should run autoupdate. autotools/m4/libtool.m4:100: AC_PROG_LIBTOOL is expanded from... configure.in:260: the top level configure.in:269: warning: AC_PROG_LEX without either yywrap or noyywrap is obsolete ./lib/autoconf/programs.m4:716: _AC_PROG_LEX is expanded from... ./lib/autoconf/programs.m4:709: AC_PROG_LEX is expanded from... aclocal.m4:668: AM_PROG_LEX is expanded from... configure.in:269: the top level configure.in:308: warning: The macro `AC_HEADER_STDC' is obsolete. configure.in:308: You should run autoupdate. ./lib/autoconf/headers.m4:704: AC_HEADER_STDC is expanded from... configure.in:308: the top level configure.in:316: warning: The macro `AC_HEADER_TIME' is obsolete. configure.in:316: You should run autoupdate. ./lib/autoconf/headers.m4:743: AC_HEADER_TIME is expanded from... configure.in:316: the top level + autoheader autoheader: warning: autoconf input should be named 'configure.ac', not 'configure.in' + automake -a -c -f --foreign automake: warning: autoconf input should be named 'configure.ac', not 'configure.in' configure.in:8: warning: AM_INIT_AUTOMAKE: two- and three-arguments forms are deprecated. For more info, see: configure.in:8: https://www.gnu.org/software/automake/manual/automake.html#Modernize-AM_005fINIT_005fAUTOMAKE-invocation configure.in:259: installing 'autotools/compile' configure.in:8: installing 'autotools/missing' Makefile.am:4: warning: 'INCLUDES' is the old name for 'AM_CPPFLAGS' (or '*_CPPFLAGS') automake: warning: autoconf input should be named 'configure.ac', not 'configure.in' Makefile.am:22: warning: source file 'src/framework/ReferenceCounted.cpp' is in a subdirectory, Makefile.am:22: but option 'subdir-objects' is disabled automake: warning: possible forward-incompatibility. automake: At least one source file is in a subdirectory, but the 'subdir-objects' automake: automake option hasn't been enabled. For now, the corresponding output automake: object file(s) will be placed in the top-level directory. However, this automake: behavior may change in a future Automake major version, with object automake: files being placed in the same subdirectory as the corresponding sources. automake: You are advised to start using 'subdir-objects' option throughout your automake: project, to avoid future incompatibilities. Makefile.am:22: warning: source file 'src/framework/BaseMemoryManager.cpp' is in a subdirectory, Makefile.am:22: but option 'subdir-objects' is disabled Makefile.am:22: warning: source file 'src/framework/ProxyMemoryManager.cpp' is in a subdirectory, Makefile.am:22: but option 'subdir-objects' is disabled Makefile.am:22: warning: source file 'src/framework/StringPool.cpp' is in a subdirectory, Makefile.am:22: but option 'subdir-objects' is disabled Makefile.am:22: warning: source file 'src/framework/XPath2MemoryManagerImpl.cpp' is in a subdirectory, Makefile.am:22: but option 'subdir-objects' is disabled Makefile.am:22: warning: source file 'src/context/UpdateFactory.cpp' is in a subdirectory, Makefile.am:22: but option 'subdir-objects' is disabled Makefile.am:22: warning: source file 'src/context/impl/CollationImpl.cpp' is in a subdirectory, Makefile.am:22: but option 'subdir-objects' is disabled Makefile.am:22: warning: source file 'src/context/impl/CodepointCollation.cpp' is in a subdirectory, Makefile.am:22: but option 'subdir-objects' is disabled Makefile.am:22: warning: source file 'src/context/impl/VarStoreImpl.cpp' is in a subdirectory, Makefile.am:22: but option 'subdir-objects' is disabled Makefile.am:22: warning: source file 'src/context/impl/VarTypeStoreImpl.cpp' is in a subdirectory, Makefile.am:22: but option 'subdir-objects' is disabled Makefile.am:22: warning: source file 'src/context/impl/VarHashEntryImpl.cpp' is in a subdirectory, Makefile.am:22: but option 'subdir-objects' is disabled Makefile.am:22: warning: source file 'src/context/impl/XQContextImpl.cpp' is in a subdirectory, Makefile.am:22: but option 'subdir-objects' is disabled Makefile.am:22: warning: source file 'src/context/impl/XQDynamicContextImpl.cpp' is in a subdirectory, Makefile.am:22: but option 'subdir-objects' is disabled Makefile.am:22: warning: source file 'src/context/impl/ItemFactoryImpl.cpp' is in a subdirectory, Makefile.am:22: but option 'subdir-objects' is disabled Makefile.am:22: warning: source file 'src/ast/XQAtomize.cpp' is in a subdirectory, Makefile.am:22: but option 'subdir-objects' is disabled Makefile.am:22: warning: source file 'src/ast/XQEffectiveBooleanValue.cpp' is in a subdirectory, Makefile.am:22: but option 'subdir-objects' is disabled Makefile.am:22: warning: source file 'src/ast/XQMap.cpp' is in a subdirectory, Makefile.am:22: but option 'subdir-objects' is disabled Makefile.am:22: warning: source file 'src/ast/XQAnalyzeString.cpp' is in a subdirectory, Makefile.am:22: but option 'subdir-objects' is disabled Makefile.am:22: warning: source file 'src/ast/XQCastableAs.cpp' is in a subdirectory, Makefile.am:22: but option 'subdir-objects' is disabled Makefile.am:22: warning: source file 'src/ast/XQCastAs.cpp' is in a subdirectory, Makefile.am:22: but option 'subdir-objects' is disabled Makefile.am:22: warning: source file 'src/ast/XQContextItem.cpp' is in a subdirectory, Makefile.am:22: but option 'subdir-objects' is disabled Makefile.am:22: warning: source file 'src/ast/XQCopy.cpp' is in a subdirectory, Makefile.am:22: but option 'subdir-objects' is disabled Makefile.am:22: warning: source file 'src/ast/XQCopyOf.cpp' is in a subdirectory, Makefile.am:22: but option 'subdir-objects' is disabled Makefile.am:22: warning: source file 'src/ast/XQFunction.cpp' is in a subdirectory, Makefile.am:22: but option 'subdir-objects' is disabled Makefile.am:22: warning: source file 'src/ast/XQIf.cpp' is in a subdirectory, Makefile.am:22: but option 'subdir-objects' is disabled Makefile.am:22: warning: source file 'src/ast/ASTNodeImpl.cpp' is in a subdirectory, Makefile.am:22: but option 'subdir-objects' is disabled Makefile.am:22: warning: source file 'src/ast/XQInlineFunction.cpp' is in a subdirectory, Makefile.am:22: but option 'subdir-objects' is disabled Makefile.am:22: warning: source file 'src/ast/XQLiteral.cpp' is in a subdirectory, Makefile.am:22: but option 'subdir-objects' is disabled Makefile.am:22: warning: source file 'src/ast/XQNav.cpp' is in a subdirectory, Makefile.am:22: but option 'subdir-objects' is disabled Makefile.am:22: warning: source file 'src/ast/XQOperator.cpp' is in a subdirectory, Makefile.am:22: but option 'subdir-objects' is disabled Makefile.am:22: warning: source file 'src/ast/XQSequence.cpp' is in a subdirectory, Makefile.am:22: but option 'subdir-objects' is disabled Makefile.am:22: warning: source file 'src/ast/XQStep.cpp' is in a subdirectory, Makefile.am:22: but option 'subdir-objects' is disabled Makefile.am:22: warning: source file 'src/ast/XQTreatAs.cpp' is in a subdirectory, Makefile.am:22: but option 'subdir-objects' is disabled Makefile.am:22: warning: source file 'src/ast/XQFunctionCoercion.cpp' is in a subdirectory, Makefile.am:22: but option 'subdir-objects' is disabled Makefile.am:22: warning: source file 'src/ast/XQVariable.cpp' is in a subdirectory, Makefile.am:22: but option 'subdir-objects' is disabled Makefile.am:22: warning: source file 'src/ast/StaticAnalysis.cpp' is in a subdirectory, Makefile.am:22: but option 'subdir-objects' is disabled Makefile.am:22: warning: source file 'src/ast/StaticType.cpp' is in a subdirectory, Makefile.am:22: but option 'subdir-objects' is disabled Makefile.am:22: warning: source file 'src/ast/NumericFunction.cpp' is in a subdirectory, Makefile.am:22: but option 'subdir-objects' is disabled Makefile.am:22: warning: source file 'src/ast/XQDOMConstructor.cpp' is in a subdirectory, Makefile.am:22: but option 'subdir-objects' is disabled Makefile.am:22: warning: source file 'src/ast/XQDocumentConstructor.cpp' is in a subdirectory, Makefile.am:22: but option 'subdir-objects' is disabled Makefile.am:22: warning: source file 'src/ast/XQElementConstructor.cpp' is in a subdirectory, Makefile.am:22: but option 'subdir-objects' is disabled Makefile.am:22: warning: source file 'src/ast/XQAttributeConstructor.cpp' is in a subdirectory, Makefile.am:22: but option 'subdir-objects' is disabled Makefile.am:22: warning: source file 'src/ast/XQNamespaceConstructor.cpp' is in a subdirectory, Makefile.am:22: but option 'subdir-objects' is disabled Makefile.am:22: warning: source file 'src/ast/XQPIConstructor.cpp' is in a subdirectory, Makefile.am:22: but option 'subdir-objects' is disabled Makefile.am:22: warning: source file 'src/ast/XQCommentConstructor.cpp' is in a subdirectory, Makefile.am:22: but option 'subdir-objects' is disabled Makefile.am:22: warning: source file 'src/ast/XQTextConstructor.cpp' is in a subdirectory, Makefile.am:22: but option 'subdir-objects' is disabled Makefile.am:22: warning: source file 'src/ast/XQFunctionCall.cpp' is in a subdirectory, Makefile.am:22: but option 'subdir-objects' is disabled Makefile.am:22: warning: source file 'src/ast/XQFunctionConversion.cpp' is in a subdirectory, Makefile.am:22: but option 'subdir-objects' is disabled Makefile.am:22: warning: source file 'src/ast/XQFunctionDeref.cpp' is in a subdirectory, Makefile.am:22: but option 'subdir-objects' is disabled Makefile.am:22: warning: source file 'src/ast/XQPartialApply.cpp' is in a subdirectory, Makefile.am:22: but option 'subdir-objects' is disabled Makefile.am:22: warning: source file 'src/ast/XQFunctionRef.cpp' is in a subdirectory, Makefile.am:22: but option 'subdir-objects' is disabled Makefile.am:22: warning: source file 'src/ast/XQGlobalVariable.cpp' is in a subdirectory, Makefile.am:22: but option 'subdir-objects' is disabled Makefile.am:22: warning: source file 'src/ast/XQOrderingChange.cpp' is in a subdirectory, Makefile.am:22: but option 'subdir-objects' is disabled Makefile.am:22: warning: source file 'src/ast/XQQuantified.cpp' is in a subdirectory, Makefile.am:22: but option 'subdir-objects' is disabled Makefile.am:22: warning: source file 'src/ast/XQValidate.cpp' is in a subdirectory, Makefile.am:22: but option 'subdir-objects' is disabled Makefile.am:22: warning: source file 'src/ast/XQTypeswitch.cpp' is in a subdirectory, Makefile.am:22: but option 'subdir-objects' is disabled Makefile.am:22: warning: source file 'src/ast/ConvertFunctionArg.cpp' is in a subdirectory, Makefile.am:22: but option 'subdir-objects' is disabled Makefile.am:22: warning: source file 'src/ast/XQDocumentOrder.cpp' is in a subdirectory, Makefile.am:22: but option 'subdir-objects' is disabled Makefile.am:22: warning: source file 'src/ast/XQPredicate.cpp' is in a subdirectory, Makefile.am:22: but option 'subdir-objects' is disabled Makefile.am:22: warning: source file 'src/ast/XQReturn.cpp' is in a subdirectory, Makefile.am:22: but option 'subdir-objects' is disabled Makefile.am:22: warning: source file 'src/ast/TupleNode.cpp' is in a subdirectory, Makefile.am:22: but option 'subdir-objects' is disabled Makefile.am:22: warning: source file 'src/ast/ContextTuple.cpp' is in a subdirectory, Makefile.am:22: but option 'subdir-objects' is disabled Makefile.am:22: warning: source file 'src/ast/ForTuple.cpp' is in a subdirectory, Makefile.am:22: but option 'subdir-objects' is disabled Makefile.am:22: warning: source file 'src/ast/LetTuple.cpp' is in a subdirectory, Makefile.am:22: but option 'subdir-objects' is disabled Makefile.am:22: warning: source file 'src/ast/WhereTuple.cpp' is in a subdirectory, Makefile.am:22: but option 'subdir-objects' is disabled Makefile.am:22: warning: source file 'src/ast/CountTuple.cpp' is in a subdirectory, Makefile.am:22: but option 'subdir-objects' is disabled Makefile.am:22: warning: source file 'src/ast/OrderByTuple.cpp' is in a subdirectory, Makefile.am:22: but option 'subdir-objects' is disabled Makefile.am:22: warning: source file 'src/ast/XQNamespaceBinding.cpp' is in a subdirectory, Makefile.am:22: but option 'subdir-objects' is disabled Makefile.am:22: warning: source file 'src/ast/XQCallTemplate.cpp' is in a subdirectory, Makefile.am:22: but option 'subdir-objects' is disabled Makefile.am:22: warning: source file 'src/ast/XQApplyTemplates.cpp' is in a subdirectory, Makefile.am:22: but option 'subdir-objects' is disabled Makefile.am:22: warning: source file 'src/debug/ASTDebugHook.cpp' is in a subdirectory, Makefile.am:22: but option 'subdir-objects' is disabled Makefile.am:22: warning: source file 'src/debug/DebugHookDecorator.cpp' is in a subdirectory, Makefile.am:22: but option 'subdir-objects' is disabled Makefile.am:22: warning: source file 'src/debug/TupleDebugHook.cpp' is in a subdirectory, Makefile.am:22: but option 'subdir-objects' is disabled Makefile.am:22: warning: source file 'src/debug/InputParser.cpp' is in a subdirectory, Makefile.am:22: but option 'subdir-objects' is disabled Makefile.am:22: warning: source file 'src/debug/InteractiveDebugger.cpp' is in a subdirectory, Makefile.am:22: but option 'subdir-objects' is disabled Makefile.am:22: warning: source file 'src/debug/StackFrame.cpp' is in a subdirectory, Makefile.am:22: but option 'subdir-objects' is disabled Makefile.am:22: warning: source file 'src/events/ContentSequenceFilter.cpp' is in a subdirectory, Makefile.am:22: but option 'subdir-objects' is disabled Makefile.am:22: warning: source file 'src/events/EventGenerator.cpp' is in a subdirectory, Makefile.am:22: but option 'subdir-objects' is disabled Makefile.am:22: warning: source file 'src/events/EventSerializer.cpp' is in a subdirectory, Makefile.am:22: but option 'subdir-objects' is disabled Makefile.am:22: warning: source file 'src/events/NoInheritFilter.cpp' is in a subdirectory, Makefile.am:22: but option 'subdir-objects' is disabled Makefile.am:22: warning: source file 'src/events/NSFixupFilter.cpp' is in a subdirectory, Makefile.am:22: but option 'subdir-objects' is disabled Makefile.am:22: warning: source file 'src/events/QueryPathTreeFilter.cpp' is in a subdirectory, Makefile.am:22: but option 'subdir-objects' is disabled Makefile.am:22: warning: source file 'src/fulltext/FTContains.cpp' is in a subdirectory, Makefile.am:22: but option 'subdir-objects' is disabled Makefile.am:22: warning: source file 'src/fulltext/FTWords.cpp' is in a subdirectory, Makefile.am:22: but option 'subdir-objects' is disabled Makefile.am:22: warning: source file 'src/fulltext/FTOr.cpp' is in a subdirectory, Makefile.am:22: but option 'subdir-objects' is disabled Makefile.am:22: warning: source file 'src/fulltext/FTAnd.cpp' is in a subdirectory, Makefile.am:22: but option 'subdir-objects' is disabled Makefile.am:22: warning: source file 'src/fulltext/FTMildnot.cpp' is in a subdirectory, Makefile.am:22: but option 'subdir-objects' is disabled Makefile.am:22: warning: source file 'src/fulltext/FTUnaryNot.cpp' is in a subdirectory, Makefile.am:22: but option 'subdir-objects' is disabled Makefile.am:22: warning: source file 'src/fulltext/DefaultTokenizer.cpp' is in a subdirectory, Makefile.am:22: but option 'subdir-objects' is disabled Makefile.am:22: warning: source file 'src/fulltext/DefaultTokenStore.cpp' is in a subdirectory, Makefile.am:22: but option 'subdir-objects' is disabled Makefile.am:22: warning: source file 'src/fulltext/FTOrder.cpp' is in a subdirectory, Makefile.am:22: but option 'subdir-objects' is disabled Makefile.am:22: warning: source file 'src/fulltext/FTDistance.cpp' is in a subdirectory, Makefile.am:22: but option 'subdir-objects' is disabled Makefile.am:22: warning: source file 'src/fulltext/FTScope.cpp' is in a subdirectory, Makefile.am:22: but option 'subdir-objects' is disabled Makefile.am:22: warning: source file 'src/fulltext/FTContent.cpp' is in a subdirectory, Makefile.am:22: but option 'subdir-objects' is disabled Makefile.am:22: warning: source file 'src/fulltext/FTWindow.cpp' is in a subdirectory, Makefile.am:22: but option 'subdir-objects' is disabled Makefile.am:22: warning: source file 'src/dom-api/impl/XQillaBuilderImpl.cpp' is in a subdirectory, Makefile.am:22: but option 'subdir-objects' is disabled Makefile.am:22: warning: source file 'src/dom-api/impl/XQillaDocumentImpl.cpp' is in a subdirectory, Makefile.am:22: but option 'subdir-objects' is disabled Makefile.am:22: warning: source file 'src/dom-api/impl/XQillaExpressionImpl.cpp' is in a subdirectory, Makefile.am:22: but option 'subdir-objects' is disabled Makefile.am:22: warning: source file 'src/dom-api/impl/XQillaNSResolverImpl.cpp' is in a subdirectory, Makefile.am:22: but option 'subdir-objects' is disabled Makefile.am:22: warning: source file 'src/dom-api/impl/XQillaXMLGrammarPoolImpl.cpp' is in a subdirectory, Makefile.am:22: but option 'subdir-objects' is disabled Makefile.am:22: warning: source file 'src/dom-api/impl/XPathDocumentImpl.cpp' is in a subdirectory, Makefile.am:22: but option 'subdir-objects' is disabled Makefile.am:22: warning: source file 'src/dom-api/impl/XPathNamespaceImpl.cpp' is in a subdirectory, Makefile.am:22: but option 'subdir-objects' is disabled Makefile.am:22: warning: source file 'src/dom-api/impl/XPath2ResultImpl.cpp' is in a subdirectory, Makefile.am:22: but option 'subdir-objects' is disabled Makefile.am:22: warning: source file 'src/dom-api/XQillaImplementation.cpp' is in a subdirectory, Makefile.am:22: but option 'subdir-objects' is disabled Makefile.am:22: warning: source file 'src/dom-api/XPath2NodeSerializer.cpp' is in a subdirectory, Makefile.am:22: but option 'subdir-objects' is disabled Makefile.am:22: warning: source file 'src/simple-api/XQilla.cpp' is in a subdirectory, Makefile.am:22: but option 'subdir-objects' is disabled Makefile.am:22: warning: source file 'src/simple-api/XQQuery.cpp' is in a subdirectory, Makefile.am:22: but option 'subdir-objects' is disabled Makefile.am:22: warning: source file 'src/utils/UTF8Str.cpp' is in a subdirectory, Makefile.am:22: but option 'subdir-objects' is disabled Makefile.am:22: warning: source file 'src/utils/XMLChCompare.cpp' is in a subdirectory, Makefile.am:22: but option 'subdir-objects' is disabled Makefile.am:22: warning: source file 'src/utils/XStr.cpp' is in a subdirectory, Makefile.am:22: but option 'subdir-objects' is disabled Makefile.am:22: warning: source file 'src/utils/ContextUtils.cpp' is in a subdirectory, Makefile.am:22: but option 'subdir-objects' is disabled Makefile.am:22: warning: source file 'src/utils/DateUtils.cpp' is in a subdirectory, Makefile.am:22: but option 'subdir-objects' is disabled Makefile.am:22: warning: source file 'src/utils/NumUtils.cpp' is in a subdirectory, Makefile.am:22: but option 'subdir-objects' is disabled Makefile.am:22: warning: source file 'src/utils/XQillaPlatformUtils.cpp' is in a subdirectory, Makefile.am:22: but option 'subdir-objects' is disabled Makefile.am:22: warning: source file 'src/utils/XPath2NSUtils.cpp' is in a subdirectory, Makefile.am:22: but option 'subdir-objects' is disabled Makefile.am:22: warning: source file 'src/utils/XPath2Utils.cpp' is in a subdirectory, Makefile.am:22: but option 'subdir-objects' is disabled Makefile.am:22: warning: source file 'src/utils/UnicodeTransformer.cpp' is in a subdirectory, Makefile.am:22: but option 'subdir-objects' is disabled Makefile.am:22: warning: source file 'src/utils/utf8proc/utf8proc.c' is in a subdirectory, Makefile.am:22: but option 'subdir-objects' is disabled Makefile.am:22: warning: source file 'src/utils/DelayedModule.cpp' is in a subdirectory, Makefile.am:22: but option 'subdir-objects' is disabled Makefile.am:22: warning: source file 'src/exceptions/XQillaException.cpp' is in a subdirectory, Makefile.am:22: but option 'subdir-objects' is disabled Makefile.am:22: warning: source file 'src/exceptions/XQException.cpp' is in a subdirectory, Makefile.am:22: but option 'subdir-objects' is disabled Makefile.am:22: warning: source file 'src/functions/EXSLTMathFunction.cpp' is in a subdirectory, Makefile.am:22: but option 'subdir-objects' is disabled Makefile.am:22: warning: source file 'src/functions/ExternalFunction.cpp' is in a subdirectory, Makefile.am:22: but option 'subdir-objects' is disabled Makefile.am:22: warning: source file 'src/functions/XQillaFunction.cpp' is in a subdirectory, Makefile.am:22: but option 'subdir-objects' is disabled Makefile.am:22: warning: source file 'src/functions/FunctionParseXML.cpp' is in a subdirectory, Makefile.am:22: but option 'subdir-objects' is disabled Makefile.am:22: warning: source file 'src/functions/FuncFactory.cpp' is in a subdirectory, Makefile.am:22: but option 'subdir-objects' is disabled Makefile.am:22: warning: source file 'src/functions/FunctionLookup.cpp' is in a subdirectory, Makefile.am:22: but option 'subdir-objects' is disabled Makefile.am:22: warning: source file 'src/functions/FunctionAbs.cpp' is in a subdirectory, Makefile.am:22: but option 'subdir-objects' is disabled Makefile.am:22: warning: source file 'src/functions/FunctionAcos.cpp' is in a subdirectory, Makefile.am:22: but option 'subdir-objects' is disabled Makefile.am:22: warning: source file 'src/functions/FunctionAsin.cpp' is in a subdirectory, Makefile.am:22: but option 'subdir-objects' is disabled Makefile.am:22: warning: source file 'src/functions/FunctionAtan.cpp' is in a subdirectory, Makefile.am:22: but option 'subdir-objects' is disabled Makefile.am:22: warning: source file 'src/functions/FunctionBaseURI.cpp' is in a subdirectory, Makefile.am:22: but option 'subdir-objects' is disabled Makefile.am:22: warning: source file 'src/functions/FunctionCaseFold.cpp' is in a subdirectory, Makefile.am:22: but option 'subdir-objects' is disabled Makefile.am:22: warning: source file 'src/functions/FunctionCeiling.cpp' is in a subdirectory, Makefile.am:22: but option 'subdir-objects' is disabled Makefile.am:22: warning: source file 'src/functions/FunctionCodepointsToString.cpp' is in a subdirectory, Makefile.am:22: but option 'subdir-objects' is disabled Makefile.am:22: warning: source file 'src/functions/FunctionCollection.cpp' is in a subdirectory, Makefile.am:22: but option 'subdir-objects' is disabled Makefile.am:22: warning: source file 'src/functions/FunctionCompare.cpp' is in a subdirectory, Makefile.am:22: but option 'subdir-objects' is disabled Makefile.am:22: warning: source file 'src/functions/FunctionConcat.cpp' is in a subdirectory, Makefile.am:22: but option 'subdir-objects' is disabled Makefile.am:22: warning: source file 'src/functions/FunctionContains.cpp' is in a subdirectory, Makefile.am:22: but option 'subdir-objects' is disabled Makefile.am:22: warning: source file 'src/functions/FunctionCount.cpp' is in a subdirectory, Makefile.am:22: but option 'subdir-objects' is disabled Makefile.am:22: warning: source file 'src/functions/FunctionCos.cpp' is in a subdirectory, Makefile.am:22: but option 'subdir-objects' is disabled Makefile.am:22: warning: source file 'src/functions/FunctionCurrentDate.cpp' is in a subdirectory, Makefile.am:22: but option 'subdir-objects' is disabled Makefile.am:22: warning: source file 'src/functions/FunctionCurrentDateTime.cpp' is in a subdirectory, Makefile.am:22: but option 'subdir-objects' is disabled Makefile.am:22: warning: source file 'src/functions/FunctionCurrentTime.cpp' is in a subdirectory, Makefile.am:22: but option 'subdir-objects' is disabled Makefile.am:22: warning: source file 'src/functions/FunctionDateTime.cpp' is in a subdirectory, Makefile.am:22: but option 'subdir-objects' is disabled Makefile.am:22: warning: source file 'src/functions/FunctionDefaultCollation.cpp' is in a subdirectory, Makefile.am:22: but option 'subdir-objects' is disabled Makefile.am:22: warning: source file 'src/functions/FunctionDistinctValues.cpp' is in a subdirectory, Makefile.am:22: but option 'subdir-objects' is disabled Makefile.am:22: warning: source file 'src/functions/FunctionDocAvailable.cpp' is in a subdirectory, Makefile.am:22: but option 'subdir-objects' is disabled Makefile.am:22: warning: source file 'src/functions/FunctionDoc.cpp' is in a subdirectory, Makefile.am:22: but option 'subdir-objects' is disabled Makefile.am:22: warning: source file 'src/functions/FunctionDocument.cpp' is in a subdirectory, Makefile.am:22: but option 'subdir-objects' is disabled Makefile.am:22: warning: source file 'src/functions/FunctionDocumentURI.cpp' is in a subdirectory, Makefile.am:22: but option 'subdir-objects' is disabled Makefile.am:22: warning: source file 'src/functions/FunctionEmpty.cpp' is in a subdirectory, Makefile.am:22: but option 'subdir-objects' is disabled Makefile.am:22: warning: source file 'src/functions/FunctionEndsWith.cpp' is in a subdirectory, Makefile.am:22: but option 'subdir-objects' is disabled Makefile.am:22: warning: source file 'src/functions/FunctionError.cpp' is in a subdirectory, Makefile.am:22: but option 'subdir-objects' is disabled Makefile.am:22: warning: source file 'src/functions/FunctionExp.cpp' is in a subdirectory, Makefile.am:22: but option 'subdir-objects' is disabled Makefile.am:22: warning: source file 'src/functions/FunctionFloor.cpp' is in a subdirectory, Makefile.am:22: but option 'subdir-objects' is disabled Makefile.am:22: warning: source file 'src/functions/FunctionFunctionArity.cpp' is in a subdirectory, Makefile.am:22: but option 'subdir-objects' is disabled Makefile.am:22: warning: source file 'src/functions/FunctionFunctionName.cpp' is in a subdirectory, Makefile.am:22: but option 'subdir-objects' is disabled Makefile.am:22: warning: source file 'src/functions/FunctionId.cpp' is in a subdirectory, Makefile.am:22: but option 'subdir-objects' is disabled Makefile.am:22: warning: source file 'src/functions/FunctionIdref.cpp' is in a subdirectory, Makefile.am:22: but option 'subdir-objects' is disabled Makefile.am:22: warning: source file 'src/functions/FunctionImplicitTimezone.cpp' is in a subdirectory, Makefile.am:22: but option 'subdir-objects' is disabled Makefile.am:22: warning: source file 'src/functions/FunctionLang.cpp' is in a subdirectory, Makefile.am:22: but option 'subdir-objects' is disabled Makefile.am:22: warning: source file 'src/functions/FunctionLast.cpp' is in a subdirectory, Makefile.am:22: but option 'subdir-objects' is disabled Makefile.am:22: warning: source file 'src/functions/FunctionLocalname.cpp' is in a subdirectory, Makefile.am:22: but option 'subdir-objects' is disabled Makefile.am:22: warning: source file 'src/functions/FunctionLocalNameFromQName.cpp' is in a subdirectory, Makefile.am:22: but option 'subdir-objects' is disabled Makefile.am:22: warning: source file 'src/functions/FunctionLog.cpp' is in a subdirectory, Makefile.am:22: but option 'subdir-objects' is disabled Makefile.am:22: warning: source file 'src/functions/FunctionLowerCase.cpp' is in a subdirectory, Makefile.am:22: but option 'subdir-objects' is disabled Makefile.am:22: warning: source file 'src/functions/FunctionMatches.cpp' is in a subdirectory, Makefile.am:22: but option 'subdir-objects' is disabled Makefile.am:22: warning: source file 'src/functions/FunctionName.cpp' is in a subdirectory, Makefile.am:22: but option 'subdir-objects' is disabled Makefile.am:22: warning: source file 'src/functions/FunctionNamespaceUri.cpp' is in a subdirectory, Makefile.am:22: but option 'subdir-objects' is disabled Makefile.am:22: warning: source file 'src/functions/FunctionNamespaceURIFromQName.cpp' is in a subdirectory, Makefile.am:22: but option 'subdir-objects' is disabled Makefile.am:22: warning: source file 'src/functions/FunctionNilled.cpp' is in a subdirectory, Makefile.am:22: but option 'subdir-objects' is disabled Makefile.am:22: warning: source file 'src/functions/FunctionNodeName.cpp' is in a subdirectory, Makefile.am:22: but option 'subdir-objects' is disabled Makefile.am:22: warning: source file 'src/functions/FunctionNormalizeSpace.cpp' is in a subdirectory, Makefile.am:22: but option 'subdir-objects' is disabled Makefile.am:22: warning: source file 'src/functions/FunctionNormalizeUnicode.cpp' is in a subdirectory, Makefile.am:22: but option 'subdir-objects' is disabled Makefile.am:22: warning: source file 'src/functions/FunctionNot.cpp' is in a subdirectory, Makefile.am:22: but option 'subdir-objects' is disabled Makefile.am:22: warning: source file 'src/functions/FunctionNumber.cpp' is in a subdirectory, Makefile.am:22: but option 'subdir-objects' is disabled Makefile.am:22: warning: source file 'src/functions/FunctionPosition.cpp' is in a subdirectory, Makefile.am:22: but option 'subdir-objects' is disabled Makefile.am:22: warning: source file 'src/functions/FunctionPower.cpp' is in a subdirectory, Makefile.am:22: but option 'subdir-objects' is disabled Makefile.am:22: warning: source file 'src/functions/FunctionPrefixFromQName.cpp' is in a subdirectory, Makefile.am:22: but option 'subdir-objects' is disabled Makefile.am:22: warning: source file 'src/functions/FunctionQName.cpp' is in a subdirectory, Makefile.am:22: but option 'subdir-objects' is disabled Makefile.am:22: warning: source file 'src/functions/FunctionRegexGroup.cpp' is in a subdirectory, Makefile.am:22: but option 'subdir-objects' is disabled Makefile.am:22: warning: source file 'src/functions/FunctionReplace.cpp' is in a subdirectory, Makefile.am:22: but option 'subdir-objects' is disabled Makefile.am:22: warning: source file 'src/functions/FunctionResolveURI.cpp' is in a subdirectory, Makefile.am:22: but option 'subdir-objects' is disabled Makefile.am:22: warning: source file 'src/functions/FunctionRoot.cpp' is in a subdirectory, Makefile.am:22: but option 'subdir-objects' is disabled Makefile.am:22: warning: source file 'src/functions/FunctionRound.cpp' is in a subdirectory, Makefile.am:22: but option 'subdir-objects' is disabled Makefile.am:22: warning: source file 'src/functions/FunctionRoundHalfToEven.cpp' is in a subdirectory, Makefile.am:22: but option 'subdir-objects' is disabled Makefile.am:22: warning: source file 'src/functions/FunctionSin.cpp' is in a subdirectory, Makefile.am:22: but option 'subdir-objects' is disabled Makefile.am:22: warning: source file 'src/functions/FunctionSqrt.cpp' is in a subdirectory, Makefile.am:22: but option 'subdir-objects' is disabled Makefile.am:22: warning: source file 'src/functions/FunctionTan.cpp' is in a subdirectory, Makefile.am:22: but option 'subdir-objects' is disabled Makefile.am:22: warning: source file 'src/functions/FunctionSentences.cpp' is in a subdirectory, Makefile.am:22: but option 'subdir-objects' is disabled Makefile.am:22: warning: source file 'src/functions/FunctionStartsWith.cpp' is in a subdirectory, Makefile.am:22: but option 'subdir-objects' is disabled Makefile.am:22: warning: source file 'src/functions/FunctionStaticBaseURI.cpp' is in a subdirectory, Makefile.am:22: but option 'subdir-objects' is disabled Makefile.am:22: warning: source file 'src/functions/FunctionString.cpp' is in a subdirectory, Makefile.am:22: but option 'subdir-objects' is disabled Makefile.am:22: warning: source file 'src/functions/FunctionStringLength.cpp' is in a subdirectory, Makefile.am:22: but option 'subdir-objects' is disabled Makefile.am:22: warning: source file 'src/functions/FunctionStringToCodepoints.cpp' is in a subdirectory, Makefile.am:22: but option 'subdir-objects' is disabled Makefile.am:22: warning: source file 'src/functions/FunctionSubstring.cpp' is in a subdirectory, Makefile.am:22: but option 'subdir-objects' is disabled Makefile.am:22: warning: source file 'src/functions/FunctionTime.cpp' is in a subdirectory, Makefile.am:22: but option 'subdir-objects' is disabled Makefile.am:22: warning: source file 'src/functions/FunctionTokenize.cpp' is in a subdirectory, Makefile.am:22: but option 'subdir-objects' is disabled Makefile.am:22: warning: source file 'src/functions/FunctionTrace.cpp' is in a subdirectory, Makefile.am:22: but option 'subdir-objects' is disabled Makefile.am:22: warning: source file 'src/functions/FunctionHead.cpp' is in a subdirectory, Makefile.am:22: but option 'subdir-objects' is disabled Makefile.am:22: warning: source file 'src/functions/FunctionTail.cpp' is in a subdirectory, Makefile.am:22: but option 'subdir-objects' is disabled Makefile.am:22: warning: source file 'src/functions/FunctionUnordered.cpp' is in a subdirectory, Makefile.am:22: but option 'subdir-objects' is disabled Makefile.am:22: warning: source file 'src/functions/FunctionUnparsedText.cpp' is in a subdirectory, Makefile.am:22: but option 'subdir-objects' is disabled Makefile.am:22: warning: source file 'src/functions/FunctionUpperCase.cpp' is in a subdirectory, Makefile.am:22: but option 'subdir-objects' is disabled Makefile.am:22: warning: source file 'src/functions/FunctionWords.cpp' is in a subdirectory, Makefile.am:22: but option 'subdir-objects' is disabled Makefile.am:22: warning: source file 'src/functions/FunctionAdjustDateTimeToTimezone.cpp' is in a subdirectory, Makefile.am:22: but option 'subdir-objects' is disabled Makefile.am:22: warning: source file 'src/functions/FunctionAdjustDateToTimezone.cpp' is in a subdirectory, Makefile.am:22: but option 'subdir-objects' is disabled Makefile.am:22: warning: source file 'src/functions/FunctionAdjustTimeToTimezone.cpp' is in a subdirectory, Makefile.am:22: but option 'subdir-objects' is disabled Makefile.am:22: warning: source file 'src/functions/FunctionDayFromDate.cpp' is in a subdirectory, Makefile.am:22: but option 'subdir-objects' is disabled Makefile.am:22: warning: source file 'src/functions/FunctionDayFromDateTime.cpp' is in a subdirectory, Makefile.am:22: but option 'subdir-objects' is disabled Makefile.am:22: warning: source file 'src/functions/FunctionDaysFromDuration.cpp' is in a subdirectory, Makefile.am:22: but option 'subdir-objects' is disabled Makefile.am:22: warning: source file 'src/functions/FunctionHoursFromDateTime.cpp' is in a subdirectory, Makefile.am:22: but option 'subdir-objects' is disabled Makefile.am:22: warning: source file 'src/functions/FunctionHoursFromDuration.cpp' is in a subdirectory, Makefile.am:22: but option 'subdir-objects' is disabled Makefile.am:22: warning: source file 'src/functions/FunctionHoursFromTime.cpp' is in a subdirectory, Makefile.am:22: but option 'subdir-objects' is disabled Makefile.am:22: warning: source file 'src/functions/FunctionMinutesFromDateTime.cpp' is in a subdirectory, Makefile.am:22: but option 'subdir-objects' is disabled Makefile.am:22: warning: source file 'src/functions/FunctionMinutesFromDuration.cpp' is in a subdirectory, Makefile.am:22: but option 'subdir-objects' is disabled Makefile.am:22: warning: source file 'src/functions/FunctionMinutesFromTime.cpp' is in a subdirectory, Makefile.am:22: but option 'subdir-objects' is disabled Makefile.am:22: warning: source file 'src/functions/FunctionMonthFromDate.cpp' is in a subdirectory, Makefile.am:22: but option 'subdir-objects' is disabled Makefile.am:22: warning: source file 'src/functions/FunctionMonthFromDateTime.cpp' is in a subdirectory, Makefile.am:22: but option 'subdir-objects' is disabled Makefile.am:22: warning: source file 'src/functions/FunctionMonthsFromDuration.cpp' is in a subdirectory, Makefile.am:22: but option 'subdir-objects' is disabled Makefile.am:22: warning: source file 'src/functions/FunctionSecondsFromDateTime.cpp' is in a subdirectory, Makefile.am:22: but option 'subdir-objects' is disabled Makefile.am:22: warning: source file 'src/functions/FunctionSecondsFromDuration.cpp' is in a subdirectory, Makefile.am:22: but option 'subdir-objects' is disabled Makefile.am:22: warning: source file 'src/functions/FunctionSecondsFromTime.cpp' is in a subdirectory, Makefile.am:22: but option 'subdir-objects' is disabled Makefile.am:22: warning: source file 'src/functions/FunctionTimezoneFromDate.cpp' is in a subdirectory, Makefile.am:22: but option 'subdir-objects' is disabled Makefile.am:22: warning: source file 'src/functions/FunctionTimezoneFromDateTime.cpp' is in a subdirectory, Makefile.am:22: but option 'subdir-objects' is disabled Makefile.am:22: warning: source file 'src/functions/FunctionTimezoneFromTime.cpp' is in a subdirectory, Makefile.am:22: but option 'subdir-objects' is disabled Makefile.am:22: warning: source file 'src/functions/FunctionYearFromDate.cpp' is in a subdirectory, Makefile.am:22: but option 'subdir-objects' is disabled Makefile.am:22: warning: source file 'src/functions/FunctionYearFromDateTime.cpp' is in a subdirectory, Makefile.am:22: but option 'subdir-objects' is disabled Makefile.am:22: warning: source file 'src/functions/FunctionYearsFromDuration.cpp' is in a subdirectory, Makefile.am:22: but option 'subdir-objects' is disabled Makefile.am:22: warning: source file 'src/functions/FunctionParseJSON.cpp' is in a subdirectory, Makefile.am:22: but option 'subdir-objects' is disabled Makefile.am:22: warning: source file 'src/functions/FunctionSerializeJSON.cpp' is in a subdirectory, Makefile.am:22: but option 'subdir-objects' is disabled Makefile.am:22: warning: source file 'src/functions/FunctionParseHTML.cpp' is in a subdirectory, Makefile.am:22: but option 'subdir-objects' is disabled Makefile.am:22: warning: source file 'src/functions/FunctionExplain.cpp' is in a subdirectory, Makefile.am:22: but option 'subdir-objects' is disabled Makefile.am:22: warning: source file 'src/functions/FunctionAnalyzeString.cpp' is in a subdirectory, Makefile.am:22: but option 'subdir-objects' is disabled Makefile.am:22: warning: source file 'src/functions/RegExpFunction.cpp' is in a subdirectory, Makefile.am:22: but option 'subdir-objects' is disabled Makefile.am:22: warning: source file 'src/functions/XQUserFunction.cpp' is in a subdirectory, Makefile.am:22: but option 'subdir-objects' is disabled Makefile.am:22: warning: source file 'src/functions/FunctionSignature.cpp' is in a subdirectory, Makefile.am:22: but option 'subdir-objects' is disabled Makefile.am:22: warning: source file 'src/functions/BuiltInModules.cpp' is in a subdirectory, Makefile.am:22: but option 'subdir-objects' is disabled Makefile.am:22: warning: source file 'src/items/impl/ATAnySimpleTypeImpl.cpp' is in a subdirectory, Makefile.am:22: but option 'subdir-objects' is disabled Makefile.am:22: warning: source file 'src/items/impl/ATAnyURIOrDerivedImpl.cpp' is in a subdirectory, Makefile.am:22: but option 'subdir-objects' is disabled Makefile.am:22: warning: source file 'src/items/impl/ATBase64BinaryOrDerivedImpl.cpp' is in a subdirectory, Makefile.am:22: but option 'subdir-objects' is disabled Makefile.am:22: warning: source file 'src/items/impl/ATBooleanOrDerivedImpl.cpp' is in a subdirectory, Makefile.am:22: but option 'subdir-objects' is disabled Makefile.am:22: warning: source file 'src/items/impl/ATDateOrDerivedImpl.cpp' is in a subdirectory, Makefile.am:22: but option 'subdir-objects' is disabled Makefile.am:22: warning: source file 'src/items/impl/ATDateTimeOrDerivedImpl.cpp' is in a subdirectory, Makefile.am:22: but option 'subdir-objects' is disabled Makefile.am:22: warning: source file 'src/items/impl/ATDecimalOrDerivedImpl.cpp' is in a subdirectory, Makefile.am:22: but option 'subdir-objects' is disabled Makefile.am:22: warning: source file 'src/items/impl/ATDoubleOrDerivedImpl.cpp' is in a subdirectory, Makefile.am:22: but option 'subdir-objects' is disabled Makefile.am:22: warning: source file 'src/items/impl/ATDurationOrDerivedImpl.cpp' is in a subdirectory, Makefile.am:22: but option 'subdir-objects' is disabled Makefile.am:22: warning: source file 'src/items/impl/ATFloatOrDerivedImpl.cpp' is in a subdirectory, Makefile.am:22: but option 'subdir-objects' is disabled Makefile.am:22: warning: source file 'src/items/impl/ATGDayOrDerivedImpl.cpp' is in a subdirectory, Makefile.am:22: but option 'subdir-objects' is disabled Makefile.am:22: warning: source file 'src/items/impl/ATGMonthDayOrDerivedImpl.cpp' is in a subdirectory, Makefile.am:22: but option 'subdir-objects' is disabled Makefile.am:22: warning: source file 'src/items/impl/ATGMonthOrDerivedImpl.cpp' is in a subdirectory, Makefile.am:22: but option 'subdir-objects' is disabled Makefile.am:22: warning: source file 'src/items/impl/ATGYearMonthOrDerivedImpl.cpp' is in a subdirectory, Makefile.am:22: but option 'subdir-objects' is disabled Makefile.am:22: warning: source file 'src/items/impl/ATGYearOrDerivedImpl.cpp' is in a subdirectory, Makefile.am:22: but option 'subdir-objects' is disabled Makefile.am:22: warning: source file 'src/items/impl/ATHexBinaryOrDerivedImpl.cpp' is in a subdirectory, Makefile.am:22: but option 'subdir-objects' is disabled Makefile.am:22: warning: source file 'src/items/impl/ATNotationOrDerivedImpl.cpp' is in a subdirectory, Makefile.am:22: but option 'subdir-objects' is disabled Makefile.am:22: warning: source file 'src/items/impl/ATQNameOrDerivedImpl.cpp' is in a subdirectory, Makefile.am:22: but option 'subdir-objects' is disabled Makefile.am:22: warning: source file 'src/items/impl/ATStringOrDerivedImpl.cpp' is in a subdirectory, Makefile.am:22: but option 'subdir-objects' is disabled Makefile.am:22: warning: source file 'src/items/impl/ATTimeOrDerivedImpl.cpp' is in a subdirectory, Makefile.am:22: but option 'subdir-objects' is disabled Makefile.am:22: warning: source file 'src/items/impl/ATUntypedAtomicImpl.cpp' is in a subdirectory, Makefile.am:22: but option 'subdir-objects' is disabled Makefile.am:22: warning: source file 'src/items/impl/FunctionRefImpl.cpp' is in a subdirectory, Makefile.am:22: but option 'subdir-objects' is disabled Makefile.am:22: warning: source file 'src/items/DatatypeFactory.cpp' is in a subdirectory, Makefile.am:22: but option 'subdir-objects' is disabled Makefile.am:22: warning: source file 'src/items/DatatypeLookup.cpp' is in a subdirectory, Makefile.am:22: but option 'subdir-objects' is disabled Makefile.am:22: warning: source file 'src/items/AnyAtomicType.cpp' is in a subdirectory, Makefile.am:22: but option 'subdir-objects' is disabled Makefile.am:22: warning: source file 'src/items/ATDurationOrDerived.cpp' is in a subdirectory, Makefile.am:22: but option 'subdir-objects' is disabled Makefile.am:22: warning: source file 'src/items/ATUntypedAtomic.cpp' is in a subdirectory, Makefile.am:22: but option 'subdir-objects' is disabled Makefile.am:22: warning: source file 'src/items/DateOrTimeType.cpp' is in a subdirectory, Makefile.am:22: but option 'subdir-objects' is disabled Makefile.am:22: warning: source file 'src/items/Item.cpp' is in a subdirectory, Makefile.am:22: but option 'subdir-objects' is disabled Makefile.am:22: warning: source file 'src/items/Node.cpp' is in a subdirectory, Makefile.am:22: but option 'subdir-objects' is disabled Makefile.am:22: warning: source file 'src/items/Numeric.cpp' is in a subdirectory, Makefile.am:22: but option 'subdir-objects' is disabled Makefile.am:22: warning: source file 'src/items/Timezone.cpp' is in a subdirectory, Makefile.am:22: but option 'subdir-objects' is disabled Makefile.am:22: warning: source file 'src/parser/QName.cpp' is in a subdirectory, Makefile.am:22: but option 'subdir-objects' is disabled Makefile.am:22: warning: source file 'src/parser/XQParser.cpp' is in a subdirectory, Makefile.am:22: but option 'subdir-objects' is disabled Makefile.am:22: warning: source file 'src/lexer/XQLexer.cpp' is in a subdirectory, Makefile.am:22: but option 'subdir-objects' is disabled Makefile.am:22: warning: source file 'src/lexer/XQLexer2.cpp' is in a subdirectory, Makefile.am:22: but option 'subdir-objects' is disabled Makefile.am:22: warning: source file 'src/lexer/XSLT2Lexer.cpp' is in a subdirectory, Makefile.am:22: but option 'subdir-objects' is disabled Makefile.am:22: warning: source file 'src/mapm/mapm5sin.c' is in a subdirectory, Makefile.am:22: but option 'subdir-objects' is disabled Makefile.am:22: warning: source file 'src/mapm/mapm_add.c' is in a subdirectory, Makefile.am:22: but option 'subdir-objects' is disabled Makefile.am:22: warning: source file 'src/mapm/mapmasin.c' is in a subdirectory, Makefile.am:22: but option 'subdir-objects' is disabled Makefile.am:22: warning: source file 'src/mapm/mapmasn0.c' is in a subdirectory, Makefile.am:22: but option 'subdir-objects' is disabled Makefile.am:22: warning: source file 'src/mapm/mapmcbrt.c' is in a subdirectory, Makefile.am:22: but option 'subdir-objects' is disabled Makefile.am:22: warning: source file 'src/mapm/mapmcnst.c' is in a subdirectory, Makefile.am:22: but option 'subdir-objects' is disabled Makefile.am:22: warning: source file 'src/mapm/mapm_cpi.c' is in a subdirectory, Makefile.am:22: but option 'subdir-objects' is disabled Makefile.am:22: warning: source file 'src/mapm/m_apm.cpp' is in a subdirectory, Makefile.am:22: but option 'subdir-objects' is disabled Makefile.am:22: warning: source file 'src/mapm/mapm_div.c' is in a subdirectory, Makefile.am:22: but option 'subdir-objects' is disabled Makefile.am:22: warning: source file 'src/mapm/mapm_exp.c' is in a subdirectory, Makefile.am:22: but option 'subdir-objects' is disabled Makefile.am:22: warning: source file 'src/mapm/mapmfact.c' is in a subdirectory, Makefile.am:22: but option 'subdir-objects' is disabled Makefile.am:22: warning: source file 'src/mapm/mapm_fam.c' is in a subdirectory, Makefile.am:22: but option 'subdir-objects' is disabled Makefile.am:22: warning: source file 'src/mapm/mapm_fft.c' is in a subdirectory, Makefile.am:22: but option 'subdir-objects' is disabled Makefile.am:22: warning: source file 'src/mapm/mapm_flr.c' is in a subdirectory, Makefile.am:22: but option 'subdir-objects' is disabled Makefile.am:22: warning: source file 'src/mapm/mapmfmul.c' is in a subdirectory, Makefile.am:22: but option 'subdir-objects' is disabled Makefile.am:22: warning: source file 'src/mapm/mapm_fpf.c' is in a subdirectory, Makefile.am:22: but option 'subdir-objects' is disabled Makefile.am:22: warning: source file 'src/mapm/mapm_gcd.c' is in a subdirectory, Makefile.am:22: but option 'subdir-objects' is disabled Makefile.am:22: warning: source file 'src/mapm/mapmgues.c' is in a subdirectory, Makefile.am:22: but option 'subdir-objects' is disabled Makefile.am:22: warning: source file 'src/mapm/mapmhasn.c' is in a subdirectory, Makefile.am:22: but option 'subdir-objects' is disabled Makefile.am:22: warning: source file 'src/mapm/mapmhsin.c' is in a subdirectory, Makefile.am:22: but option 'subdir-objects' is disabled Makefile.am:22: warning: source file 'src/mapm/mapmipwr.c' is in a subdirectory, Makefile.am:22: but option 'subdir-objects' is disabled Makefile.am:22: warning: source file 'src/mapm/mapmistr.c' is in a subdirectory, Makefile.am:22: but option 'subdir-objects' is disabled Makefile.am:22: warning: source file 'src/mapm/mapm_lg2.c' is in a subdirectory, Makefile.am:22: but option 'subdir-objects' is disabled Makefile.am:22: warning: source file 'src/mapm/mapm_lg3.c' is in a subdirectory, Makefile.am:22: but option 'subdir-objects' is disabled Makefile.am:22: warning: source file 'src/mapm/mapm_log.c' is in a subdirectory, Makefile.am:22: but option 'subdir-objects' is disabled Makefile.am:22: warning: source file 'src/mapm/mapm_mt.cpp' is in a subdirectory, Makefile.am:22: but option 'subdir-objects' is disabled Makefile.am:22: warning: source file 'src/mapm/mapm_mul.c' is in a subdirectory, Makefile.am:22: but option 'subdir-objects' is disabled Makefile.am:22: warning: source file 'src/mapm/mapm_pow.c' is in a subdirectory, Makefile.am:22: but option 'subdir-objects' is disabled Makefile.am:22: warning: source file 'src/mapm/mapmpwr2.c' is in a subdirectory, Makefile.am:22: but option 'subdir-objects' is disabled Makefile.am:22: warning: source file 'src/mapm/mapm_rcp.c' is in a subdirectory, Makefile.am:22: but option 'subdir-objects' is disabled Makefile.am:22: warning: source file 'src/mapm/mapm_rnd.c' is in a subdirectory, Makefile.am:22: but option 'subdir-objects' is disabled Makefile.am:22: warning: source file 'src/mapm/mapmrsin.c' is in a subdirectory, Makefile.am:22: but option 'subdir-objects' is disabled Makefile.am:22: warning: source file 'src/mapm/mapm_set.c' is in a subdirectory, Makefile.am:22: but option 'subdir-objects' is disabled Makefile.am:22: warning: source file 'src/mapm/mapm_sin.c' is in a subdirectory, Makefile.am:22: but option 'subdir-objects' is disabled Makefile.am:22: warning: source file 'src/mapm/mapmsqrt.c' is in a subdirectory, Makefile.am:22: but option 'subdir-objects' is disabled Makefile.am:22: warning: source file 'src/mapm/mapmstck.c' is in a subdirectory, Makefile.am:22: but option 'subdir-objects' is disabled Makefile.am:22: warning: source file 'src/mapm/mapmutil.c' is in a subdirectory, Makefile.am:22: but option 'subdir-objects' is disabled Makefile.am:22: warning: source file 'src/mapm/mapmutl2.c' is in a subdirectory, Makefile.am:22: but option 'subdir-objects' is disabled Makefile.am:22: warning: source file 'src/axis/NodeTest.cpp' is in a subdirectory, Makefile.am:22: but option 'subdir-objects' is disabled Makefile.am:22: warning: source file 'src/operators/And.cpp' is in a subdirectory, Makefile.am:22: but option 'subdir-objects' is disabled Makefile.am:22: warning: source file 'src/operators/ArithmeticOperator.cpp' is in a subdirectory, Makefile.am:22: but option 'subdir-objects' is disabled Makefile.am:22: warning: source file 'src/operators/ComparisonOperator.cpp' is in a subdirectory, Makefile.am:22: but option 'subdir-objects' is disabled Makefile.am:22: warning: source file 'src/operators/Divide.cpp' is in a subdirectory, Makefile.am:22: but option 'subdir-objects' is disabled Makefile.am:22: warning: source file 'src/operators/Equals.cpp' is in a subdirectory, Makefile.am:22: but option 'subdir-objects' is disabled Makefile.am:22: warning: source file 'src/operators/Except.cpp' is in a subdirectory, Makefile.am:22: but option 'subdir-objects' is disabled Makefile.am:22: warning: source file 'src/operators/GeneralComp.cpp' is in a subdirectory, Makefile.am:22: but option 'subdir-objects' is disabled Makefile.am:22: warning: source file 'src/operators/GreaterThan.cpp' is in a subdirectory, Makefile.am:22: but option 'subdir-objects' is disabled Makefile.am:22: warning: source file 'src/operators/GreaterThanEqual.cpp' is in a subdirectory, Makefile.am:22: but option 'subdir-objects' is disabled Makefile.am:22: warning: source file 'src/operators/IntegerDivide.cpp' is in a subdirectory, Makefile.am:22: but option 'subdir-objects' is disabled Makefile.am:22: warning: source file 'src/operators/Intersect.cpp' is in a subdirectory, Makefile.am:22: but option 'subdir-objects' is disabled Makefile.am:22: warning: source file 'src/operators/LessThan.cpp' is in a subdirectory, Makefile.am:22: but option 'subdir-objects' is disabled Makefile.am:22: warning: source file 'src/operators/LessThanEqual.cpp' is in a subdirectory, Makefile.am:22: but option 'subdir-objects' is disabled Makefile.am:22: warning: source file 'src/operators/Minus.cpp' is in a subdirectory, Makefile.am:22: but option 'subdir-objects' is disabled Makefile.am:22: warning: source file 'src/operators/Mod.cpp' is in a subdirectory, Makefile.am:22: but option 'subdir-objects' is disabled Makefile.am:22: warning: source file 'src/operators/Multiply.cpp' is in a subdirectory, Makefile.am:22: but option 'subdir-objects' is disabled Makefile.am:22: warning: source file 'src/operators/NodeComparison.cpp' is in a subdirectory, Makefile.am:22: but option 'subdir-objects' is disabled Makefile.am:22: warning: source file 'src/operators/NotEquals.cpp' is in a subdirectory, Makefile.am:22: but option 'subdir-objects' is disabled Makefile.am:22: warning: source file 'src/operators/Or.cpp' is in a subdirectory, Makefile.am:22: but option 'subdir-objects' is disabled Makefile.am:22: warning: source file 'src/operators/OrderComparison.cpp' is in a subdirectory, Makefile.am:22: but option 'subdir-objects' is disabled Makefile.am:22: warning: source file 'src/operators/Plus.cpp' is in a subdirectory, Makefile.am:22: but option 'subdir-objects' is disabled Makefile.am:22: warning: source file 'src/operators/UnaryMinus.cpp' is in a subdirectory, Makefile.am:22: but option 'subdir-objects' is disabled Makefile.am:22: warning: source file 'src/operators/Union.cpp' is in a subdirectory, Makefile.am:22: but option 'subdir-objects' is disabled Makefile.am:22: warning: source file 'src/schema/DocumentCacheImpl.cpp' is in a subdirectory, Makefile.am:22: but option 'subdir-objects' is disabled Makefile.am:22: warning: source file 'src/schema/SequenceType.cpp' is in a subdirectory, Makefile.am:22: but option 'subdir-objects' is disabled Makefile.am:22: warning: source file 'src/schema/AnyAtomicTypeDatatypeValidator.cpp' is in a subdirectory, Makefile.am:22: but option 'subdir-objects' is disabled Makefile.am:22: warning: source file 'src/schema/SchemaValidatorFilter.cpp' is in a subdirectory, Makefile.am:22: but option 'subdir-objects' is disabled Makefile.am:22: warning: source file 'src/schema/FaxppDocumentCacheImpl.cpp' is in a subdirectory, Makefile.am:22: but option 'subdir-objects' is disabled Makefile.am:22: warning: source file 'src/runtime/ClosureResult.cpp' is in a subdirectory, Makefile.am:22: but option 'subdir-objects' is disabled Makefile.am:22: warning: source file 'src/runtime/EmptyResult.cpp' is in a subdirectory, Makefile.am:22: but option 'subdir-objects' is disabled Makefile.am:22: warning: source file 'src/runtime/ResultBuffer.cpp' is in a subdirectory, Makefile.am:22: but option 'subdir-objects' is disabled Makefile.am:22: warning: source file 'src/runtime/ResultBufferImpl.cpp' is in a subdirectory, Makefile.am:22: but option 'subdir-objects' is disabled Makefile.am:22: warning: source file 'src/runtime/Result.cpp' is in a subdirectory, Makefile.am:22: but option 'subdir-objects' is disabled Makefile.am:22: warning: source file 'src/runtime/ResultImpl.cpp' is in a subdirectory, Makefile.am:22: but option 'subdir-objects' is disabled Makefile.am:22: warning: source file 'src/runtime/SequenceResult.cpp' is in a subdirectory, Makefile.am:22: but option 'subdir-objects' is disabled Makefile.am:22: warning: source file 'src/runtime/Sequence.cpp' is in a subdirectory, Makefile.am:22: but option 'subdir-objects' is disabled Makefile.am:22: warning: source file 'src/update/FunctionPut.cpp' is in a subdirectory, Makefile.am:22: but option 'subdir-objects' is disabled Makefile.am:22: warning: source file 'src/update/PendingUpdateList.cpp' is in a subdirectory, Makefile.am:22: but option 'subdir-objects' is disabled Makefile.am:22: warning: source file 'src/update/UApplyUpdates.cpp' is in a subdirectory, Makefile.am:22: but option 'subdir-objects' is disabled Makefile.am:22: warning: source file 'src/update/UDelete.cpp' is in a subdirectory, Makefile.am:22: but option 'subdir-objects' is disabled Makefile.am:22: warning: source file 'src/update/URename.cpp' is in a subdirectory, Makefile.am:22: but option 'subdir-objects' is disabled Makefile.am:22: warning: source file 'src/update/UReplace.cpp' is in a subdirectory, Makefile.am:22: but option 'subdir-objects' is disabled Makefile.am:22: warning: source file 'src/update/UReplaceValueOf.cpp' is in a subdirectory, Makefile.am:22: but option 'subdir-objects' is disabled Makefile.am:22: warning: source file 'src/update/UInsertAsFirst.cpp' is in a subdirectory, Makefile.am:22: but option 'subdir-objects' is disabled Makefile.am:22: warning: source file 'src/update/UInsertAsLast.cpp' is in a subdirectory, Makefile.am:22: but option 'subdir-objects' is disabled Makefile.am:22: warning: source file 'src/update/UInsertInto.cpp' is in a subdirectory, Makefile.am:22: but option 'subdir-objects' is disabled Makefile.am:22: warning: source file 'src/update/UInsertAfter.cpp' is in a subdirectory, Makefile.am:22: but option 'subdir-objects' is disabled Makefile.am:22: warning: source file 'src/update/UInsertBefore.cpp' is in a subdirectory, Makefile.am:22: but option 'subdir-objects' is disabled Makefile.am:22: warning: source file 'src/update/UTransform.cpp' is in a subdirectory, Makefile.am:22: but option 'subdir-objects' is disabled Makefile.am:22: warning: source file 'src/xqts/TestSuiteParser.cpp' is in a subdirectory, Makefile.am:22: but option 'subdir-objects' is disabled Makefile.am:22: warning: source file 'src/xqts/TestSuiteResultListener.cpp' is in a subdirectory, Makefile.am:22: but option 'subdir-objects' is disabled Makefile.am:22: warning: source file 'src/xqts/TestSuiteRunner.cpp' is in a subdirectory, Makefile.am:22: but option 'subdir-objects' is disabled Makefile.am:22: warning: source file 'src/fastxdm/FastXDMUpdateFactory.cpp' is in a subdirectory, Makefile.am:22: but option 'subdir-objects' is disabled Makefile.am:22: warning: source file 'src/fastxdm/FastXDMDocument.cpp' is in a subdirectory, Makefile.am:22: but option 'subdir-objects' is disabled Makefile.am:22: warning: source file 'src/fastxdm/FastXDMNodeImpl.cpp' is in a subdirectory, Makefile.am:22: but option 'subdir-objects' is disabled Makefile.am:22: warning: source file 'src/fastxdm/FastXDMConfiguration.cpp' is in a subdirectory, Makefile.am:22: but option 'subdir-objects' is disabled Makefile.am:22: warning: source file 'src/fastxdm/FastXDMSequenceBuilder.cpp' is in a subdirectory, Makefile.am:22: but option 'subdir-objects' is disabled Makefile.am:22: warning: source file 'src/xerces/AncestorAxis.cpp' is in a subdirectory, Makefile.am:22: but option 'subdir-objects' is disabled Makefile.am:22: warning: source file 'src/xerces/AncestorOrSelfAxis.cpp' is in a subdirectory, Makefile.am:22: but option 'subdir-objects' is disabled Makefile.am:22: warning: source file 'src/xerces/AttributeAxis.cpp' is in a subdirectory, Makefile.am:22: but option 'subdir-objects' is disabled Makefile.am:22: warning: source file 'src/xerces/Axis.cpp' is in a subdirectory, Makefile.am:22: but option 'subdir-objects' is disabled Makefile.am:22: warning: source file 'src/xerces/ChildAxis.cpp' is in a subdirectory, Makefile.am:22: but option 'subdir-objects' is disabled Makefile.am:22: warning: source file 'src/xerces/DescendantAxis.cpp' is in a subdirectory, Makefile.am:22: but option 'subdir-objects' is disabled Makefile.am:22: warning: source file 'src/xerces/DescendantOrSelfAxis.cpp' is in a subdirectory, Makefile.am:22: but option 'subdir-objects' is disabled Makefile.am:22: warning: source file 'src/xerces/FollowingAxis.cpp' is in a subdirectory, Makefile.am:22: but option 'subdir-objects' is disabled Makefile.am:22: warning: source file 'src/xerces/FollowingSiblingAxis.cpp' is in a subdirectory, Makefile.am:22: but option 'subdir-objects' is disabled Makefile.am:22: warning: source file 'src/xerces/NamespaceAxis.cpp' is in a subdirectory, Makefile.am:22: but option 'subdir-objects' is disabled Makefile.am:22: warning: source file 'src/xerces/ParentAxis.cpp' is in a subdirectory, Makefile.am:22: but option 'subdir-objects' is disabled Makefile.am:22: warning: source file 'src/xerces/PrecedingAxis.cpp' is in a subdirectory, Makefile.am:22: but option 'subdir-objects' is disabled Makefile.am:22: warning: source file 'src/xerces/PrecedingSiblingAxis.cpp' is in a subdirectory, Makefile.am:22: but option 'subdir-objects' is disabled Makefile.am:22: warning: source file 'src/xerces/XercesConfiguration.cpp' is in a subdirectory, Makefile.am:22: but option 'subdir-objects' is disabled Makefile.am:22: warning: source file 'src/xerces/XercesNodeImpl.cpp' is in a subdirectory, Makefile.am:22: but option 'subdir-objects' is disabled Makefile.am:22: warning: source file 'src/xerces/XercesSequenceBuilder.cpp' is in a subdirectory, Makefile.am:22: but option 'subdir-objects' is disabled Makefile.am:22: warning: source file 'src/xerces/XercesUpdateFactory.cpp' is in a subdirectory, Makefile.am:22: but option 'subdir-objects' is disabled Makefile.am:22: warning: source file 'src/xerces/XercesURIResolver.cpp' is in a subdirectory, Makefile.am:22: but option 'subdir-objects' is disabled Makefile.am:22: warning: source file 'src/optimizer/Optimizer.cpp' is in a subdirectory, Makefile.am:22: but option 'subdir-objects' is disabled Makefile.am:22: warning: source file 'src/optimizer/ASTCopier.cpp' is in a subdirectory, Makefile.am:22: but option 'subdir-objects' is disabled Makefile.am:22: warning: source file 'src/optimizer/ASTReleaser.cpp' is in a subdirectory, Makefile.am:22: but option 'subdir-objects' is disabled Makefile.am:22: warning: source file 'src/optimizer/ASTVisitor.cpp' is in a subdirectory, Makefile.am:22: but option 'subdir-objects' is disabled Makefile.am:22: warning: source file 'src/optimizer/PartialEvaluator.cpp' is in a subdirectory, Makefile.am:22: but option 'subdir-objects' is disabled Makefile.am:22: warning: source file 'src/optimizer/StaticTyper.cpp' is in a subdirectory, Makefile.am:22: but option 'subdir-objects' is disabled Makefile.am:22: warning: source file 'src/optimizer/QueryPathNode.cpp' is in a subdirectory, Makefile.am:22: but option 'subdir-objects' is disabled Makefile.am:22: warning: source file 'src/optimizer/QueryPathTreeGenerator.cpp' is in a subdirectory, Makefile.am:22: but option 'subdir-objects' is disabled Makefile.am:22: warning: source file 'src/optimizer/ASTToXML.cpp' is in a subdirectory, Makefile.am:22: but option 'subdir-objects' is disabled Makefile.am:22: warning: source file 'src/yajl/yajl_buf.c' is in a subdirectory, Makefile.am:22: but option 'subdir-objects' is disabled Makefile.am:22: warning: source file 'src/yajl/yajl.c' is in a subdirectory, Makefile.am:22: but option 'subdir-objects' is disabled Makefile.am:22: warning: source file 'src/yajl/yajl_encode.c' is in a subdirectory, Makefile.am:22: but option 'subdir-objects' is disabled Makefile.am:22: warning: source file 'src/yajl/yajl_gen.c' is in a subdirectory, Makefile.am:22: but option 'subdir-objects' is disabled Makefile.am:22: warning: source file 'src/yajl/yajl_lex.c' is in a subdirectory, Makefile.am:22: but option 'subdir-objects' is disabled Makefile.am:22: warning: source file 'src/yajl/yajl_parser.c' is in a subdirectory, Makefile.am:22: but option 'subdir-objects' is disabled Makefile.am:22: warning: source file 'src/xqc/XQillaXQCImplementation.cpp' is in a subdirectory, Makefile.am:22: but option 'subdir-objects' is disabled Makefile.am:22: warning: source file 'src/xqc/XQillaXQCStaticContext.cpp' is in a subdirectory, Makefile.am:22: but option 'subdir-objects' is disabled Makefile.am:22: warning: source file 'src/xqc/XQillaXQCDynamicContext.cpp' is in a subdirectory, Makefile.am:22: but option 'subdir-objects' is disabled Makefile.am:22: warning: source file 'src/xqc/XQillaXQCExpression.cpp' is in a subdirectory, Makefile.am:22: but option 'subdir-objects' is disabled Makefile.am:22: warning: source file 'src/xqc/XQillaXQCSequence.cpp' is in a subdirectory, Makefile.am:22: but option 'subdir-objects' is disabled Makefile.am:610: warning: source file 'src/tools/compile-delayed-module.cpp' is in a subdirectory, Makefile.am:610: but option 'subdir-objects' is disabled Makefile.am:591: warning: source file 'src/samples/dom-api/dom-basic.cpp' is in a subdirectory, Makefile.am:591: but option 'subdir-objects' is disabled Makefile.am:594: warning: source file 'src/samples/dom-api/dom-context-item.cpp' is in a subdirectory, Makefile.am:594: but option 'subdir-objects' is disabled Makefile.am:597: warning: source file 'src/samples/dom-api/dom-resolver.cpp' is in a subdirectory, Makefile.am:597: but option 'subdir-objects' is disabled Makefile.am:585: warning: source file 'src/samples/simple-api/simple-basic.cpp' is in a subdirectory, Makefile.am:585: but option 'subdir-objects' is disabled Makefile.am:588: warning: source file 'src/samples/simple-api/simple-context-item.cpp' is in a subdirectory, Makefile.am:588: but option 'subdir-objects' is disabled Makefile.am:582: warning: source file 'tests/xmark/xmark.cpp' is in a subdirectory, Makefile.am:582: but option 'subdir-objects' is disabled Makefile.am:602: warning: source file 'src/samples/xqc-api/xqc-basic.c' is in a subdirectory, Makefile.am:602: but option 'subdir-objects' is disabled Makefile.am:607: warning: source file 'src/samples/xqc-api/xqc-context-item.c' is in a subdirectory, Makefile.am:607: but option 'subdir-objects' is disabled Makefile.am:576: warning: source file 'src/samples/xqilla/xqilla-commandline.cpp' is in a subdirectory, Makefile.am:576: but option 'subdir-objects' is disabled Makefile.am:579: warning: source file 'tests/xqts/runner.cpp' is in a subdirectory, Makefile.am:579: but option 'subdir-objects' is disabled Makefile.am: installing 'autotools/depcomp' + ./configure 'LDFLAGS=-Wl,--as-needed -Wl,--no-copy-dt-needed-entries -Wl,-z,relro -Wl,-z,combreloc ' 'CFLAGS=-O2 -fwrapv -pipe -Wformat -Werror=format-security -gdwarf-4 -fno-debug-types-section -fvar-tracking-assignments -g2 -Wp,-D_FORTIFY_SOURCE=2 -fstack-protector-strong --param=ssp-buffer-size=4 -Werror=trampolines -fPIC -mtune=generic -march=x86-64 -gdwarf-4 -fno-debug-types-section -fvar-tracking-assignments -g2 ' 'CXXFLAGS=-O2 -fwrapv -pipe -Wformat -Werror=format-security -gdwarf-4 -fno-debug-types-section -fvar-tracking-assignments -g2 -Wp,-D_FORTIFY_SOURCE=2 -fstack-protector-strong --param=ssp-buffer-size=4 -Werror=trampolines -fPIC -mtune=generic -march=x86-64 -gdwarf-4 -fno-debug-types-section -fvar-tracking-assignments -g2 ' 'FFLAGS=-O2 -fwrapv -pipe -Wformat -Werror=format-security -gdwarf-4 -fno-debug-types-section -fvar-tracking-assignments -g2 -Wp,-D_FORTIFY_SOURCE=2 -fstack-protector-strong --param=ssp-buffer-size=4 -Werror=trampolines -fPIC -mtune=generic -march=x86-64 -gdwarf-4 -fno-debug-types-section -fvar-tracking-assignments -g2 ' 'FCFLAGS=-O2 -fwrapv -pipe -Wformat -Werror=format-security -gdwarf-4 -fno-debug-types-section -fvar-tracking-assignments -g2 -Wp,-D_FORTIFY_SOURCE=2 -fstack-protector-strong --param=ssp-buffer-size=4 -Werror=trampolines -fPIC -mtune=generic -march=x86-64 -gdwarf-4 -fno-debug-types-section -fvar-tracking-assignments -g2 ' 'CPPFLAGS=' 'CC=x86_64-pld-linux-gnux32-gcc' 'CXX=x86_64-pld-linux-gnux32-g++' '--host=x86_64-pld-linux-gnux32' '--build=x86_64-pld-linux-gnux32' '--prefix=/usr' '--exec-prefix=/usr' '--bindir=/usr/bin' '--sbindir=/usr/sbin' '--sysconfdir=/etc' '--datadir=/usr/share' '--includedir=/usr/include' '--libdir=/usr/libx32' '--libexecdir=/usr/libexec' '--localstatedir=/var' '--sharedstatedir=/var/lib' '--mandir=/usr/share/man' '--infodir=/usr/share/info' '--x-libraries=/usr/libx32' '--with-faxpp=/usr' '--with-xerces=/usr' checking build system type... x86_64-pld-linux-gnux32 checking host system type... x86_64-pld-linux-gnux32 checking target system type... x86_64-pld-linux-gnux32 checking for a BSD-compatible install... /usr/bin/install -c checking whether build environment is sane... yes checking for a race-free mkdir -p... /bin/mkdir -p checking for mawk... mawk checking whether make sets $(MAKE)... yes checking whether make supports nested variables... yes checking whether to enable maintainer-specific portions of Makefiles... no checking if --enable-debug option specified... no checking if --enable-rpath option specified... yes checking if --with-xerces=DIR option specified... /usr checking for Xerces-C version... grep: warning: stray \ before # grep: warning: stray \ before # 3.2 configure: WARNING: Unable to find the Xerces-C library. Guessed path is /usr/lib. checking whether make supports the include directive... yes (GNU style) checking whether the C++ compiler works... yes checking for C++ compiler default output file name... a.out checking for suffix of executables... checking whether we are cross compiling... no checking for suffix of object files... o checking whether the compiler supports GNU C++... yes checking whether x86_64-pld-linux-gnux32-g++ accepts -g... yes checking for x86_64-pld-linux-gnux32-g++ option to enable C++11 features... none needed checking dependency style of x86_64-pld-linux-gnux32-g++... gcc3 checking if the Xerces-C library supports the BinInputStream::getContentType() method... yes checking if the Xerces-C library supports the RegularExpression::allMatches() method... yes checking if --with-faxpp=DIR option specified... /usr checking if the FAXPP library is present... no checking if --with-tidy=DIR option specified... /usr checking if the HTML Tidy library is present... no checking whether the compiler supports GNU C++... (cached) yes checking whether x86_64-pld-linux-gnux32-g++ accepts -g... (cached) yes checking for x86_64-pld-linux-gnux32-g++ option to enable C++11 features... (cached) none needed checking dependency style of x86_64-pld-linux-gnux32-g++... (cached) gcc3 checking for x86_64-pld-linux-gnux32-gcc... x86_64-pld-linux-gnux32-gcc checking whether the compiler supports GNU C... yes checking whether x86_64-pld-linux-gnux32-gcc accepts -g... yes checking for x86_64-pld-linux-gnux32-gcc option to enable C11 features... none needed checking whether x86_64-pld-linux-gnux32-gcc understands -c and -o together... yes checking dependency style of x86_64-pld-linux-gnux32-gcc... gcc3 checking how to print strings... print -r checking for a sed that does not truncate output... /bin/sed checking for grep that handles long lines and -e... /bin/grep checking for egrep... /bin/grep -E checking for fgrep... /bin/grep -F checking for ld used by x86_64-pld-linux-gnux32-gcc... /usr/bin/ld checking if the linker (/usr/bin/ld) is GNU ld... yes checking for BSD- or MS-compatible name lister (nm)... /usr/bin/nm -B checking the name lister (/usr/bin/nm -B) interface... BSD nm checking whether ln -s works... yes checking the maximum length of command line arguments... 1572864 checking how to convert x86_64-pld-linux-gnux32 file names to x86_64-pld-linux-gnux32 format... func_convert_file_noop checking how to convert x86_64-pld-linux-gnux32 file names to toolchain format... func_convert_file_noop checking for /usr/bin/ld option to reload object files... -r checking for x86_64-pld-linux-gnux32-file... no checking for file... file checking for x86_64-pld-linux-gnux32-objdump... no checking for objdump... objdump checking how to recognize dependent libraries... pass_all checking for x86_64-pld-linux-gnux32-dlltool... no checking for dlltool... no checking how to associate runtime and link libraries... print -r -- checking for x86_64-pld-linux-gnux32-ar... no checking for ar... ar checking for archiver @FILE support... @ checking for x86_64-pld-linux-gnux32-strip... no checking for strip... strip checking for x86_64-pld-linux-gnux32-ranlib... no checking for ranlib... ranlib checking command to parse /usr/bin/nm -B output from x86_64-pld-linux-gnux32-gcc object... ok checking for sysroot... no checking for a working dd... /bin/dd checking how to truncate binary pipes... /bin/dd bs=4096 count=1 checking for x86_64-pld-linux-gnux32-mt... no checking for mt... no checking if : is a manifest tool... no checking for stdio.h... yes checking for stdlib.h... yes checking for string.h... yes checking for inttypes.h... yes checking for stdint.h... yes checking for strings.h... yes checking for sys/stat.h... yes checking for sys/types.h... yes checking for unistd.h... yes checking for sys/time.h... yes checking for dlfcn.h... yes checking for objdir... .libs checking if x86_64-pld-linux-gnux32-gcc supports -fno-rtti -fno-exceptions... no checking for x86_64-pld-linux-gnux32-gcc option to produce PIC... -fPIC -DPIC checking if x86_64-pld-linux-gnux32-gcc PIC flag -fPIC -DPIC works... yes checking if x86_64-pld-linux-gnux32-gcc static flag -static works... yes checking if x86_64-pld-linux-gnux32-gcc supports -c -o file.o... yes checking if x86_64-pld-linux-gnux32-gcc supports -c -o file.o... (cached) yes checking whether the x86_64-pld-linux-gnux32-gcc linker (/usr/bin/ld -m elf32_x86_64) supports shared libraries... yes checking whether -lc should be explicitly linked in... no checking dynamic linker characteristics... GNU/Linux ld.so checking how to hardcode library paths into programs... immediate checking whether stripping libraries is possible... yes checking if libtool supports shared libraries... yes checking whether to build shared libraries... yes checking whether to build static libraries... yes checking how to run the C++ preprocessor... x86_64-pld-linux-gnux32-g++ -E checking for ld used by x86_64-pld-linux-gnux32-g++... /usr/bin/ld -m elf32_x86_64 checking if the linker (/usr/bin/ld -m elf32_x86_64) is GNU ld... yes checking whether the x86_64-pld-linux-gnux32-g++ linker (/usr/bin/ld -m elf32_x86_64) supports shared libraries... yes checking for x86_64-pld-linux-gnux32-g++ option to produce PIC... -fPIC -DPIC checking if x86_64-pld-linux-gnux32-g++ PIC flag -fPIC -DPIC works... yes checking if x86_64-pld-linux-gnux32-g++ static flag -static works... yes checking if x86_64-pld-linux-gnux32-g++ supports -c -o file.o... yes checking if x86_64-pld-linux-gnux32-g++ supports -c -o file.o... (cached) yes checking whether the x86_64-pld-linux-gnux32-g++ linker (/usr/bin/ld -m elf32_x86_64) supports shared libraries... yes checking dynamic linker characteristics... (cached) GNU/Linux ld.so checking how to hardcode library paths into programs... immediate checking how to run the C preprocessor... x86_64-pld-linux-gnux32-gcc -E checking whether ln -s works... yes checking whether make sets $(MAKE)... (cached) yes checking for bison... bison -y checking for flex... flex checking for lex output file root... lex.yy checking for lex library... none needed checking for library containing yywrap... -lfl checking whether yytext is a pointer... yes checking unicode support in flex... not found configure: WARNING: XQilla requires a version of flex supporting the -U (16-bit unicode) flag if you need to rebuild the lexer. checking for pthread_create in -lpthread... yes checking for library containing connect... none required checking for library containing gethostbyname... none required checking for size_t... yes checking for working alloca.h... yes checking for alloca... yes checking for egrep... (cached) /bin/grep -E checking for limits.h... yes checking for malloc.h... yes checking for stddef.h... yes checking for stdlib.h... (cached) yes checking for string.h... (cached) yes checking for sys/time.h... (cached) yes checking for sys/timeb.h... yes checking for wchar.h... yes checking for _Bool... yes checking for stdbool.h that conforms to C99... yes checking for an ANSI C-conforming const... yes checking for inline... inline checking for size_t... (cached) yes checking whether struct tm is in sys/time.h or time.h... time.h checking for ptrdiff_t... yes checking for error_at_line... yes checking for alarm... yes checking for working mktime... yes checking for floor... no checking for ftime... yes checking for gettimeofday... yes checking for memmove... yes checking for memset... yes checking for pow... no checking for sqrt... no checking for strchr... yes checking for strstr... yes checking for tzset... yes checking for localtime_r... yes checking that generated files are newer than configure... done configure: creating ./config.status config.status: creating Makefile config.status: creating include/Makefile config.status: creating src/config/xqilla_config_unix.h config.status: executing depfiles commands config.status: executing libtool commands + /usr/bin/make -Otarget -j9 Making all in include make[1]: Nothing to be done for 'all'. make[1]: Entering directory '/tmp/B.ache4phw/BUILD/XQilla-2.3.4' /bin/sh ./libtool --tag=CXX --mode=compile x86_64-pld-linux-gnux32-g++ -DHAVE_CONFIG_H -I. -I./src/config -I./include/ -I/usr/include -I./src/lexer/ -D_GNU_SOURCE -D_REENTRANT -O2 -fwrapv -pipe -Wformat -Werror=format-security -gdwarf-4 -fno-debug-types-section -fvar-tracking-assignments -g2 -Wp,-D_FORTIFY_SOURCE=2 -fstack-protector-strong --param=ssp-buffer-size=4 -Werror=trampolines -fPIC -mtune=generic -march=x86-64 -gdwarf-4 -fno-debug-types-section -fvar-tracking-assignments -g2 -ftemplate-depth-50 -MT ReferenceCounted.lo -MD -MP -MF .deps/ReferenceCounted.Tpo -c -o ReferenceCounted.lo `test -f 'src/framework/ReferenceCounted.cpp' || echo './'`src/framework/ReferenceCounted.cpp libtool: compile: x86_64-pld-linux-gnux32-g++ -DHAVE_CONFIG_H -I. -I./src/config -I./include/ -I/usr/include -I./src/lexer/ -D_GNU_SOURCE -D_REENTRANT -O2 -fwrapv -pipe -Wformat -Werror=format-security -gdwarf-4 -fno-debug-types-section -fvar-tracking-assignments -g2 -Wp,-D_FORTIFY_SOURCE=2 -fstack-protector-strong --param=ssp-buffer-size=4 -Werror=trampolines -fPIC -mtune=generic -march=x86-64 -gdwarf-4 -fno-debug-types-section -fvar-tracking-assignments -g2 -ftemplate-depth-50 -MT ReferenceCounted.lo -MD -MP -MF .deps/ReferenceCounted.Tpo -c src/framework/ReferenceCounted.cpp -fPIC -DPIC -o .libs/ReferenceCounted.o libtool: compile: x86_64-pld-linux-gnux32-g++ -DHAVE_CONFIG_H -I. -I./src/config -I./include/ -I/usr/include -I./src/lexer/ -D_GNU_SOURCE -D_REENTRANT -O2 -fwrapv -pipe -Wformat -Werror=format-security -gdwarf-4 -fno-debug-types-section -fvar-tracking-assignments -g2 -Wp,-D_FORTIFY_SOURCE=2 -fstack-protector-strong --param=ssp-buffer-size=4 -Werror=trampolines -fPIC -mtune=generic -march=x86-64 -gdwarf-4 -fno-debug-types-section -fvar-tracking-assignments -g2 -ftemplate-depth-50 -MT ReferenceCounted.lo -MD -MP -MF .deps/ReferenceCounted.Tpo -c src/framework/ReferenceCounted.cpp -o ReferenceCounted.o >/dev/null 2>&1 mv -f .deps/ReferenceCounted.Tpo .deps/ReferenceCounted.Plo make[1]: Leaving directory '/tmp/B.ache4phw/BUILD/XQilla-2.3.4' make[1]: Entering directory '/tmp/B.ache4phw/BUILD/XQilla-2.3.4' /bin/sh ./libtool --tag=CXX --mode=compile x86_64-pld-linux-gnux32-g++ -DHAVE_CONFIG_H -I. -I./src/config -I./include/ -I/usr/include -I./src/lexer/ -D_GNU_SOURCE -D_REENTRANT -O2 -fwrapv -pipe -Wformat -Werror=format-security -gdwarf-4 -fno-debug-types-section -fvar-tracking-assignments -g2 -Wp,-D_FORTIFY_SOURCE=2 -fstack-protector-strong --param=ssp-buffer-size=4 -Werror=trampolines -fPIC -mtune=generic -march=x86-64 -gdwarf-4 -fno-debug-types-section -fvar-tracking-assignments -g2 -ftemplate-depth-50 -MT ProxyMemoryManager.lo -MD -MP -MF .deps/ProxyMemoryManager.Tpo -c -o ProxyMemoryManager.lo `test -f 'src/framework/ProxyMemoryManager.cpp' || echo './'`src/framework/ProxyMemoryManager.cpp libtool: compile: x86_64-pld-linux-gnux32-g++ -DHAVE_CONFIG_H -I. -I./src/config -I./include/ -I/usr/include -I./src/lexer/ -D_GNU_SOURCE -D_REENTRANT -O2 -fwrapv -pipe -Wformat -Werror=format-security -gdwarf-4 -fno-debug-types-section -fvar-tracking-assignments -g2 -Wp,-D_FORTIFY_SOURCE=2 -fstack-protector-strong --param=ssp-buffer-size=4 -Werror=trampolines -fPIC -mtune=generic -march=x86-64 -gdwarf-4 -fno-debug-types-section -fvar-tracking-assignments -g2 -ftemplate-depth-50 -MT ProxyMemoryManager.lo -MD -MP -MF .deps/ProxyMemoryManager.Tpo -c src/framework/ProxyMemoryManager.cpp -fPIC -DPIC -o .libs/ProxyMemoryManager.o libtool: compile: x86_64-pld-linux-gnux32-g++ -DHAVE_CONFIG_H -I. -I./src/config -I./include/ -I/usr/include -I./src/lexer/ -D_GNU_SOURCE -D_REENTRANT -O2 -fwrapv -pipe -Wformat -Werror=format-security -gdwarf-4 -fno-debug-types-section -fvar-tracking-assignments -g2 -Wp,-D_FORTIFY_SOURCE=2 -fstack-protector-strong --param=ssp-buffer-size=4 -Werror=trampolines -fPIC -mtune=generic -march=x86-64 -gdwarf-4 -fno-debug-types-section -fvar-tracking-assignments -g2 -ftemplate-depth-50 -MT ProxyMemoryManager.lo -MD -MP -MF .deps/ProxyMemoryManager.Tpo -c src/framework/ProxyMemoryManager.cpp -o ProxyMemoryManager.o >/dev/null 2>&1 mv -f .deps/ProxyMemoryManager.Tpo .deps/ProxyMemoryManager.Plo make[1]: Leaving directory '/tmp/B.ache4phw/BUILD/XQilla-2.3.4' make[1]: Entering directory '/tmp/B.ache4phw/BUILD/XQilla-2.3.4' /bin/sh ./libtool --tag=CXX --mode=compile x86_64-pld-linux-gnux32-g++ -DHAVE_CONFIG_H -I. -I./src/config -I./include/ -I/usr/include -I./src/lexer/ -D_GNU_SOURCE -D_REENTRANT -O2 -fwrapv -pipe -Wformat -Werror=format-security -gdwarf-4 -fno-debug-types-section -fvar-tracking-assignments -g2 -Wp,-D_FORTIFY_SOURCE=2 -fstack-protector-strong --param=ssp-buffer-size=4 -Werror=trampolines -fPIC -mtune=generic -march=x86-64 -gdwarf-4 -fno-debug-types-section -fvar-tracking-assignments -g2 -ftemplate-depth-50 -MT XPath2MemoryManagerImpl.lo -MD -MP -MF .deps/XPath2MemoryManagerImpl.Tpo -c -o XPath2MemoryManagerImpl.lo `test -f 'src/framework/XPath2MemoryManagerImpl.cpp' || echo './'`src/framework/XPath2MemoryManagerImpl.cpp libtool: compile: x86_64-pld-linux-gnux32-g++ -DHAVE_CONFIG_H -I. -I./src/config -I./include/ -I/usr/include -I./src/lexer/ -D_GNU_SOURCE -D_REENTRANT -O2 -fwrapv -pipe -Wformat -Werror=format-security -gdwarf-4 -fno-debug-types-section -fvar-tracking-assignments -g2 -Wp,-D_FORTIFY_SOURCE=2 -fstack-protector-strong --param=ssp-buffer-size=4 -Werror=trampolines -fPIC -mtune=generic -march=x86-64 -gdwarf-4 -fno-debug-types-section -fvar-tracking-assignments -g2 -ftemplate-depth-50 -MT XPath2MemoryManagerImpl.lo -MD -MP -MF .deps/XPath2MemoryManagerImpl.Tpo -c src/framework/XPath2MemoryManagerImpl.cpp -fPIC -DPIC -o .libs/XPath2MemoryManagerImpl.o libtool: compile: x86_64-pld-linux-gnux32-g++ -DHAVE_CONFIG_H -I. -I./src/config -I./include/ -I/usr/include -I./src/lexer/ -D_GNU_SOURCE -D_REENTRANT -O2 -fwrapv -pipe -Wformat -Werror=format-security -gdwarf-4 -fno-debug-types-section -fvar-tracking-assignments -g2 -Wp,-D_FORTIFY_SOURCE=2 -fstack-protector-strong --param=ssp-buffer-size=4 -Werror=trampolines -fPIC -mtune=generic -march=x86-64 -gdwarf-4 -fno-debug-types-section -fvar-tracking-assignments -g2 -ftemplate-depth-50 -MT XPath2MemoryManagerImpl.lo -MD -MP -MF .deps/XPath2MemoryManagerImpl.Tpo -c src/framework/XPath2MemoryManagerImpl.cpp -o XPath2MemoryManagerImpl.o >/dev/null 2>&1 mv -f .deps/XPath2MemoryManagerImpl.Tpo .deps/XPath2MemoryManagerImpl.Plo make[1]: Leaving directory '/tmp/B.ache4phw/BUILD/XQilla-2.3.4' make[1]: Entering directory '/tmp/B.ache4phw/BUILD/XQilla-2.3.4' /bin/sh ./libtool --tag=CXX --mode=compile x86_64-pld-linux-gnux32-g++ -DHAVE_CONFIG_H -I. -I./src/config -I./include/ -I/usr/include -I./src/lexer/ -D_GNU_SOURCE -D_REENTRANT -O2 -fwrapv -pipe -Wformat -Werror=format-security -gdwarf-4 -fno-debug-types-section -fvar-tracking-assignments -g2 -Wp,-D_FORTIFY_SOURCE=2 -fstack-protector-strong --param=ssp-buffer-size=4 -Werror=trampolines -fPIC -mtune=generic -march=x86-64 -gdwarf-4 -fno-debug-types-section -fvar-tracking-assignments -g2 -ftemplate-depth-50 -MT CodepointCollation.lo -MD -MP -MF .deps/CodepointCollation.Tpo -c -o CodepointCollation.lo `test -f 'src/context/impl/CodepointCollation.cpp' || echo './'`src/context/impl/CodepointCollation.cpp libtool: compile: x86_64-pld-linux-gnux32-g++ -DHAVE_CONFIG_H -I. -I./src/config -I./include/ -I/usr/include -I./src/lexer/ -D_GNU_SOURCE -D_REENTRANT -O2 -fwrapv -pipe -Wformat -Werror=format-security -gdwarf-4 -fno-debug-types-section -fvar-tracking-assignments -g2 -Wp,-D_FORTIFY_SOURCE=2 -fstack-protector-strong --param=ssp-buffer-size=4 -Werror=trampolines -fPIC -mtune=generic -march=x86-64 -gdwarf-4 -fno-debug-types-section -fvar-tracking-assignments -g2 -ftemplate-depth-50 -MT CodepointCollation.lo -MD -MP -MF .deps/CodepointCollation.Tpo -c src/context/impl/CodepointCollation.cpp -fPIC -DPIC -o .libs/CodepointCollation.o libtool: compile: x86_64-pld-linux-gnux32-g++ -DHAVE_CONFIG_H -I. -I./src/config -I./include/ -I/usr/include -I./src/lexer/ -D_GNU_SOURCE -D_REENTRANT -O2 -fwrapv -pipe -Wformat -Werror=format-security -gdwarf-4 -fno-debug-types-section -fvar-tracking-assignments -g2 -Wp,-D_FORTIFY_SOURCE=2 -fstack-protector-strong --param=ssp-buffer-size=4 -Werror=trampolines -fPIC -mtune=generic -march=x86-64 -gdwarf-4 -fno-debug-types-section -fvar-tracking-assignments -g2 -ftemplate-depth-50 -MT CodepointCollation.lo -MD -MP -MF .deps/CodepointCollation.Tpo -c src/context/impl/CodepointCollation.cpp -o CodepointCollation.o >/dev/null 2>&1 mv -f .deps/CodepointCollation.Tpo .deps/CodepointCollation.Plo make[1]: Leaving directory '/tmp/B.ache4phw/BUILD/XQilla-2.3.4' make[1]: Entering directory '/tmp/B.ache4phw/BUILD/XQilla-2.3.4' /bin/sh ./libtool --tag=CXX --mode=compile x86_64-pld-linux-gnux32-g++ -DHAVE_CONFIG_H -I. -I./src/config -I./include/ -I/usr/include -I./src/lexer/ -D_GNU_SOURCE -D_REENTRANT -O2 -fwrapv -pipe -Wformat -Werror=format-security -gdwarf-4 -fno-debug-types-section -fvar-tracking-assignments -g2 -Wp,-D_FORTIFY_SOURCE=2 -fstack-protector-strong --param=ssp-buffer-size=4 -Werror=trampolines -fPIC -mtune=generic -march=x86-64 -gdwarf-4 -fno-debug-types-section -fvar-tracking-assignments -g2 -ftemplate-depth-50 -MT VarHashEntryImpl.lo -MD -MP -MF .deps/VarHashEntryImpl.Tpo -c -o VarHashEntryImpl.lo `test -f 'src/context/impl/VarHashEntryImpl.cpp' || echo './'`src/context/impl/VarHashEntryImpl.cpp libtool: compile: x86_64-pld-linux-gnux32-g++ -DHAVE_CONFIG_H -I. -I./src/config -I./include/ -I/usr/include -I./src/lexer/ -D_GNU_SOURCE -D_REENTRANT -O2 -fwrapv -pipe -Wformat -Werror=format-security -gdwarf-4 -fno-debug-types-section -fvar-tracking-assignments -g2 -Wp,-D_FORTIFY_SOURCE=2 -fstack-protector-strong --param=ssp-buffer-size=4 -Werror=trampolines -fPIC -mtune=generic -march=x86-64 -gdwarf-4 -fno-debug-types-section -fvar-tracking-assignments -g2 -ftemplate-depth-50 -MT VarHashEntryImpl.lo -MD -MP -MF .deps/VarHashEntryImpl.Tpo -c src/context/impl/VarHashEntryImpl.cpp -fPIC -DPIC -o .libs/VarHashEntryImpl.o libtool: compile: x86_64-pld-linux-gnux32-g++ -DHAVE_CONFIG_H -I. -I./src/config -I./include/ -I/usr/include -I./src/lexer/ -D_GNU_SOURCE -D_REENTRANT -O2 -fwrapv -pipe -Wformat -Werror=format-security -gdwarf-4 -fno-debug-types-section -fvar-tracking-assignments -g2 -Wp,-D_FORTIFY_SOURCE=2 -fstack-protector-strong --param=ssp-buffer-size=4 -Werror=trampolines -fPIC -mtune=generic -march=x86-64 -gdwarf-4 -fno-debug-types-section -fvar-tracking-assignments -g2 -ftemplate-depth-50 -MT VarHashEntryImpl.lo -MD -MP -MF .deps/VarHashEntryImpl.Tpo -c src/context/impl/VarHashEntryImpl.cpp -o VarHashEntryImpl.o >/dev/null 2>&1 mv -f .deps/VarHashEntryImpl.Tpo .deps/VarHashEntryImpl.Plo make[1]: Leaving directory '/tmp/B.ache4phw/BUILD/XQilla-2.3.4' make[1]: Entering directory '/tmp/B.ache4phw/BUILD/XQilla-2.3.4' /bin/sh ./libtool --tag=CXX --mode=compile x86_64-pld-linux-gnux32-g++ -DHAVE_CONFIG_H -I. -I./src/config -I./include/ -I/usr/include -I./src/lexer/ -D_GNU_SOURCE -D_REENTRANT -O2 -fwrapv -pipe -Wformat -Werror=format-security -gdwarf-4 -fno-debug-types-section -fvar-tracking-assignments -g2 -Wp,-D_FORTIFY_SOURCE=2 -fstack-protector-strong --param=ssp-buffer-size=4 -Werror=trampolines -fPIC -mtune=generic -march=x86-64 -gdwarf-4 -fno-debug-types-section -fvar-tracking-assignments -g2 -ftemplate-depth-50 -MT CollationImpl.lo -MD -MP -MF .deps/CollationImpl.Tpo -c -o CollationImpl.lo `test -f 'src/context/impl/CollationImpl.cpp' || echo './'`src/context/impl/CollationImpl.cpp libtool: compile: x86_64-pld-linux-gnux32-g++ -DHAVE_CONFIG_H -I. -I./src/config -I./include/ -I/usr/include -I./src/lexer/ -D_GNU_SOURCE -D_REENTRANT -O2 -fwrapv -pipe -Wformat -Werror=format-security -gdwarf-4 -fno-debug-types-section -fvar-tracking-assignments -g2 -Wp,-D_FORTIFY_SOURCE=2 -fstack-protector-strong --param=ssp-buffer-size=4 -Werror=trampolines -fPIC -mtune=generic -march=x86-64 -gdwarf-4 -fno-debug-types-section -fvar-tracking-assignments -g2 -ftemplate-depth-50 -MT CollationImpl.lo -MD -MP -MF .deps/CollationImpl.Tpo -c src/context/impl/CollationImpl.cpp -fPIC -DPIC -o .libs/CollationImpl.o libtool: compile: x86_64-pld-linux-gnux32-g++ -DHAVE_CONFIG_H -I. -I./src/config -I./include/ -I/usr/include -I./src/lexer/ -D_GNU_SOURCE -D_REENTRANT -O2 -fwrapv -pipe -Wformat -Werror=format-security -gdwarf-4 -fno-debug-types-section -fvar-tracking-assignments -g2 -Wp,-D_FORTIFY_SOURCE=2 -fstack-protector-strong --param=ssp-buffer-size=4 -Werror=trampolines -fPIC -mtune=generic -march=x86-64 -gdwarf-4 -fno-debug-types-section -fvar-tracking-assignments -g2 -ftemplate-depth-50 -MT CollationImpl.lo -MD -MP -MF .deps/CollationImpl.Tpo -c src/context/impl/CollationImpl.cpp -o CollationImpl.o >/dev/null 2>&1 mv -f .deps/CollationImpl.Tpo .deps/CollationImpl.Plo make[1]: Leaving directory '/tmp/B.ache4phw/BUILD/XQilla-2.3.4' make[1]: Entering directory '/tmp/B.ache4phw/BUILD/XQilla-2.3.4' x86_64-pld-linux-gnux32-g++ -DHAVE_CONFIG_H -I. -I./src/config -I./include/ -I/usr/include -I./src/lexer/ -D_GNU_SOURCE -D_REENTRANT -O2 -fwrapv -pipe -Wformat -Werror=format-security -gdwarf-4 -fno-debug-types-section -fvar-tracking-assignments -g2 -Wp,-D_FORTIFY_SOURCE=2 -fstack-protector-strong --param=ssp-buffer-size=4 -Werror=trampolines -fPIC -mtune=generic -march=x86-64 -gdwarf-4 -fno-debug-types-section -fvar-tracking-assignments -g2 -ftemplate-depth-50 -MT xqilla-commandline.o -MD -MP -MF .deps/xqilla-commandline.Tpo -c -o xqilla-commandline.o `test -f 'src/samples/xqilla/xqilla-commandline.cpp' || echo './'`src/samples/xqilla/xqilla-commandline.cpp mv -f .deps/xqilla-commandline.Tpo .deps/xqilla-commandline.Po make[1]: Leaving directory '/tmp/B.ache4phw/BUILD/XQilla-2.3.4' make[1]: Entering directory '/tmp/B.ache4phw/BUILD/XQilla-2.3.4' /bin/sh ./libtool --tag=CXX --mode=compile x86_64-pld-linux-gnux32-g++ -DHAVE_CONFIG_H -I. -I./src/config -I./include/ -I/usr/include -I./src/lexer/ -D_GNU_SOURCE -D_REENTRANT -O2 -fwrapv -pipe -Wformat -Werror=format-security -gdwarf-4 -fno-debug-types-section -fvar-tracking-assignments -g2 -Wp,-D_FORTIFY_SOURCE=2 -fstack-protector-strong --param=ssp-buffer-size=4 -Werror=trampolines -fPIC -mtune=generic -march=x86-64 -gdwarf-4 -fno-debug-types-section -fvar-tracking-assignments -g2 -ftemplate-depth-50 -MT BaseMemoryManager.lo -MD -MP -MF .deps/BaseMemoryManager.Tpo -c -o BaseMemoryManager.lo `test -f 'src/framework/BaseMemoryManager.cpp' || echo './'`src/framework/BaseMemoryManager.cpp libtool: compile: x86_64-pld-linux-gnux32-g++ -DHAVE_CONFIG_H -I. -I./src/config -I./include/ -I/usr/include -I./src/lexer/ -D_GNU_SOURCE -D_REENTRANT -O2 -fwrapv -pipe -Wformat -Werror=format-security -gdwarf-4 -fno-debug-types-section -fvar-tracking-assignments -g2 -Wp,-D_FORTIFY_SOURCE=2 -fstack-protector-strong --param=ssp-buffer-size=4 -Werror=trampolines -fPIC -mtune=generic -march=x86-64 -gdwarf-4 -fno-debug-types-section -fvar-tracking-assignments -g2 -ftemplate-depth-50 -MT BaseMemoryManager.lo -MD -MP -MF .deps/BaseMemoryManager.Tpo -c src/framework/BaseMemoryManager.cpp -fPIC -DPIC -o .libs/BaseMemoryManager.o libtool: compile: x86_64-pld-linux-gnux32-g++ -DHAVE_CONFIG_H -I. -I./src/config -I./include/ -I/usr/include -I./src/lexer/ -D_GNU_SOURCE -D_REENTRANT -O2 -fwrapv -pipe -Wformat -Werror=format-security -gdwarf-4 -fno-debug-types-section -fvar-tracking-assignments -g2 -Wp,-D_FORTIFY_SOURCE=2 -fstack-protector-strong --param=ssp-buffer-size=4 -Werror=trampolines -fPIC -mtune=generic -march=x86-64 -gdwarf-4 -fno-debug-types-section -fvar-tracking-assignments -g2 -ftemplate-depth-50 -MT BaseMemoryManager.lo -MD -MP -MF .deps/BaseMemoryManager.Tpo -c src/framework/BaseMemoryManager.cpp -o BaseMemoryManager.o >/dev/null 2>&1 mv -f .deps/BaseMemoryManager.Tpo .deps/BaseMemoryManager.Plo make[1]: Leaving directory '/tmp/B.ache4phw/BUILD/XQilla-2.3.4' make[1]: Entering directory '/tmp/B.ache4phw/BUILD/XQilla-2.3.4' /bin/sh ./libtool --tag=CXX --mode=compile x86_64-pld-linux-gnux32-g++ -DHAVE_CONFIG_H -I. -I./src/config -I./include/ -I/usr/include -I./src/lexer/ -D_GNU_SOURCE -D_REENTRANT -O2 -fwrapv -pipe -Wformat -Werror=format-security -gdwarf-4 -fno-debug-types-section -fvar-tracking-assignments -g2 -Wp,-D_FORTIFY_SOURCE=2 -fstack-protector-strong --param=ssp-buffer-size=4 -Werror=trampolines -fPIC -mtune=generic -march=x86-64 -gdwarf-4 -fno-debug-types-section -fvar-tracking-assignments -g2 -ftemplate-depth-50 -MT StringPool.lo -MD -MP -MF .deps/StringPool.Tpo -c -o StringPool.lo `test -f 'src/framework/StringPool.cpp' || echo './'`src/framework/StringPool.cpp libtool: compile: x86_64-pld-linux-gnux32-g++ -DHAVE_CONFIG_H -I. -I./src/config -I./include/ -I/usr/include -I./src/lexer/ -D_GNU_SOURCE -D_REENTRANT -O2 -fwrapv -pipe -Wformat -Werror=format-security -gdwarf-4 -fno-debug-types-section -fvar-tracking-assignments -g2 -Wp,-D_FORTIFY_SOURCE=2 -fstack-protector-strong --param=ssp-buffer-size=4 -Werror=trampolines -fPIC -mtune=generic -march=x86-64 -gdwarf-4 -fno-debug-types-section -fvar-tracking-assignments -g2 -ftemplate-depth-50 -MT StringPool.lo -MD -MP -MF .deps/StringPool.Tpo -c src/framework/StringPool.cpp -fPIC -DPIC -o .libs/StringPool.o In file included from src/framework/StringPool.cpp:23: ./include/xqilla/utils/XPath2Utils.hpp: In static member function 'static bool XPath2Utils::equals(const XMLCh*, const XMLCh*)': ./include/xqilla/utils/XPath2Utils.hpp:107:25: warning: ISO C++17 does not allow 'register' storage class specifier [-Wregister] 107 | register const XMLCh* psz1 = str1; | ^~~~ ./include/xqilla/utils/XPath2Utils.hpp:108:25: warning: ISO C++17 does not allow 'register' storage class specifier [-Wregister] 108 | register const XMLCh* psz2 = str2; | ^~~~ ./include/xqilla/utils/XPath2Utils.hpp: In static member function 'static int XPath2Utils::compare(const XMLCh*, const XMLCh*)': ./include/xqilla/utils/XPath2Utils.hpp:128:16: warning: ISO C++17 does not allow 'register' storage class specifier [-Wregister] 128 | register int cmp; | ^~~ libtool: compile: x86_64-pld-linux-gnux32-g++ -DHAVE_CONFIG_H -I. -I./src/config -I./include/ -I/usr/include -I./src/lexer/ -D_GNU_SOURCE -D_REENTRANT -O2 -fwrapv -pipe -Wformat -Werror=format-security -gdwarf-4 -fno-debug-types-section -fvar-tracking-assignments -g2 -Wp,-D_FORTIFY_SOURCE=2 -fstack-protector-strong --param=ssp-buffer-size=4 -Werror=trampolines -fPIC -mtune=generic -march=x86-64 -gdwarf-4 -fno-debug-types-section -fvar-tracking-assignments -g2 -ftemplate-depth-50 -MT StringPool.lo -MD -MP -MF .deps/StringPool.Tpo -c src/framework/StringPool.cpp -o StringPool.o >/dev/null 2>&1 mv -f .deps/StringPool.Tpo .deps/StringPool.Plo make[1]: Leaving directory '/tmp/B.ache4phw/BUILD/XQilla-2.3.4' make[1]: Entering directory '/tmp/B.ache4phw/BUILD/XQilla-2.3.4' /bin/sh ./libtool --tag=CXX --mode=compile x86_64-pld-linux-gnux32-g++ -DHAVE_CONFIG_H -I. -I./src/config -I./include/ -I/usr/include -I./src/lexer/ -D_GNU_SOURCE -D_REENTRANT -O2 -fwrapv -pipe -Wformat -Werror=format-security -gdwarf-4 -fno-debug-types-section -fvar-tracking-assignments -g2 -Wp,-D_FORTIFY_SOURCE=2 -fstack-protector-strong --param=ssp-buffer-size=4 -Werror=trampolines -fPIC -mtune=generic -march=x86-64 -gdwarf-4 -fno-debug-types-section -fvar-tracking-assignments -g2 -ftemplate-depth-50 -MT VarStoreImpl.lo -MD -MP -MF .deps/VarStoreImpl.Tpo -c -o VarStoreImpl.lo `test -f 'src/context/impl/VarStoreImpl.cpp' || echo './'`src/context/impl/VarStoreImpl.cpp libtool: compile: x86_64-pld-linux-gnux32-g++ -DHAVE_CONFIG_H -I. -I./src/config -I./include/ -I/usr/include -I./src/lexer/ -D_GNU_SOURCE -D_REENTRANT -O2 -fwrapv -pipe -Wformat -Werror=format-security -gdwarf-4 -fno-debug-types-section -fvar-tracking-assignments -g2 -Wp,-D_FORTIFY_SOURCE=2 -fstack-protector-strong --param=ssp-buffer-size=4 -Werror=trampolines -fPIC -mtune=generic -march=x86-64 -gdwarf-4 -fno-debug-types-section -fvar-tracking-assignments -g2 -ftemplate-depth-50 -MT VarStoreImpl.lo -MD -MP -MF .deps/VarStoreImpl.Tpo -c src/context/impl/VarStoreImpl.cpp -fPIC -DPIC -o .libs/VarStoreImpl.o In file included from src/context/impl/VarStoreImpl.cpp:23: ./include/xqilla/utils/XPath2Utils.hpp: In static member function 'static bool XPath2Utils::equals(const XMLCh*, const XMLCh*)': ./include/xqilla/utils/XPath2Utils.hpp:107:25: warning: ISO C++17 does not allow 'register' storage class specifier [-Wregister] 107 | register const XMLCh* psz1 = str1; | ^~~~ ./include/xqilla/utils/XPath2Utils.hpp:108:25: warning: ISO C++17 does not allow 'register' storage class specifier [-Wregister] 108 | register const XMLCh* psz2 = str2; | ^~~~ ./include/xqilla/utils/XPath2Utils.hpp: In static member function 'static int XPath2Utils::compare(const XMLCh*, const XMLCh*)': ./include/xqilla/utils/XPath2Utils.hpp:128:16: warning: ISO C++17 does not allow 'register' storage class specifier [-Wregister] 128 | register int cmp; | ^~~ libtool: compile: x86_64-pld-linux-gnux32-g++ -DHAVE_CONFIG_H -I. -I./src/config -I./include/ -I/usr/include -I./src/lexer/ -D_GNU_SOURCE -D_REENTRANT -O2 -fwrapv -pipe -Wformat -Werror=format-security -gdwarf-4 -fno-debug-types-section -fvar-tracking-assignments -g2 -Wp,-D_FORTIFY_SOURCE=2 -fstack-protector-strong --param=ssp-buffer-size=4 -Werror=trampolines -fPIC -mtune=generic -march=x86-64 -gdwarf-4 -fno-debug-types-section -fvar-tracking-assignments -g2 -ftemplate-depth-50 -MT VarStoreImpl.lo -MD -MP -MF .deps/VarStoreImpl.Tpo -c src/context/impl/VarStoreImpl.cpp -o VarStoreImpl.o >/dev/null 2>&1 mv -f .deps/VarStoreImpl.Tpo .deps/VarStoreImpl.Plo make[1]: Leaving directory '/tmp/B.ache4phw/BUILD/XQilla-2.3.4' make[1]: Entering directory '/tmp/B.ache4phw/BUILD/XQilla-2.3.4' /bin/sh ./libtool --tag=CXX --mode=compile x86_64-pld-linux-gnux32-g++ -DHAVE_CONFIG_H -I. -I./src/config -I./include/ -I/usr/include -I./src/lexer/ -D_GNU_SOURCE -D_REENTRANT -O2 -fwrapv -pipe -Wformat -Werror=format-security -gdwarf-4 -fno-debug-types-section -fvar-tracking-assignments -g2 -Wp,-D_FORTIFY_SOURCE=2 -fstack-protector-strong --param=ssp-buffer-size=4 -Werror=trampolines -fPIC -mtune=generic -march=x86-64 -gdwarf-4 -fno-debug-types-section -fvar-tracking-assignments -g2 -ftemplate-depth-50 -MT VarTypeStoreImpl.lo -MD -MP -MF .deps/VarTypeStoreImpl.Tpo -c -o VarTypeStoreImpl.lo `test -f 'src/context/impl/VarTypeStoreImpl.cpp' || echo './'`src/context/impl/VarTypeStoreImpl.cpp libtool: compile: x86_64-pld-linux-gnux32-g++ -DHAVE_CONFIG_H -I. -I./src/config -I./include/ -I/usr/include -I./src/lexer/ -D_GNU_SOURCE -D_REENTRANT -O2 -fwrapv -pipe -Wformat -Werror=format-security -gdwarf-4 -fno-debug-types-section -fvar-tracking-assignments -g2 -Wp,-D_FORTIFY_SOURCE=2 -fstack-protector-strong --param=ssp-buffer-size=4 -Werror=trampolines -fPIC -mtune=generic -march=x86-64 -gdwarf-4 -fno-debug-types-section -fvar-tracking-assignments -g2 -ftemplate-depth-50 -MT VarTypeStoreImpl.lo -MD -MP -MF .deps/VarTypeStoreImpl.Tpo -c src/context/impl/VarTypeStoreImpl.cpp -fPIC -DPIC -o .libs/VarTypeStoreImpl.o libtool: compile: x86_64-pld-linux-gnux32-g++ -DHAVE_CONFIG_H -I. -I./src/config -I./include/ -I/usr/include -I./src/lexer/ -D_GNU_SOURCE -D_REENTRANT -O2 -fwrapv -pipe -Wformat -Werror=format-security -gdwarf-4 -fno-debug-types-section -fvar-tracking-assignments -g2 -Wp,-D_FORTIFY_SOURCE=2 -fstack-protector-strong --param=ssp-buffer-size=4 -Werror=trampolines -fPIC -mtune=generic -march=x86-64 -gdwarf-4 -fno-debug-types-section -fvar-tracking-assignments -g2 -ftemplate-depth-50 -MT VarTypeStoreImpl.lo -MD -MP -MF .deps/VarTypeStoreImpl.Tpo -c src/context/impl/VarTypeStoreImpl.cpp -o VarTypeStoreImpl.o >/dev/null 2>&1 mv -f .deps/VarTypeStoreImpl.Tpo .deps/VarTypeStoreImpl.Plo make[1]: Leaving directory '/tmp/B.ache4phw/BUILD/XQilla-2.3.4' make[1]: Entering directory '/tmp/B.ache4phw/BUILD/XQilla-2.3.4' /bin/sh ./libtool --tag=CXX --mode=compile x86_64-pld-linux-gnux32-g++ -DHAVE_CONFIG_H -I. -I./src/config -I./include/ -I/usr/include -I./src/lexer/ -D_GNU_SOURCE -D_REENTRANT -O2 -fwrapv -pipe -Wformat -Werror=format-security -gdwarf-4 -fno-debug-types-section -fvar-tracking-assignments -g2 -Wp,-D_FORTIFY_SOURCE=2 -fstack-protector-strong --param=ssp-buffer-size=4 -Werror=trampolines -fPIC -mtune=generic -march=x86-64 -gdwarf-4 -fno-debug-types-section -fvar-tracking-assignments -g2 -ftemplate-depth-50 -MT XQAtomize.lo -MD -MP -MF .deps/XQAtomize.Tpo -c -o XQAtomize.lo `test -f 'src/ast/XQAtomize.cpp' || echo './'`src/ast/XQAtomize.cpp libtool: compile: x86_64-pld-linux-gnux32-g++ -DHAVE_CONFIG_H -I. -I./src/config -I./include/ -I/usr/include -I./src/lexer/ -D_GNU_SOURCE -D_REENTRANT -O2 -fwrapv -pipe -Wformat -Werror=format-security -gdwarf-4 -fno-debug-types-section -fvar-tracking-assignments -g2 -Wp,-D_FORTIFY_SOURCE=2 -fstack-protector-strong --param=ssp-buffer-size=4 -Werror=trampolines -fPIC -mtune=generic -march=x86-64 -gdwarf-4 -fno-debug-types-section -fvar-tracking-assignments -g2 -ftemplate-depth-50 -MT XQAtomize.lo -MD -MP -MF .deps/XQAtomize.Tpo -c src/ast/XQAtomize.cpp -fPIC -DPIC -o .libs/XQAtomize.o libtool: compile: x86_64-pld-linux-gnux32-g++ -DHAVE_CONFIG_H -I. -I./src/config -I./include/ -I/usr/include -I./src/lexer/ -D_GNU_SOURCE -D_REENTRANT -O2 -fwrapv -pipe -Wformat -Werror=format-security -gdwarf-4 -fno-debug-types-section -fvar-tracking-assignments -g2 -Wp,-D_FORTIFY_SOURCE=2 -fstack-protector-strong --param=ssp-buffer-size=4 -Werror=trampolines -fPIC -mtune=generic -march=x86-64 -gdwarf-4 -fno-debug-types-section -fvar-tracking-assignments -g2 -ftemplate-depth-50 -MT XQAtomize.lo -MD -MP -MF .deps/XQAtomize.Tpo -c src/ast/XQAtomize.cpp -o XQAtomize.o >/dev/null 2>&1 mv -f .deps/XQAtomize.Tpo .deps/XQAtomize.Plo make[1]: Leaving directory '/tmp/B.ache4phw/BUILD/XQilla-2.3.4' make[1]: Entering directory '/tmp/B.ache4phw/BUILD/XQilla-2.3.4' /bin/sh ./libtool --tag=CXX --mode=compile x86_64-pld-linux-gnux32-g++ -DHAVE_CONFIG_H -I. -I./src/config -I./include/ -I/usr/include -I./src/lexer/ -D_GNU_SOURCE -D_REENTRANT -O2 -fwrapv -pipe -Wformat -Werror=format-security -gdwarf-4 -fno-debug-types-section -fvar-tracking-assignments -g2 -Wp,-D_FORTIFY_SOURCE=2 -fstack-protector-strong --param=ssp-buffer-size=4 -Werror=trampolines -fPIC -mtune=generic -march=x86-64 -gdwarf-4 -fno-debug-types-section -fvar-tracking-assignments -g2 -ftemplate-depth-50 -MT XQEffectiveBooleanValue.lo -MD -MP -MF .deps/XQEffectiveBooleanValue.Tpo -c -o XQEffectiveBooleanValue.lo `test -f 'src/ast/XQEffectiveBooleanValue.cpp' || echo './'`src/ast/XQEffectiveBooleanValue.cpp libtool: compile: x86_64-pld-linux-gnux32-g++ -DHAVE_CONFIG_H -I. -I./src/config -I./include/ -I/usr/include -I./src/lexer/ -D_GNU_SOURCE -D_REENTRANT -O2 -fwrapv -pipe -Wformat -Werror=format-security -gdwarf-4 -fno-debug-types-section -fvar-tracking-assignments -g2 -Wp,-D_FORTIFY_SOURCE=2 -fstack-protector-strong --param=ssp-buffer-size=4 -Werror=trampolines -fPIC -mtune=generic -march=x86-64 -gdwarf-4 -fno-debug-types-section -fvar-tracking-assignments -g2 -ftemplate-depth-50 -MT XQEffectiveBooleanValue.lo -MD -MP -MF .deps/XQEffectiveBooleanValue.Tpo -c src/ast/XQEffectiveBooleanValue.cpp -fPIC -DPIC -o .libs/XQEffectiveBooleanValue.o In file included from src/ast/XQEffectiveBooleanValue.cpp:29: ./include/xqilla/utils/XPath2Utils.hpp: In static member function 'static bool XPath2Utils::equals(const XMLCh*, const XMLCh*)': ./include/xqilla/utils/XPath2Utils.hpp:107:25: warning: ISO C++17 does not allow 'register' storage class specifier [-Wregister] 107 | register const XMLCh* psz1 = str1; | ^~~~ ./include/xqilla/utils/XPath2Utils.hpp:108:25: warning: ISO C++17 does not allow 'register' storage class specifier [-Wregister] 108 | register const XMLCh* psz2 = str2; | ^~~~ ./include/xqilla/utils/XPath2Utils.hpp: In static member function 'static int XPath2Utils::compare(const XMLCh*, const XMLCh*)': ./include/xqilla/utils/XPath2Utils.hpp:128:16: warning: ISO C++17 does not allow 'register' storage class specifier [-Wregister] 128 | register int cmp; | ^~~ libtool: compile: x86_64-pld-linux-gnux32-g++ -DHAVE_CONFIG_H -I. -I./src/config -I./include/ -I/usr/include -I./src/lexer/ -D_GNU_SOURCE -D_REENTRANT -O2 -fwrapv -pipe -Wformat -Werror=format-security -gdwarf-4 -fno-debug-types-section -fvar-tracking-assignments -g2 -Wp,-D_FORTIFY_SOURCE=2 -fstack-protector-strong --param=ssp-buffer-size=4 -Werror=trampolines -fPIC -mtune=generic -march=x86-64 -gdwarf-4 -fno-debug-types-section -fvar-tracking-assignments -g2 -ftemplate-depth-50 -MT XQEffectiveBooleanValue.lo -MD -MP -MF .deps/XQEffectiveBooleanValue.Tpo -c src/ast/XQEffectiveBooleanValue.cpp -o XQEffectiveBooleanValue.o >/dev/null 2>&1 mv -f .deps/XQEffectiveBooleanValue.Tpo .deps/XQEffectiveBooleanValue.Plo make[1]: Leaving directory '/tmp/B.ache4phw/BUILD/XQilla-2.3.4' make[1]: Entering directory '/tmp/B.ache4phw/BUILD/XQilla-2.3.4' /bin/sh ./libtool --tag=CXX --mode=compile x86_64-pld-linux-gnux32-g++ -DHAVE_CONFIG_H -I. -I./src/config -I./include/ -I/usr/include -I./src/lexer/ -D_GNU_SOURCE -D_REENTRANT -O2 -fwrapv -pipe -Wformat -Werror=format-security -gdwarf-4 -fno-debug-types-section -fvar-tracking-assignments -g2 -Wp,-D_FORTIFY_SOURCE=2 -fstack-protector-strong --param=ssp-buffer-size=4 -Werror=trampolines -fPIC -mtune=generic -march=x86-64 -gdwarf-4 -fno-debug-types-section -fvar-tracking-assignments -g2 -ftemplate-depth-50 -MT XQMap.lo -MD -MP -MF .deps/XQMap.Tpo -c -o XQMap.lo `test -f 'src/ast/XQMap.cpp' || echo './'`src/ast/XQMap.cpp libtool: compile: x86_64-pld-linux-gnux32-g++ -DHAVE_CONFIG_H -I. -I./src/config -I./include/ -I/usr/include -I./src/lexer/ -D_GNU_SOURCE -D_REENTRANT -O2 -fwrapv -pipe -Wformat -Werror=format-security -gdwarf-4 -fno-debug-types-section -fvar-tracking-assignments -g2 -Wp,-D_FORTIFY_SOURCE=2 -fstack-protector-strong --param=ssp-buffer-size=4 -Werror=trampolines -fPIC -mtune=generic -march=x86-64 -gdwarf-4 -fno-debug-types-section -fvar-tracking-assignments -g2 -ftemplate-depth-50 -MT XQMap.lo -MD -MP -MF .deps/XQMap.Tpo -c src/ast/XQMap.cpp -fPIC -DPIC -o .libs/XQMap.o In file included from src/ast/XQMap.cpp:30: ./include/xqilla/utils/XPath2Utils.hpp: In static member function 'static bool XPath2Utils::equals(const XMLCh*, const XMLCh*)': ./include/xqilla/utils/XPath2Utils.hpp:107:25: warning: ISO C++17 does not allow 'register' storage class specifier [-Wregister] 107 | register const XMLCh* psz1 = str1; | ^~~~ ./include/xqilla/utils/XPath2Utils.hpp:108:25: warning: ISO C++17 does not allow 'register' storage class specifier [-Wregister] 108 | register const XMLCh* psz2 = str2; | ^~~~ ./include/xqilla/utils/XPath2Utils.hpp: In static member function 'static int XPath2Utils::compare(const XMLCh*, const XMLCh*)': ./include/xqilla/utils/XPath2Utils.hpp:128:16: warning: ISO C++17 does not allow 'register' storage class specifier [-Wregister] 128 | register int cmp; | ^~~ libtool: compile: x86_64-pld-linux-gnux32-g++ -DHAVE_CONFIG_H -I. -I./src/config -I./include/ -I/usr/include -I./src/lexer/ -D_GNU_SOURCE -D_REENTRANT -O2 -fwrapv -pipe -Wformat -Werror=format-security -gdwarf-4 -fno-debug-types-section -fvar-tracking-assignments -g2 -Wp,-D_FORTIFY_SOURCE=2 -fstack-protector-strong --param=ssp-buffer-size=4 -Werror=trampolines -fPIC -mtune=generic -march=x86-64 -gdwarf-4 -fno-debug-types-section -fvar-tracking-assignments -g2 -ftemplate-depth-50 -MT XQMap.lo -MD -MP -MF .deps/XQMap.Tpo -c src/ast/XQMap.cpp -o XQMap.o >/dev/null 2>&1 mv -f .deps/XQMap.Tpo .deps/XQMap.Plo make[1]: Leaving directory '/tmp/B.ache4phw/BUILD/XQilla-2.3.4' make[1]: Entering directory '/tmp/B.ache4phw/BUILD/XQilla-2.3.4' /bin/sh ./libtool --tag=CXX --mode=compile x86_64-pld-linux-gnux32-g++ -DHAVE_CONFIG_H -I. -I./src/config -I./include/ -I/usr/include -I./src/lexer/ -D_GNU_SOURCE -D_REENTRANT -O2 -fwrapv -pipe -Wformat -Werror=format-security -gdwarf-4 -fno-debug-types-section -fvar-tracking-assignments -g2 -Wp,-D_FORTIFY_SOURCE=2 -fstack-protector-strong --param=ssp-buffer-size=4 -Werror=trampolines -fPIC -mtune=generic -march=x86-64 -gdwarf-4 -fno-debug-types-section -fvar-tracking-assignments -g2 -ftemplate-depth-50 -MT UpdateFactory.lo -MD -MP -MF .deps/UpdateFactory.Tpo -c -o UpdateFactory.lo `test -f 'src/context/UpdateFactory.cpp' || echo './'`src/context/UpdateFactory.cpp libtool: compile: x86_64-pld-linux-gnux32-g++ -DHAVE_CONFIG_H -I. -I./src/config -I./include/ -I/usr/include -I./src/lexer/ -D_GNU_SOURCE -D_REENTRANT -O2 -fwrapv -pipe -Wformat -Werror=format-security -gdwarf-4 -fno-debug-types-section -fvar-tracking-assignments -g2 -Wp,-D_FORTIFY_SOURCE=2 -fstack-protector-strong --param=ssp-buffer-size=4 -Werror=trampolines -fPIC -mtune=generic -march=x86-64 -gdwarf-4 -fno-debug-types-section -fvar-tracking-assignments -g2 -ftemplate-depth-50 -MT UpdateFactory.lo -MD -MP -MF .deps/UpdateFactory.Tpo -c src/context/UpdateFactory.cpp -fPIC -DPIC -o .libs/UpdateFactory.o In file included from src/context/UpdateFactory.cpp:30: ./include/xqilla/utils/XPath2Utils.hpp: In static member function 'static bool XPath2Utils::equals(const XMLCh*, const XMLCh*)': ./include/xqilla/utils/XPath2Utils.hpp:107:25: warning: ISO C++17 does not allow 'register' storage class specifier [-Wregister] 107 | register const XMLCh* psz1 = str1; | ^~~~ ./include/xqilla/utils/XPath2Utils.hpp:108:25: warning: ISO C++17 does not allow 'register' storage class specifier [-Wregister] 108 | register const XMLCh* psz2 = str2; | ^~~~ ./include/xqilla/utils/XPath2Utils.hpp: In static member function 'static int XPath2Utils::compare(const XMLCh*, const XMLCh*)': ./include/xqilla/utils/XPath2Utils.hpp:128:16: warning: ISO C++17 does not allow 'register' storage class specifier [-Wregister] 128 | register int cmp; | ^~~ libtool: compile: x86_64-pld-linux-gnux32-g++ -DHAVE_CONFIG_H -I. -I./src/config -I./include/ -I/usr/include -I./src/lexer/ -D_GNU_SOURCE -D_REENTRANT -O2 -fwrapv -pipe -Wformat -Werror=format-security -gdwarf-4 -fno-debug-types-section -fvar-tracking-assignments -g2 -Wp,-D_FORTIFY_SOURCE=2 -fstack-protector-strong --param=ssp-buffer-size=4 -Werror=trampolines -fPIC -mtune=generic -march=x86-64 -gdwarf-4 -fno-debug-types-section -fvar-tracking-assignments -g2 -ftemplate-depth-50 -MT UpdateFactory.lo -MD -MP -MF .deps/UpdateFactory.Tpo -c src/context/UpdateFactory.cpp -o UpdateFactory.o >/dev/null 2>&1 mv -f .deps/UpdateFactory.Tpo .deps/UpdateFactory.Plo make[1]: Leaving directory '/tmp/B.ache4phw/BUILD/XQilla-2.3.4' make[1]: Entering directory '/tmp/B.ache4phw/BUILD/XQilla-2.3.4' /bin/sh ./libtool --tag=CXX --mode=compile x86_64-pld-linux-gnux32-g++ -DHAVE_CONFIG_H -I. -I./src/config -I./include/ -I/usr/include -I./src/lexer/ -D_GNU_SOURCE -D_REENTRANT -O2 -fwrapv -pipe -Wformat -Werror=format-security -gdwarf-4 -fno-debug-types-section -fvar-tracking-assignments -g2 -Wp,-D_FORTIFY_SOURCE=2 -fstack-protector-strong --param=ssp-buffer-size=4 -Werror=trampolines -fPIC -mtune=generic -march=x86-64 -gdwarf-4 -fno-debug-types-section -fvar-tracking-assignments -g2 -ftemplate-depth-50 -MT ItemFactoryImpl.lo -MD -MP -MF .deps/ItemFactoryImpl.Tpo -c -o ItemFactoryImpl.lo `test -f 'src/context/impl/ItemFactoryImpl.cpp' || echo './'`src/context/impl/ItemFactoryImpl.cpp libtool: compile: x86_64-pld-linux-gnux32-g++ -DHAVE_CONFIG_H -I. -I./src/config -I./include/ -I/usr/include -I./src/lexer/ -D_GNU_SOURCE -D_REENTRANT -O2 -fwrapv -pipe -Wformat -Werror=format-security -gdwarf-4 -fno-debug-types-section -fvar-tracking-assignments -g2 -Wp,-D_FORTIFY_SOURCE=2 -fstack-protector-strong --param=ssp-buffer-size=4 -Werror=trampolines -fPIC -mtune=generic -march=x86-64 -gdwarf-4 -fno-debug-types-section -fvar-tracking-assignments -g2 -ftemplate-depth-50 -MT ItemFactoryImpl.lo -MD -MP -MF .deps/ItemFactoryImpl.Tpo -c src/context/impl/ItemFactoryImpl.cpp -fPIC -DPIC -o .libs/ItemFactoryImpl.o In file included from src/context/impl/ItemFactoryImpl.cpp:32: ./include/xqilla/utils/XPath2Utils.hpp: In static member function 'static bool XPath2Utils::equals(const XMLCh*, const XMLCh*)': ./include/xqilla/utils/XPath2Utils.hpp:107:25: warning: ISO C++17 does not allow 'register' storage class specifier [-Wregister] 107 | register const XMLCh* psz1 = str1; | ^~~~ ./include/xqilla/utils/XPath2Utils.hpp:108:25: warning: ISO C++17 does not allow 'register' storage class specifier [-Wregister] 108 | register const XMLCh* psz2 = str2; | ^~~~ ./include/xqilla/utils/XPath2Utils.hpp: In static member function 'static int XPath2Utils::compare(const XMLCh*, const XMLCh*)': ./include/xqilla/utils/XPath2Utils.hpp:128:16: warning: ISO C++17 does not allow 'register' storage class specifier [-Wregister] 128 | register int cmp; | ^~~ libtool: compile: x86_64-pld-linux-gnux32-g++ -DHAVE_CONFIG_H -I. -I./src/config -I./include/ -I/usr/include -I./src/lexer/ -D_GNU_SOURCE -D_REENTRANT -O2 -fwrapv -pipe -Wformat -Werror=format-security -gdwarf-4 -fno-debug-types-section -fvar-tracking-assignments -g2 -Wp,-D_FORTIFY_SOURCE=2 -fstack-protector-strong --param=ssp-buffer-size=4 -Werror=trampolines -fPIC -mtune=generic -march=x86-64 -gdwarf-4 -fno-debug-types-section -fvar-tracking-assignments -g2 -ftemplate-depth-50 -MT ItemFactoryImpl.lo -MD -MP -MF .deps/ItemFactoryImpl.Tpo -c src/context/impl/ItemFactoryImpl.cpp -o ItemFactoryImpl.o >/dev/null 2>&1 mv -f .deps/ItemFactoryImpl.Tpo .deps/ItemFactoryImpl.Plo make[1]: Leaving directory '/tmp/B.ache4phw/BUILD/XQilla-2.3.4' make[1]: Entering directory '/tmp/B.ache4phw/BUILD/XQilla-2.3.4' /bin/sh ./libtool --tag=CXX --mode=compile x86_64-pld-linux-gnux32-g++ -DHAVE_CONFIG_H -I. -I./src/config -I./include/ -I/usr/include -I./src/lexer/ -D_GNU_SOURCE -D_REENTRANT -O2 -fwrapv -pipe -Wformat -Werror=format-security -gdwarf-4 -fno-debug-types-section -fvar-tracking-assignments -g2 -Wp,-D_FORTIFY_SOURCE=2 -fstack-protector-strong --param=ssp-buffer-size=4 -Werror=trampolines -fPIC -mtune=generic -march=x86-64 -gdwarf-4 -fno-debug-types-section -fvar-tracking-assignments -g2 -ftemplate-depth-50 -MT XQDynamicContextImpl.lo -MD -MP -MF .deps/XQDynamicContextImpl.Tpo -c -o XQDynamicContextImpl.lo `test -f 'src/context/impl/XQDynamicContextImpl.cpp' || echo './'`src/context/impl/XQDynamicContextImpl.cpp libtool: compile: x86_64-pld-linux-gnux32-g++ -DHAVE_CONFIG_H -I. -I./src/config -I./include/ -I/usr/include -I./src/lexer/ -D_GNU_SOURCE -D_REENTRANT -O2 -fwrapv -pipe -Wformat -Werror=format-security -gdwarf-4 -fno-debug-types-section -fvar-tracking-assignments -g2 -Wp,-D_FORTIFY_SOURCE=2 -fstack-protector-strong --param=ssp-buffer-size=4 -Werror=trampolines -fPIC -mtune=generic -march=x86-64 -gdwarf-4 -fno-debug-types-section -fvar-tracking-assignments -g2 -ftemplate-depth-50 -MT XQDynamicContextImpl.lo -MD -MP -MF .deps/XQDynamicContextImpl.Tpo -c src/context/impl/XQDynamicContextImpl.cpp -fPIC -DPIC -o .libs/XQDynamicContextImpl.o In file included from src/context/impl/XQDynamicContextImpl.cpp:24: ./include/xqilla/utils/XPath2Utils.hpp: In static member function 'static bool XPath2Utils::equals(const XMLCh*, const XMLCh*)': ./include/xqilla/utils/XPath2Utils.hpp:107:25: warning: ISO C++17 does not allow 'register' storage class specifier [-Wregister] 107 | register const XMLCh* psz1 = str1; | ^~~~ ./include/xqilla/utils/XPath2Utils.hpp:108:25: warning: ISO C++17 does not allow 'register' storage class specifier [-Wregister] 108 | register const XMLCh* psz2 = str2; | ^~~~ ./include/xqilla/utils/XPath2Utils.hpp: In static member function 'static int XPath2Utils::compare(const XMLCh*, const XMLCh*)': ./include/xqilla/utils/XPath2Utils.hpp:128:16: warning: ISO C++17 does not allow 'register' storage class specifier [-Wregister] 128 | register int cmp; | ^~~ libtool: compile: x86_64-pld-linux-gnux32-g++ -DHAVE_CONFIG_H -I. -I./src/config -I./include/ -I/usr/include -I./src/lexer/ -D_GNU_SOURCE -D_REENTRANT -O2 -fwrapv -pipe -Wformat -Werror=format-security -gdwarf-4 -fno-debug-types-section -fvar-tracking-assignments -g2 -Wp,-D_FORTIFY_SOURCE=2 -fstack-protector-strong --param=ssp-buffer-size=4 -Werror=trampolines -fPIC -mtune=generic -march=x86-64 -gdwarf-4 -fno-debug-types-section -fvar-tracking-assignments -g2 -ftemplate-depth-50 -MT XQDynamicContextImpl.lo -MD -MP -MF .deps/XQDynamicContextImpl.Tpo -c src/context/impl/XQDynamicContextImpl.cpp -o XQDynamicContextImpl.o >/dev/null 2>&1 mv -f .deps/XQDynamicContextImpl.Tpo .deps/XQDynamicContextImpl.Plo make[1]: Leaving directory '/tmp/B.ache4phw/BUILD/XQilla-2.3.4' make[1]: Entering directory '/tmp/B.ache4phw/BUILD/XQilla-2.3.4' /bin/sh ./libtool --tag=CXX --mode=compile x86_64-pld-linux-gnux32-g++ -DHAVE_CONFIG_H -I. -I./src/config -I./include/ -I/usr/include -I./src/lexer/ -D_GNU_SOURCE -D_REENTRANT -O2 -fwrapv -pipe -Wformat -Werror=format-security -gdwarf-4 -fno-debug-types-section -fvar-tracking-assignments -g2 -Wp,-D_FORTIFY_SOURCE=2 -fstack-protector-strong --param=ssp-buffer-size=4 -Werror=trampolines -fPIC -mtune=generic -march=x86-64 -gdwarf-4 -fno-debug-types-section -fvar-tracking-assignments -g2 -ftemplate-depth-50 -MT XQCastableAs.lo -MD -MP -MF .deps/XQCastableAs.Tpo -c -o XQCastableAs.lo `test -f 'src/ast/XQCastableAs.cpp' || echo './'`src/ast/XQCastableAs.cpp libtool: compile: x86_64-pld-linux-gnux32-g++ -DHAVE_CONFIG_H -I. -I./src/config -I./include/ -I/usr/include -I./src/lexer/ -D_GNU_SOURCE -D_REENTRANT -O2 -fwrapv -pipe -Wformat -Werror=format-security -gdwarf-4 -fno-debug-types-section -fvar-tracking-assignments -g2 -Wp,-D_FORTIFY_SOURCE=2 -fstack-protector-strong --param=ssp-buffer-size=4 -Werror=trampolines -fPIC -mtune=generic -march=x86-64 -gdwarf-4 -fno-debug-types-section -fvar-tracking-assignments -g2 -ftemplate-depth-50 -MT XQCastableAs.lo -MD -MP -MF .deps/XQCastableAs.Tpo -c src/ast/XQCastableAs.cpp -fPIC -DPIC -o .libs/XQCastableAs.o In file included from src/ast/XQCastableAs.cpp:38: ./include/xqilla/utils/XPath2Utils.hpp: In static member function 'static bool XPath2Utils::equals(const XMLCh*, const XMLCh*)': ./include/xqilla/utils/XPath2Utils.hpp:107:25: warning: ISO C++17 does not allow 'register' storage class specifier [-Wregister] 107 | register const XMLCh* psz1 = str1; | ^~~~ ./include/xqilla/utils/XPath2Utils.hpp:108:25: warning: ISO C++17 does not allow 'register' storage class specifier [-Wregister] 108 | register const XMLCh* psz2 = str2; | ^~~~ ./include/xqilla/utils/XPath2Utils.hpp: In static member function 'static int XPath2Utils::compare(const XMLCh*, const XMLCh*)': ./include/xqilla/utils/XPath2Utils.hpp:128:16: warning: ISO C++17 does not allow 'register' storage class specifier [-Wregister] 128 | register int cmp; | ^~~ libtool: compile: x86_64-pld-linux-gnux32-g++ -DHAVE_CONFIG_H -I. -I./src/config -I./include/ -I/usr/include -I./src/lexer/ -D_GNU_SOURCE -D_REENTRANT -O2 -fwrapv -pipe -Wformat -Werror=format-security -gdwarf-4 -fno-debug-types-section -fvar-tracking-assignments -g2 -Wp,-D_FORTIFY_SOURCE=2 -fstack-protector-strong --param=ssp-buffer-size=4 -Werror=trampolines -fPIC -mtune=generic -march=x86-64 -gdwarf-4 -fno-debug-types-section -fvar-tracking-assignments -g2 -ftemplate-depth-50 -MT XQCastableAs.lo -MD -MP -MF .deps/XQCastableAs.Tpo -c src/ast/XQCastableAs.cpp -o XQCastableAs.o >/dev/null 2>&1 mv -f .deps/XQCastableAs.Tpo .deps/XQCastableAs.Plo make[1]: Leaving directory '/tmp/B.ache4phw/BUILD/XQilla-2.3.4' make[1]: Entering directory '/tmp/B.ache4phw/BUILD/XQilla-2.3.4' /bin/sh ./libtool --tag=CXX --mode=compile x86_64-pld-linux-gnux32-g++ -DHAVE_CONFIG_H -I. -I./src/config -I./include/ -I/usr/include -I./src/lexer/ -D_GNU_SOURCE -D_REENTRANT -O2 -fwrapv -pipe -Wformat -Werror=format-security -gdwarf-4 -fno-debug-types-section -fvar-tracking-assignments -g2 -Wp,-D_FORTIFY_SOURCE=2 -fstack-protector-strong --param=ssp-buffer-size=4 -Werror=trampolines -fPIC -mtune=generic -march=x86-64 -gdwarf-4 -fno-debug-types-section -fvar-tracking-assignments -g2 -ftemplate-depth-50 -MT XQContextItem.lo -MD -MP -MF .deps/XQContextItem.Tpo -c -o XQContextItem.lo `test -f 'src/ast/XQContextItem.cpp' || echo './'`src/ast/XQContextItem.cpp libtool: compile: x86_64-pld-linux-gnux32-g++ -DHAVE_CONFIG_H -I. -I./src/config -I./include/ -I/usr/include -I./src/lexer/ -D_GNU_SOURCE -D_REENTRANT -O2 -fwrapv -pipe -Wformat -Werror=format-security -gdwarf-4 -fno-debug-types-section -fvar-tracking-assignments -g2 -Wp,-D_FORTIFY_SOURCE=2 -fstack-protector-strong --param=ssp-buffer-size=4 -Werror=trampolines -fPIC -mtune=generic -march=x86-64 -gdwarf-4 -fno-debug-types-section -fvar-tracking-assignments -g2 -ftemplate-depth-50 -MT XQContextItem.lo -MD -MP -MF .deps/XQContextItem.Tpo -c src/ast/XQContextItem.cpp -fPIC -DPIC -o .libs/XQContextItem.o libtool: compile: x86_64-pld-linux-gnux32-g++ -DHAVE_CONFIG_H -I. -I./src/config -I./include/ -I/usr/include -I./src/lexer/ -D_GNU_SOURCE -D_REENTRANT -O2 -fwrapv -pipe -Wformat -Werror=format-security -gdwarf-4 -fno-debug-types-section -fvar-tracking-assignments -g2 -Wp,-D_FORTIFY_SOURCE=2 -fstack-protector-strong --param=ssp-buffer-size=4 -Werror=trampolines -fPIC -mtune=generic -march=x86-64 -gdwarf-4 -fno-debug-types-section -fvar-tracking-assignments -g2 -ftemplate-depth-50 -MT XQContextItem.lo -MD -MP -MF .deps/XQContextItem.Tpo -c src/ast/XQContextItem.cpp -o XQContextItem.o >/dev/null 2>&1 mv -f .deps/XQContextItem.Tpo .deps/XQContextItem.Plo make[1]: Leaving directory '/tmp/B.ache4phw/BUILD/XQilla-2.3.4' make[1]: Entering directory '/tmp/B.ache4phw/BUILD/XQilla-2.3.4' /bin/sh ./libtool --tag=CXX --mode=compile x86_64-pld-linux-gnux32-g++ -DHAVE_CONFIG_H -I. -I./src/config -I./include/ -I/usr/include -I./src/lexer/ -D_GNU_SOURCE -D_REENTRANT -O2 -fwrapv -pipe -Wformat -Werror=format-security -gdwarf-4 -fno-debug-types-section -fvar-tracking-assignments -g2 -Wp,-D_FORTIFY_SOURCE=2 -fstack-protector-strong --param=ssp-buffer-size=4 -Werror=trampolines -fPIC -mtune=generic -march=x86-64 -gdwarf-4 -fno-debug-types-section -fvar-tracking-assignments -g2 -ftemplate-depth-50 -MT XQContextImpl.lo -MD -MP -MF .deps/XQContextImpl.Tpo -c -o XQContextImpl.lo `test -f 'src/context/impl/XQContextImpl.cpp' || echo './'`src/context/impl/XQContextImpl.cpp libtool: compile: x86_64-pld-linux-gnux32-g++ -DHAVE_CONFIG_H -I. -I./src/config -I./include/ -I/usr/include -I./src/lexer/ -D_GNU_SOURCE -D_REENTRANT -O2 -fwrapv -pipe -Wformat -Werror=format-security -gdwarf-4 -fno-debug-types-section -fvar-tracking-assignments -g2 -Wp,-D_FORTIFY_SOURCE=2 -fstack-protector-strong --param=ssp-buffer-size=4 -Werror=trampolines -fPIC -mtune=generic -march=x86-64 -gdwarf-4 -fno-debug-types-section -fvar-tracking-assignments -g2 -ftemplate-depth-50 -MT XQContextImpl.lo -MD -MP -MF .deps/XQContextImpl.Tpo -c src/context/impl/XQContextImpl.cpp -fPIC -DPIC -o .libs/XQContextImpl.o In file included from src/context/impl/XQContextImpl.cpp:38: ./include/xqilla/utils/XPath2Utils.hpp: In static member function 'static bool XPath2Utils::equals(const XMLCh*, const XMLCh*)': ./include/xqilla/utils/XPath2Utils.hpp:107:25: warning: ISO C++17 does not allow 'register' storage class specifier [-Wregister] 107 | register const XMLCh* psz1 = str1; | ^~~~ ./include/xqilla/utils/XPath2Utils.hpp:108:25: warning: ISO C++17 does not allow 'register' storage class specifier [-Wregister] 108 | register const XMLCh* psz2 = str2; | ^~~~ ./include/xqilla/utils/XPath2Utils.hpp: In static member function 'static int XPath2Utils::compare(const XMLCh*, const XMLCh*)': ./include/xqilla/utils/XPath2Utils.hpp:128:16: warning: ISO C++17 does not allow 'register' storage class specifier [-Wregister] 128 | register int cmp; | ^~~ libtool: compile: x86_64-pld-linux-gnux32-g++ -DHAVE_CONFIG_H -I. -I./src/config -I./include/ -I/usr/include -I./src/lexer/ -D_GNU_SOURCE -D_REENTRANT -O2 -fwrapv -pipe -Wformat -Werror=format-security -gdwarf-4 -fno-debug-types-section -fvar-tracking-assignments -g2 -Wp,-D_FORTIFY_SOURCE=2 -fstack-protector-strong --param=ssp-buffer-size=4 -Werror=trampolines -fPIC -mtune=generic -march=x86-64 -gdwarf-4 -fno-debug-types-section -fvar-tracking-assignments -g2 -ftemplate-depth-50 -MT XQContextImpl.lo -MD -MP -MF .deps/XQContextImpl.Tpo -c src/context/impl/XQContextImpl.cpp -o XQContextImpl.o >/dev/null 2>&1 mv -f .deps/XQContextImpl.Tpo .deps/XQContextImpl.Plo make[1]: Leaving directory '/tmp/B.ache4phw/BUILD/XQilla-2.3.4' make[1]: Entering directory '/tmp/B.ache4phw/BUILD/XQilla-2.3.4' /bin/sh ./libtool --tag=CXX --mode=compile x86_64-pld-linux-gnux32-g++ -DHAVE_CONFIG_H -I. -I./src/config -I./include/ -I/usr/include -I./src/lexer/ -D_GNU_SOURCE -D_REENTRANT -O2 -fwrapv -pipe -Wformat -Werror=format-security -gdwarf-4 -fno-debug-types-section -fvar-tracking-assignments -g2 -Wp,-D_FORTIFY_SOURCE=2 -fstack-protector-strong --param=ssp-buffer-size=4 -Werror=trampolines -fPIC -mtune=generic -march=x86-64 -gdwarf-4 -fno-debug-types-section -fvar-tracking-assignments -g2 -ftemplate-depth-50 -MT XQAnalyzeString.lo -MD -MP -MF .deps/XQAnalyzeString.Tpo -c -o XQAnalyzeString.lo `test -f 'src/ast/XQAnalyzeString.cpp' || echo './'`src/ast/XQAnalyzeString.cpp libtool: compile: x86_64-pld-linux-gnux32-g++ -DHAVE_CONFIG_H -I. -I./src/config -I./include/ -I/usr/include -I./src/lexer/ -D_GNU_SOURCE -D_REENTRANT -O2 -fwrapv -pipe -Wformat -Werror=format-security -gdwarf-4 -fno-debug-types-section -fvar-tracking-assignments -g2 -Wp,-D_FORTIFY_SOURCE=2 -fstack-protector-strong --param=ssp-buffer-size=4 -Werror=trampolines -fPIC -mtune=generic -march=x86-64 -gdwarf-4 -fno-debug-types-section -fvar-tracking-assignments -g2 -ftemplate-depth-50 -MT XQAnalyzeString.lo -MD -MP -MF .deps/XQAnalyzeString.Tpo -c src/ast/XQAnalyzeString.cpp -fPIC -DPIC -o .libs/XQAnalyzeString.o In file included from src/ast/XQAnalyzeString.cpp:31: ./include/xqilla/utils/XPath2Utils.hpp: In static member function 'static bool XPath2Utils::equals(const XMLCh*, const XMLCh*)': ./include/xqilla/utils/XPath2Utils.hpp:107:25: warning: ISO C++17 does not allow 'register' storage class specifier [-Wregister] 107 | register const XMLCh* psz1 = str1; | ^~~~ ./include/xqilla/utils/XPath2Utils.hpp:108:25: warning: ISO C++17 does not allow 'register' storage class specifier [-Wregister] 108 | register const XMLCh* psz2 = str2; | ^~~~ ./include/xqilla/utils/XPath2Utils.hpp: In static member function 'static int XPath2Utils::compare(const XMLCh*, const XMLCh*)': ./include/xqilla/utils/XPath2Utils.hpp:128:16: warning: ISO C++17 does not allow 'register' storage class specifier [-Wregister] 128 | register int cmp; | ^~~ libtool: compile: x86_64-pld-linux-gnux32-g++ -DHAVE_CONFIG_H -I. -I./src/config -I./include/ -I/usr/include -I./src/lexer/ -D_GNU_SOURCE -D_REENTRANT -O2 -fwrapv -pipe -Wformat -Werror=format-security -gdwarf-4 -fno-debug-types-section -fvar-tracking-assignments -g2 -Wp,-D_FORTIFY_SOURCE=2 -fstack-protector-strong --param=ssp-buffer-size=4 -Werror=trampolines -fPIC -mtune=generic -march=x86-64 -gdwarf-4 -fno-debug-types-section -fvar-tracking-assignments -g2 -ftemplate-depth-50 -MT XQAnalyzeString.lo -MD -MP -MF .deps/XQAnalyzeString.Tpo -c src/ast/XQAnalyzeString.cpp -o XQAnalyzeString.o >/dev/null 2>&1 mv -f .deps/XQAnalyzeString.Tpo .deps/XQAnalyzeString.Plo make[1]: Leaving directory '/tmp/B.ache4phw/BUILD/XQilla-2.3.4' make[1]: Entering directory '/tmp/B.ache4phw/BUILD/XQilla-2.3.4' /bin/sh ./libtool --tag=CXX --mode=compile x86_64-pld-linux-gnux32-g++ -DHAVE_CONFIG_H -I. -I./src/config -I./include/ -I/usr/include -I./src/lexer/ -D_GNU_SOURCE -D_REENTRANT -O2 -fwrapv -pipe -Wformat -Werror=format-security -gdwarf-4 -fno-debug-types-section -fvar-tracking-assignments -g2 -Wp,-D_FORTIFY_SOURCE=2 -fstack-protector-strong --param=ssp-buffer-size=4 -Werror=trampolines -fPIC -mtune=generic -march=x86-64 -gdwarf-4 -fno-debug-types-section -fvar-tracking-assignments -g2 -ftemplate-depth-50 -MT XQCopyOf.lo -MD -MP -MF .deps/XQCopyOf.Tpo -c -o XQCopyOf.lo `test -f 'src/ast/XQCopyOf.cpp' || echo './'`src/ast/XQCopyOf.cpp libtool: compile: x86_64-pld-linux-gnux32-g++ -DHAVE_CONFIG_H -I. -I./src/config -I./include/ -I/usr/include -I./src/lexer/ -D_GNU_SOURCE -D_REENTRANT -O2 -fwrapv -pipe -Wformat -Werror=format-security -gdwarf-4 -fno-debug-types-section -fvar-tracking-assignments -g2 -Wp,-D_FORTIFY_SOURCE=2 -fstack-protector-strong --param=ssp-buffer-size=4 -Werror=trampolines -fPIC -mtune=generic -march=x86-64 -gdwarf-4 -fno-debug-types-section -fvar-tracking-assignments -g2 -ftemplate-depth-50 -MT XQCopyOf.lo -MD -MP -MF .deps/XQCopyOf.Tpo -c src/ast/XQCopyOf.cpp -fPIC -DPIC -o .libs/XQCopyOf.o libtool: compile: x86_64-pld-linux-gnux32-g++ -DHAVE_CONFIG_H -I. -I./src/config -I./include/ -I/usr/include -I./src/lexer/ -D_GNU_SOURCE -D_REENTRANT -O2 -fwrapv -pipe -Wformat -Werror=format-security -gdwarf-4 -fno-debug-types-section -fvar-tracking-assignments -g2 -Wp,-D_FORTIFY_SOURCE=2 -fstack-protector-strong --param=ssp-buffer-size=4 -Werror=trampolines -fPIC -mtune=generic -march=x86-64 -gdwarf-4 -fno-debug-types-section -fvar-tracking-assignments -g2 -ftemplate-depth-50 -MT XQCopyOf.lo -MD -MP -MF .deps/XQCopyOf.Tpo -c src/ast/XQCopyOf.cpp -o XQCopyOf.o >/dev/null 2>&1 mv -f .deps/XQCopyOf.Tpo .deps/XQCopyOf.Plo make[1]: Leaving directory '/tmp/B.ache4phw/BUILD/XQilla-2.3.4' make[1]: Entering directory '/tmp/B.ache4phw/BUILD/XQilla-2.3.4' /bin/sh ./libtool --tag=CXX --mode=compile x86_64-pld-linux-gnux32-g++ -DHAVE_CONFIG_H -I. -I./src/config -I./include/ -I/usr/include -I./src/lexer/ -D_GNU_SOURCE -D_REENTRANT -O2 -fwrapv -pipe -Wformat -Werror=format-security -gdwarf-4 -fno-debug-types-section -fvar-tracking-assignments -g2 -Wp,-D_FORTIFY_SOURCE=2 -fstack-protector-strong --param=ssp-buffer-size=4 -Werror=trampolines -fPIC -mtune=generic -march=x86-64 -gdwarf-4 -fno-debug-types-section -fvar-tracking-assignments -g2 -ftemplate-depth-50 -MT XQCastAs.lo -MD -MP -MF .deps/XQCastAs.Tpo -c -o XQCastAs.lo `test -f 'src/ast/XQCastAs.cpp' || echo './'`src/ast/XQCastAs.cpp libtool: compile: x86_64-pld-linux-gnux32-g++ -DHAVE_CONFIG_H -I. -I./src/config -I./include/ -I/usr/include -I./src/lexer/ -D_GNU_SOURCE -D_REENTRANT -O2 -fwrapv -pipe -Wformat -Werror=format-security -gdwarf-4 -fno-debug-types-section -fvar-tracking-assignments -g2 -Wp,-D_FORTIFY_SOURCE=2 -fstack-protector-strong --param=ssp-buffer-size=4 -Werror=trampolines -fPIC -mtune=generic -march=x86-64 -gdwarf-4 -fno-debug-types-section -fvar-tracking-assignments -g2 -ftemplate-depth-50 -MT XQCastAs.lo -MD -MP -MF .deps/XQCastAs.Tpo -c src/ast/XQCastAs.cpp -fPIC -DPIC -o .libs/XQCastAs.o In file included from src/ast/XQCastAs.cpp:35: ./include/xqilla/utils/XPath2Utils.hpp: In static member function 'static bool XPath2Utils::equals(const XMLCh*, const XMLCh*)': ./include/xqilla/utils/XPath2Utils.hpp:107:25: warning: ISO C++17 does not allow 'register' storage class specifier [-Wregister] 107 | register const XMLCh* psz1 = str1; | ^~~~ ./include/xqilla/utils/XPath2Utils.hpp:108:25: warning: ISO C++17 does not allow 'register' storage class specifier [-Wregister] 108 | register const XMLCh* psz2 = str2; | ^~~~ ./include/xqilla/utils/XPath2Utils.hpp: In static member function 'static int XPath2Utils::compare(const XMLCh*, const XMLCh*)': ./include/xqilla/utils/XPath2Utils.hpp:128:16: warning: ISO C++17 does not allow 'register' storage class specifier [-Wregister] 128 | register int cmp; | ^~~ libtool: compile: x86_64-pld-linux-gnux32-g++ -DHAVE_CONFIG_H -I. -I./src/config -I./include/ -I/usr/include -I./src/lexer/ -D_GNU_SOURCE -D_REENTRANT -O2 -fwrapv -pipe -Wformat -Werror=format-security -gdwarf-4 -fno-debug-types-section -fvar-tracking-assignments -g2 -Wp,-D_FORTIFY_SOURCE=2 -fstack-protector-strong --param=ssp-buffer-size=4 -Werror=trampolines -fPIC -mtune=generic -march=x86-64 -gdwarf-4 -fno-debug-types-section -fvar-tracking-assignments -g2 -ftemplate-depth-50 -MT XQCastAs.lo -MD -MP -MF .deps/XQCastAs.Tpo -c src/ast/XQCastAs.cpp -o XQCastAs.o >/dev/null 2>&1 mv -f .deps/XQCastAs.Tpo .deps/XQCastAs.Plo make[1]: Leaving directory '/tmp/B.ache4phw/BUILD/XQilla-2.3.4' make[1]: Entering directory '/tmp/B.ache4phw/BUILD/XQilla-2.3.4' /bin/sh ./libtool --tag=CXX --mode=compile x86_64-pld-linux-gnux32-g++ -DHAVE_CONFIG_H -I. -I./src/config -I./include/ -I/usr/include -I./src/lexer/ -D_GNU_SOURCE -D_REENTRANT -O2 -fwrapv -pipe -Wformat -Werror=format-security -gdwarf-4 -fno-debug-types-section -fvar-tracking-assignments -g2 -Wp,-D_FORTIFY_SOURCE=2 -fstack-protector-strong --param=ssp-buffer-size=4 -Werror=trampolines -fPIC -mtune=generic -march=x86-64 -gdwarf-4 -fno-debug-types-section -fvar-tracking-assignments -g2 -ftemplate-depth-50 -MT XQCopy.lo -MD -MP -MF .deps/XQCopy.Tpo -c -o XQCopy.lo `test -f 'src/ast/XQCopy.cpp' || echo './'`src/ast/XQCopy.cpp libtool: compile: x86_64-pld-linux-gnux32-g++ -DHAVE_CONFIG_H -I. -I./src/config -I./include/ -I/usr/include -I./src/lexer/ -D_GNU_SOURCE -D_REENTRANT -O2 -fwrapv -pipe -Wformat -Werror=format-security -gdwarf-4 -fno-debug-types-section -fvar-tracking-assignments -g2 -Wp,-D_FORTIFY_SOURCE=2 -fstack-protector-strong --param=ssp-buffer-size=4 -Werror=trampolines -fPIC -mtune=generic -march=x86-64 -gdwarf-4 -fno-debug-types-section -fvar-tracking-assignments -g2 -ftemplate-depth-50 -MT XQCopy.lo -MD -MP -MF .deps/XQCopy.Tpo -c src/ast/XQCopy.cpp -fPIC -DPIC -o .libs/XQCopy.o libtool: compile: x86_64-pld-linux-gnux32-g++ -DHAVE_CONFIG_H -I. -I./src/config -I./include/ -I/usr/include -I./src/lexer/ -D_GNU_SOURCE -D_REENTRANT -O2 -fwrapv -pipe -Wformat -Werror=format-security -gdwarf-4 -fno-debug-types-section -fvar-tracking-assignments -g2 -Wp,-D_FORTIFY_SOURCE=2 -fstack-protector-strong --param=ssp-buffer-size=4 -Werror=trampolines -fPIC -mtune=generic -march=x86-64 -gdwarf-4 -fno-debug-types-section -fvar-tracking-assignments -g2 -ftemplate-depth-50 -MT XQCopy.lo -MD -MP -MF .deps/XQCopy.Tpo -c src/ast/XQCopy.cpp -o XQCopy.o >/dev/null 2>&1 mv -f .deps/XQCopy.Tpo .deps/XQCopy.Plo make[1]: Leaving directory '/tmp/B.ache4phw/BUILD/XQilla-2.3.4' make[1]: Entering directory '/tmp/B.ache4phw/BUILD/XQilla-2.3.4' /bin/sh ./libtool --tag=CXX --mode=compile x86_64-pld-linux-gnux32-g++ -DHAVE_CONFIG_H -I. -I./src/config -I./include/ -I/usr/include -I./src/lexer/ -D_GNU_SOURCE -D_REENTRANT -O2 -fwrapv -pipe -Wformat -Werror=format-security -gdwarf-4 -fno-debug-types-section -fvar-tracking-assignments -g2 -Wp,-D_FORTIFY_SOURCE=2 -fstack-protector-strong --param=ssp-buffer-size=4 -Werror=trampolines -fPIC -mtune=generic -march=x86-64 -gdwarf-4 -fno-debug-types-section -fvar-tracking-assignments -g2 -ftemplate-depth-50 -MT XQIf.lo -MD -MP -MF .deps/XQIf.Tpo -c -o XQIf.lo `test -f 'src/ast/XQIf.cpp' || echo './'`src/ast/XQIf.cpp libtool: compile: x86_64-pld-linux-gnux32-g++ -DHAVE_CONFIG_H -I. -I./src/config -I./include/ -I/usr/include -I./src/lexer/ -D_GNU_SOURCE -D_REENTRANT -O2 -fwrapv -pipe -Wformat -Werror=format-security -gdwarf-4 -fno-debug-types-section -fvar-tracking-assignments -g2 -Wp,-D_FORTIFY_SOURCE=2 -fstack-protector-strong --param=ssp-buffer-size=4 -Werror=trampolines -fPIC -mtune=generic -march=x86-64 -gdwarf-4 -fno-debug-types-section -fvar-tracking-assignments -g2 -ftemplate-depth-50 -MT XQIf.lo -MD -MP -MF .deps/XQIf.Tpo -c src/ast/XQIf.cpp -fPIC -DPIC -o .libs/XQIf.o libtool: compile: x86_64-pld-linux-gnux32-g++ -DHAVE_CONFIG_H -I. -I./src/config -I./include/ -I/usr/include -I./src/lexer/ -D_GNU_SOURCE -D_REENTRANT -O2 -fwrapv -pipe -Wformat -Werror=format-security -gdwarf-4 -fno-debug-types-section -fvar-tracking-assignments -g2 -Wp,-D_FORTIFY_SOURCE=2 -fstack-protector-strong --param=ssp-buffer-size=4 -Werror=trampolines -fPIC -mtune=generic -march=x86-64 -gdwarf-4 -fno-debug-types-section -fvar-tracking-assignments -g2 -ftemplate-depth-50 -MT XQIf.lo -MD -MP -MF .deps/XQIf.Tpo -c src/ast/XQIf.cpp -o XQIf.o >/dev/null 2>&1 mv -f .deps/XQIf.Tpo .deps/XQIf.Plo make[1]: Leaving directory '/tmp/B.ache4phw/BUILD/XQilla-2.3.4' make[1]: Entering directory '/tmp/B.ache4phw/BUILD/XQilla-2.3.4' /bin/sh ./libtool --tag=CXX --mode=compile x86_64-pld-linux-gnux32-g++ -DHAVE_CONFIG_H -I. -I./src/config -I./include/ -I/usr/include -I./src/lexer/ -D_GNU_SOURCE -D_REENTRANT -O2 -fwrapv -pipe -Wformat -Werror=format-security -gdwarf-4 -fno-debug-types-section -fvar-tracking-assignments -g2 -Wp,-D_FORTIFY_SOURCE=2 -fstack-protector-strong --param=ssp-buffer-size=4 -Werror=trampolines -fPIC -mtune=generic -march=x86-64 -gdwarf-4 -fno-debug-types-section -fvar-tracking-assignments -g2 -ftemplate-depth-50 -MT XQInlineFunction.lo -MD -MP -MF .deps/XQInlineFunction.Tpo -c -o XQInlineFunction.lo `test -f 'src/ast/XQInlineFunction.cpp' || echo './'`src/ast/XQInlineFunction.cpp libtool: compile: x86_64-pld-linux-gnux32-g++ -DHAVE_CONFIG_H -I. -I./src/config -I./include/ -I/usr/include -I./src/lexer/ -D_GNU_SOURCE -D_REENTRANT -O2 -fwrapv -pipe -Wformat -Werror=format-security -gdwarf-4 -fno-debug-types-section -fvar-tracking-assignments -g2 -Wp,-D_FORTIFY_SOURCE=2 -fstack-protector-strong --param=ssp-buffer-size=4 -Werror=trampolines -fPIC -mtune=generic -march=x86-64 -gdwarf-4 -fno-debug-types-section -fvar-tracking-assignments -g2 -ftemplate-depth-50 -MT XQInlineFunction.lo -MD -MP -MF .deps/XQInlineFunction.Tpo -c src/ast/XQInlineFunction.cpp -fPIC -DPIC -o .libs/XQInlineFunction.o In file included from src/ast/XQInlineFunction.cpp:25: ./include/xqilla/utils/XPath2Utils.hpp: In static member function 'static bool XPath2Utils::equals(const XMLCh*, const XMLCh*)': ./include/xqilla/utils/XPath2Utils.hpp:107:25: warning: ISO C++17 does not allow 'register' storage class specifier [-Wregister] 107 | register const XMLCh* psz1 = str1; | ^~~~ ./include/xqilla/utils/XPath2Utils.hpp:108:25: warning: ISO C++17 does not allow 'register' storage class specifier [-Wregister] 108 | register const XMLCh* psz2 = str2; | ^~~~ ./include/xqilla/utils/XPath2Utils.hpp: In static member function 'static int XPath2Utils::compare(const XMLCh*, const XMLCh*)': ./include/xqilla/utils/XPath2Utils.hpp:128:16: warning: ISO C++17 does not allow 'register' storage class specifier [-Wregister] 128 | register int cmp; | ^~~ libtool: compile: x86_64-pld-linux-gnux32-g++ -DHAVE_CONFIG_H -I. -I./src/config -I./include/ -I/usr/include -I./src/lexer/ -D_GNU_SOURCE -D_REENTRANT -O2 -fwrapv -pipe -Wformat -Werror=format-security -gdwarf-4 -fno-debug-types-section -fvar-tracking-assignments -g2 -Wp,-D_FORTIFY_SOURCE=2 -fstack-protector-strong --param=ssp-buffer-size=4 -Werror=trampolines -fPIC -mtune=generic -march=x86-64 -gdwarf-4 -fno-debug-types-section -fvar-tracking-assignments -g2 -ftemplate-depth-50 -MT XQInlineFunction.lo -MD -MP -MF .deps/XQInlineFunction.Tpo -c src/ast/XQInlineFunction.cpp -o XQInlineFunction.o >/dev/null 2>&1 mv -f .deps/XQInlineFunction.Tpo .deps/XQInlineFunction.Plo make[1]: Leaving directory '/tmp/B.ache4phw/BUILD/XQilla-2.3.4' make[1]: Entering directory '/tmp/B.ache4phw/BUILD/XQilla-2.3.4' /bin/sh ./libtool --tag=CXX --mode=compile x86_64-pld-linux-gnux32-g++ -DHAVE_CONFIG_H -I. -I./src/config -I./include/ -I/usr/include -I./src/lexer/ -D_GNU_SOURCE -D_REENTRANT -O2 -fwrapv -pipe -Wformat -Werror=format-security -gdwarf-4 -fno-debug-types-section -fvar-tracking-assignments -g2 -Wp,-D_FORTIFY_SOURCE=2 -fstack-protector-strong --param=ssp-buffer-size=4 -Werror=trampolines -fPIC -mtune=generic -march=x86-64 -gdwarf-4 -fno-debug-types-section -fvar-tracking-assignments -g2 -ftemplate-depth-50 -MT XQOperator.lo -MD -MP -MF .deps/XQOperator.Tpo -c -o XQOperator.lo `test -f 'src/ast/XQOperator.cpp' || echo './'`src/ast/XQOperator.cpp libtool: compile: x86_64-pld-linux-gnux32-g++ -DHAVE_CONFIG_H -I. -I./src/config -I./include/ -I/usr/include -I./src/lexer/ -D_GNU_SOURCE -D_REENTRANT -O2 -fwrapv -pipe -Wformat -Werror=format-security -gdwarf-4 -fno-debug-types-section -fvar-tracking-assignments -g2 -Wp,-D_FORTIFY_SOURCE=2 -fstack-protector-strong --param=ssp-buffer-size=4 -Werror=trampolines -fPIC -mtune=generic -march=x86-64 -gdwarf-4 -fno-debug-types-section -fvar-tracking-assignments -g2 -ftemplate-depth-50 -MT XQOperator.lo -MD -MP -MF .deps/XQOperator.Tpo -c src/ast/XQOperator.cpp -fPIC -DPIC -o .libs/XQOperator.o libtool: compile: x86_64-pld-linux-gnux32-g++ -DHAVE_CONFIG_H -I. -I./src/config -I./include/ -I/usr/include -I./src/lexer/ -D_GNU_SOURCE -D_REENTRANT -O2 -fwrapv -pipe -Wformat -Werror=format-security -gdwarf-4 -fno-debug-types-section -fvar-tracking-assignments -g2 -Wp,-D_FORTIFY_SOURCE=2 -fstack-protector-strong --param=ssp-buffer-size=4 -Werror=trampolines -fPIC -mtune=generic -march=x86-64 -gdwarf-4 -fno-debug-types-section -fvar-tracking-assignments -g2 -ftemplate-depth-50 -MT XQOperator.lo -MD -MP -MF .deps/XQOperator.Tpo -c src/ast/XQOperator.cpp -o XQOperator.o >/dev/null 2>&1 mv -f .deps/XQOperator.Tpo .deps/XQOperator.Plo make[1]: Leaving directory '/tmp/B.ache4phw/BUILD/XQilla-2.3.4' make[1]: Entering directory '/tmp/B.ache4phw/BUILD/XQilla-2.3.4' /bin/sh ./libtool --tag=CXX --mode=compile x86_64-pld-linux-gnux32-g++ -DHAVE_CONFIG_H -I. -I./src/config -I./include/ -I/usr/include -I./src/lexer/ -D_GNU_SOURCE -D_REENTRANT -O2 -fwrapv -pipe -Wformat -Werror=format-security -gdwarf-4 -fno-debug-types-section -fvar-tracking-assignments -g2 -Wp,-D_FORTIFY_SOURCE=2 -fstack-protector-strong --param=ssp-buffer-size=4 -Werror=trampolines -fPIC -mtune=generic -march=x86-64 -gdwarf-4 -fno-debug-types-section -fvar-tracking-assignments -g2 -ftemplate-depth-50 -MT XQLiteral.lo -MD -MP -MF .deps/XQLiteral.Tpo -c -o XQLiteral.lo `test -f 'src/ast/XQLiteral.cpp' || echo './'`src/ast/XQLiteral.cpp libtool: compile: x86_64-pld-linux-gnux32-g++ -DHAVE_CONFIG_H -I. -I./src/config -I./include/ -I/usr/include -I./src/lexer/ -D_GNU_SOURCE -D_REENTRANT -O2 -fwrapv -pipe -Wformat -Werror=format-security -gdwarf-4 -fno-debug-types-section -fvar-tracking-assignments -g2 -Wp,-D_FORTIFY_SOURCE=2 -fstack-protector-strong --param=ssp-buffer-size=4 -Werror=trampolines -fPIC -mtune=generic -march=x86-64 -gdwarf-4 -fno-debug-types-section -fvar-tracking-assignments -g2 -ftemplate-depth-50 -MT XQLiteral.lo -MD -MP -MF .deps/XQLiteral.Tpo -c src/ast/XQLiteral.cpp -fPIC -DPIC -o .libs/XQLiteral.o In file included from src/ast/XQLiteral.cpp:33: ./include/xqilla/utils/XPath2Utils.hpp: In static member function 'static bool XPath2Utils::equals(const XMLCh*, const XMLCh*)': ./include/xqilla/utils/XPath2Utils.hpp:107:25: warning: ISO C++17 does not allow 'register' storage class specifier [-Wregister] 107 | register const XMLCh* psz1 = str1; | ^~~~ ./include/xqilla/utils/XPath2Utils.hpp:108:25: warning: ISO C++17 does not allow 'register' storage class specifier [-Wregister] 108 | register const XMLCh* psz2 = str2; | ^~~~ ./include/xqilla/utils/XPath2Utils.hpp: In static member function 'static int XPath2Utils::compare(const XMLCh*, const XMLCh*)': ./include/xqilla/utils/XPath2Utils.hpp:128:16: warning: ISO C++17 does not allow 'register' storage class specifier [-Wregister] 128 | register int cmp; | ^~~ libtool: compile: x86_64-pld-linux-gnux32-g++ -DHAVE_CONFIG_H -I. -I./src/config -I./include/ -I/usr/include -I./src/lexer/ -D_GNU_SOURCE -D_REENTRANT -O2 -fwrapv -pipe -Wformat -Werror=format-security -gdwarf-4 -fno-debug-types-section -fvar-tracking-assignments -g2 -Wp,-D_FORTIFY_SOURCE=2 -fstack-protector-strong --param=ssp-buffer-size=4 -Werror=trampolines -fPIC -mtune=generic -march=x86-64 -gdwarf-4 -fno-debug-types-section -fvar-tracking-assignments -g2 -ftemplate-depth-50 -MT XQLiteral.lo -MD -MP -MF .deps/XQLiteral.Tpo -c src/ast/XQLiteral.cpp -o XQLiteral.o >/dev/null 2>&1 mv -f .deps/XQLiteral.Tpo .deps/XQLiteral.Plo make[1]: Leaving directory '/tmp/B.ache4phw/BUILD/XQilla-2.3.4' make[1]: Entering directory '/tmp/B.ache4phw/BUILD/XQilla-2.3.4' /bin/sh ./libtool --tag=CXX --mode=compile x86_64-pld-linux-gnux32-g++ -DHAVE_CONFIG_H -I. -I./src/config -I./include/ -I/usr/include -I./src/lexer/ -D_GNU_SOURCE -D_REENTRANT -O2 -fwrapv -pipe -Wformat -Werror=format-security -gdwarf-4 -fno-debug-types-section -fvar-tracking-assignments -g2 -Wp,-D_FORTIFY_SOURCE=2 -fstack-protector-strong --param=ssp-buffer-size=4 -Werror=trampolines -fPIC -mtune=generic -march=x86-64 -gdwarf-4 -fno-debug-types-section -fvar-tracking-assignments -g2 -ftemplate-depth-50 -MT ASTNodeImpl.lo -MD -MP -MF .deps/ASTNodeImpl.Tpo -c -o ASTNodeImpl.lo `test -f 'src/ast/ASTNodeImpl.cpp' || echo './'`src/ast/ASTNodeImpl.cpp libtool: compile: x86_64-pld-linux-gnux32-g++ -DHAVE_CONFIG_H -I. -I./src/config -I./include/ -I/usr/include -I./src/lexer/ -D_GNU_SOURCE -D_REENTRANT -O2 -fwrapv -pipe -Wformat -Werror=format-security -gdwarf-4 -fno-debug-types-section -fvar-tracking-assignments -g2 -Wp,-D_FORTIFY_SOURCE=2 -fstack-protector-strong --param=ssp-buffer-size=4 -Werror=trampolines -fPIC -mtune=generic -march=x86-64 -gdwarf-4 -fno-debug-types-section -fvar-tracking-assignments -g2 -ftemplate-depth-50 -MT ASTNodeImpl.lo -MD -MP -MF .deps/ASTNodeImpl.Tpo -c src/ast/ASTNodeImpl.cpp -fPIC -DPIC -o .libs/ASTNodeImpl.o In file included from src/ast/ASTNodeImpl.cpp:25: ./include/xqilla/utils/XPath2Utils.hpp: In static member function 'static bool XPath2Utils::equals(const XMLCh*, const XMLCh*)': ./include/xqilla/utils/XPath2Utils.hpp:107:25: warning: ISO C++17 does not allow 'register' storage class specifier [-Wregister] 107 | register const XMLCh* psz1 = str1; | ^~~~ ./include/xqilla/utils/XPath2Utils.hpp:108:25: warning: ISO C++17 does not allow 'register' storage class specifier [-Wregister] 108 | register const XMLCh* psz2 = str2; | ^~~~ ./include/xqilla/utils/XPath2Utils.hpp: In static member function 'static int XPath2Utils::compare(const XMLCh*, const XMLCh*)': ./include/xqilla/utils/XPath2Utils.hpp:128:16: warning: ISO C++17 does not allow 'register' storage class specifier [-Wregister] 128 | register int cmp; | ^~~ libtool: compile: x86_64-pld-linux-gnux32-g++ -DHAVE_CONFIG_H -I. -I./src/config -I./include/ -I/usr/include -I./src/lexer/ -D_GNU_SOURCE -D_REENTRANT -O2 -fwrapv -pipe -Wformat -Werror=format-security -gdwarf-4 -fno-debug-types-section -fvar-tracking-assignments -g2 -Wp,-D_FORTIFY_SOURCE=2 -fstack-protector-strong --param=ssp-buffer-size=4 -Werror=trampolines -fPIC -mtune=generic -march=x86-64 -gdwarf-4 -fno-debug-types-section -fvar-tracking-assignments -g2 -ftemplate-depth-50 -MT ASTNodeImpl.lo -MD -MP -MF .deps/ASTNodeImpl.Tpo -c src/ast/ASTNodeImpl.cpp -o ASTNodeImpl.o >/dev/null 2>&1 mv -f .deps/ASTNodeImpl.Tpo .deps/ASTNodeImpl.Plo make[1]: Leaving directory '/tmp/B.ache4phw/BUILD/XQilla-2.3.4' make[1]: Entering directory '/tmp/B.ache4phw/BUILD/XQilla-2.3.4' /bin/sh ./libtool --tag=CXX --mode=compile x86_64-pld-linux-gnux32-g++ -DHAVE_CONFIG_H -I. -I./src/config -I./include/ -I/usr/include -I./src/lexer/ -D_GNU_SOURCE -D_REENTRANT -O2 -fwrapv -pipe -Wformat -Werror=format-security -gdwarf-4 -fno-debug-types-section -fvar-tracking-assignments -g2 -Wp,-D_FORTIFY_SOURCE=2 -fstack-protector-strong --param=ssp-buffer-size=4 -Werror=trampolines -fPIC -mtune=generic -march=x86-64 -gdwarf-4 -fno-debug-types-section -fvar-tracking-assignments -g2 -ftemplate-depth-50 -MT XQFunction.lo -MD -MP -MF .deps/XQFunction.Tpo -c -o XQFunction.lo `test -f 'src/ast/XQFunction.cpp' || echo './'`src/ast/XQFunction.cpp libtool: compile: x86_64-pld-linux-gnux32-g++ -DHAVE_CONFIG_H -I. -I./src/config -I./include/ -I/usr/include -I./src/lexer/ -D_GNU_SOURCE -D_REENTRANT -O2 -fwrapv -pipe -Wformat -Werror=format-security -gdwarf-4 -fno-debug-types-section -fvar-tracking-assignments -g2 -Wp,-D_FORTIFY_SOURCE=2 -fstack-protector-strong --param=ssp-buffer-size=4 -Werror=trampolines -fPIC -mtune=generic -march=x86-64 -gdwarf-4 -fno-debug-types-section -fvar-tracking-assignments -g2 -ftemplate-depth-50 -MT XQFunction.lo -MD -MP -MF .deps/XQFunction.Tpo -c src/ast/XQFunction.cpp -fPIC -DPIC -o .libs/XQFunction.o In file included from src/ast/XQFunction.cpp:28: ./include/xqilla/utils/XPath2Utils.hpp: In static member function 'static bool XPath2Utils::equals(const XMLCh*, const XMLCh*)': ./include/xqilla/utils/XPath2Utils.hpp:107:25: warning: ISO C++17 does not allow 'register' storage class specifier [-Wregister] 107 | register const XMLCh* psz1 = str1; | ^~~~ ./include/xqilla/utils/XPath2Utils.hpp:108:25: warning: ISO C++17 does not allow 'register' storage class specifier [-Wregister] 108 | register const XMLCh* psz2 = str2; | ^~~~ ./include/xqilla/utils/XPath2Utils.hpp: In static member function 'static int XPath2Utils::compare(const XMLCh*, const XMLCh*)': ./include/xqilla/utils/XPath2Utils.hpp:128:16: warning: ISO C++17 does not allow 'register' storage class specifier [-Wregister] 128 | register int cmp; | ^~~ libtool: compile: x86_64-pld-linux-gnux32-g++ -DHAVE_CONFIG_H -I. -I./src/config -I./include/ -I/usr/include -I./src/lexer/ -D_GNU_SOURCE -D_REENTRANT -O2 -fwrapv -pipe -Wformat -Werror=format-security -gdwarf-4 -fno-debug-types-section -fvar-tracking-assignments -g2 -Wp,-D_FORTIFY_SOURCE=2 -fstack-protector-strong --param=ssp-buffer-size=4 -Werror=trampolines -fPIC -mtune=generic -march=x86-64 -gdwarf-4 -fno-debug-types-section -fvar-tracking-assignments -g2 -ftemplate-depth-50 -MT XQFunction.lo -MD -MP -MF .deps/XQFunction.Tpo -c src/ast/XQFunction.cpp -o XQFunction.o >/dev/null 2>&1 mv -f .deps/XQFunction.Tpo .deps/XQFunction.Plo make[1]: Leaving directory '/tmp/B.ache4phw/BUILD/XQilla-2.3.4' make[1]: Entering directory '/tmp/B.ache4phw/BUILD/XQilla-2.3.4' /bin/sh ./libtool --tag=CXX --mode=compile x86_64-pld-linux-gnux32-g++ -DHAVE_CONFIG_H -I. -I./src/config -I./include/ -I/usr/include -I./src/lexer/ -D_GNU_SOURCE -D_REENTRANT -O2 -fwrapv -pipe -Wformat -Werror=format-security -gdwarf-4 -fno-debug-types-section -fvar-tracking-assignments -g2 -Wp,-D_FORTIFY_SOURCE=2 -fstack-protector-strong --param=ssp-buffer-size=4 -Werror=trampolines -fPIC -mtune=generic -march=x86-64 -gdwarf-4 -fno-debug-types-section -fvar-tracking-assignments -g2 -ftemplate-depth-50 -MT XQSequence.lo -MD -MP -MF .deps/XQSequence.Tpo -c -o XQSequence.lo `test -f 'src/ast/XQSequence.cpp' || echo './'`src/ast/XQSequence.cpp libtool: compile: x86_64-pld-linux-gnux32-g++ -DHAVE_CONFIG_H -I. -I./src/config -I./include/ -I/usr/include -I./src/lexer/ -D_GNU_SOURCE -D_REENTRANT -O2 -fwrapv -pipe -Wformat -Werror=format-security -gdwarf-4 -fno-debug-types-section -fvar-tracking-assignments -g2 -Wp,-D_FORTIFY_SOURCE=2 -fstack-protector-strong --param=ssp-buffer-size=4 -Werror=trampolines -fPIC -mtune=generic -march=x86-64 -gdwarf-4 -fno-debug-types-section -fvar-tracking-assignments -g2 -ftemplate-depth-50 -MT XQSequence.lo -MD -MP -MF .deps/XQSequence.Tpo -c src/ast/XQSequence.cpp -fPIC -DPIC -o .libs/XQSequence.o libtool: compile: x86_64-pld-linux-gnux32-g++ -DHAVE_CONFIG_H -I. -I./src/config -I./include/ -I/usr/include -I./src/lexer/ -D_GNU_SOURCE -D_REENTRANT -O2 -fwrapv -pipe -Wformat -Werror=format-security -gdwarf-4 -fno-debug-types-section -fvar-tracking-assignments -g2 -Wp,-D_FORTIFY_SOURCE=2 -fstack-protector-strong --param=ssp-buffer-size=4 -Werror=trampolines -fPIC -mtune=generic -march=x86-64 -gdwarf-4 -fno-debug-types-section -fvar-tracking-assignments -g2 -ftemplate-depth-50 -MT XQSequence.lo -MD -MP -MF .deps/XQSequence.Tpo -c src/ast/XQSequence.cpp -o XQSequence.o >/dev/null 2>&1 mv -f .deps/XQSequence.Tpo .deps/XQSequence.Plo make[1]: Leaving directory '/tmp/B.ache4phw/BUILD/XQilla-2.3.4' make[1]: Entering directory '/tmp/B.ache4phw/BUILD/XQilla-2.3.4' /bin/sh ./libtool --tag=CXX --mode=compile x86_64-pld-linux-gnux32-g++ -DHAVE_CONFIG_H -I. -I./src/config -I./include/ -I/usr/include -I./src/lexer/ -D_GNU_SOURCE -D_REENTRANT -O2 -fwrapv -pipe -Wformat -Werror=format-security -gdwarf-4 -fno-debug-types-section -fvar-tracking-assignments -g2 -Wp,-D_FORTIFY_SOURCE=2 -fstack-protector-strong --param=ssp-buffer-size=4 -Werror=trampolines -fPIC -mtune=generic -march=x86-64 -gdwarf-4 -fno-debug-types-section -fvar-tracking-assignments -g2 -ftemplate-depth-50 -MT XQNav.lo -MD -MP -MF .deps/XQNav.Tpo -c -o XQNav.lo `test -f 'src/ast/XQNav.cpp' || echo './'`src/ast/XQNav.cpp libtool: compile: x86_64-pld-linux-gnux32-g++ -DHAVE_CONFIG_H -I. -I./src/config -I./include/ -I/usr/include -I./src/lexer/ -D_GNU_SOURCE -D_REENTRANT -O2 -fwrapv -pipe -Wformat -Werror=format-security -gdwarf-4 -fno-debug-types-section -fvar-tracking-assignments -g2 -Wp,-D_FORTIFY_SOURCE=2 -fstack-protector-strong --param=ssp-buffer-size=4 -Werror=trampolines -fPIC -mtune=generic -march=x86-64 -gdwarf-4 -fno-debug-types-section -fvar-tracking-assignments -g2 -ftemplate-depth-50 -MT XQNav.lo -MD -MP -MF .deps/XQNav.Tpo -c src/ast/XQNav.cpp -fPIC -DPIC -o .libs/XQNav.o libtool: compile: x86_64-pld-linux-gnux32-g++ -DHAVE_CONFIG_H -I. -I./src/config -I./include/ -I/usr/include -I./src/lexer/ -D_GNU_SOURCE -D_REENTRANT -O2 -fwrapv -pipe -Wformat -Werror=format-security -gdwarf-4 -fno-debug-types-section -fvar-tracking-assignments -g2 -Wp,-D_FORTIFY_SOURCE=2 -fstack-protector-strong --param=ssp-buffer-size=4 -Werror=trampolines -fPIC -mtune=generic -march=x86-64 -gdwarf-4 -fno-debug-types-section -fvar-tracking-assignments -g2 -ftemplate-depth-50 -MT XQNav.lo -MD -MP -MF .deps/XQNav.Tpo -c src/ast/XQNav.cpp -o XQNav.o >/dev/null 2>&1 mv -f .deps/XQNav.Tpo .deps/XQNav.Plo make[1]: Leaving directory '/tmp/B.ache4phw/BUILD/XQilla-2.3.4' make[1]: Entering directory '/tmp/B.ache4phw/BUILD/XQilla-2.3.4' /bin/sh ./libtool --tag=CXX --mode=compile x86_64-pld-linux-gnux32-g++ -DHAVE_CONFIG_H -I. -I./src/config -I./include/ -I/usr/include -I./src/lexer/ -D_GNU_SOURCE -D_REENTRANT -O2 -fwrapv -pipe -Wformat -Werror=format-security -gdwarf-4 -fno-debug-types-section -fvar-tracking-assignments -g2 -Wp,-D_FORTIFY_SOURCE=2 -fstack-protector-strong --param=ssp-buffer-size=4 -Werror=trampolines -fPIC -mtune=generic -march=x86-64 -gdwarf-4 -fno-debug-types-section -fvar-tracking-assignments -g2 -ftemplate-depth-50 -MT XQTreatAs.lo -MD -MP -MF .deps/XQTreatAs.Tpo -c -o XQTreatAs.lo `test -f 'src/ast/XQTreatAs.cpp' || echo './'`src/ast/XQTreatAs.cpp libtool: compile: x86_64-pld-linux-gnux32-g++ -DHAVE_CONFIG_H -I. -I./src/config -I./include/ -I/usr/include -I./src/lexer/ -D_GNU_SOURCE -D_REENTRANT -O2 -fwrapv -pipe -Wformat -Werror=format-security -gdwarf-4 -fno-debug-types-section -fvar-tracking-assignments -g2 -Wp,-D_FORTIFY_SOURCE=2 -fstack-protector-strong --param=ssp-buffer-size=4 -Werror=trampolines -fPIC -mtune=generic -march=x86-64 -gdwarf-4 -fno-debug-types-section -fvar-tracking-assignments -g2 -ftemplate-depth-50 -MT XQTreatAs.lo -MD -MP -MF .deps/XQTreatAs.Tpo -c src/ast/XQTreatAs.cpp -fPIC -DPIC -o .libs/XQTreatAs.o In file included from src/ast/XQTreatAs.cpp:28: ./include/xqilla/utils/XPath2Utils.hpp: In static member function 'static bool XPath2Utils::equals(const XMLCh*, const XMLCh*)': ./include/xqilla/utils/XPath2Utils.hpp:107:25: warning: ISO C++17 does not allow 'register' storage class specifier [-Wregister] 107 | register const XMLCh* psz1 = str1; | ^~~~ ./include/xqilla/utils/XPath2Utils.hpp:108:25: warning: ISO C++17 does not allow 'register' storage class specifier [-Wregister] 108 | register const XMLCh* psz2 = str2; | ^~~~ ./include/xqilla/utils/XPath2Utils.hpp: In static member function 'static int XPath2Utils::compare(const XMLCh*, const XMLCh*)': ./include/xqilla/utils/XPath2Utils.hpp:128:16: warning: ISO C++17 does not allow 'register' storage class specifier [-Wregister] 128 | register int cmp; | ^~~ libtool: compile: x86_64-pld-linux-gnux32-g++ -DHAVE_CONFIG_H -I. -I./src/config -I./include/ -I/usr/include -I./src/lexer/ -D_GNU_SOURCE -D_REENTRANT -O2 -fwrapv -pipe -Wformat -Werror=format-security -gdwarf-4 -fno-debug-types-section -fvar-tracking-assignments -g2 -Wp,-D_FORTIFY_SOURCE=2 -fstack-protector-strong --param=ssp-buffer-size=4 -Werror=trampolines -fPIC -mtune=generic -march=x86-64 -gdwarf-4 -fno-debug-types-section -fvar-tracking-assignments -g2 -ftemplate-depth-50 -MT XQTreatAs.lo -MD -MP -MF .deps/XQTreatAs.Tpo -c src/ast/XQTreatAs.cpp -o XQTreatAs.o >/dev/null 2>&1 mv -f .deps/XQTreatAs.Tpo .deps/XQTreatAs.Plo make[1]: Leaving directory '/tmp/B.ache4phw/BUILD/XQilla-2.3.4' make[1]: Entering directory '/tmp/B.ache4phw/BUILD/XQilla-2.3.4' /bin/sh ./libtool --tag=CXX --mode=compile x86_64-pld-linux-gnux32-g++ -DHAVE_CONFIG_H -I. -I./src/config -I./include/ -I/usr/include -I./src/lexer/ -D_GNU_SOURCE -D_REENTRANT -O2 -fwrapv -pipe -Wformat -Werror=format-security -gdwarf-4 -fno-debug-types-section -fvar-tracking-assignments -g2 -Wp,-D_FORTIFY_SOURCE=2 -fstack-protector-strong --param=ssp-buffer-size=4 -Werror=trampolines -fPIC -mtune=generic -march=x86-64 -gdwarf-4 -fno-debug-types-section -fvar-tracking-assignments -g2 -ftemplate-depth-50 -MT XQVariable.lo -MD -MP -MF .deps/XQVariable.Tpo -c -o XQVariable.lo `test -f 'src/ast/XQVariable.cpp' || echo './'`src/ast/XQVariable.cpp libtool: compile: x86_64-pld-linux-gnux32-g++ -DHAVE_CONFIG_H -I. -I./src/config -I./include/ -I/usr/include -I./src/lexer/ -D_GNU_SOURCE -D_REENTRANT -O2 -fwrapv -pipe -Wformat -Werror=format-security -gdwarf-4 -fno-debug-types-section -fvar-tracking-assignments -g2 -Wp,-D_FORTIFY_SOURCE=2 -fstack-protector-strong --param=ssp-buffer-size=4 -Werror=trampolines -fPIC -mtune=generic -march=x86-64 -gdwarf-4 -fno-debug-types-section -fvar-tracking-assignments -g2 -ftemplate-depth-50 -MT XQVariable.lo -MD -MP -MF .deps/XQVariable.Tpo -c src/ast/XQVariable.cpp -fPIC -DPIC -o .libs/XQVariable.o In file included from src/ast/XQVariable.cpp:24: ./include/xqilla/utils/XPath2Utils.hpp: In static member function 'static bool XPath2Utils::equals(const XMLCh*, const XMLCh*)': ./include/xqilla/utils/XPath2Utils.hpp:107:25: warning: ISO C++17 does not allow 'register' storage class specifier [-Wregister] 107 | register const XMLCh* psz1 = str1; | ^~~~ ./include/xqilla/utils/XPath2Utils.hpp:108:25: warning: ISO C++17 does not allow 'register' storage class specifier [-Wregister] 108 | register const XMLCh* psz2 = str2; | ^~~~ ./include/xqilla/utils/XPath2Utils.hpp: In static member function 'static int XPath2Utils::compare(const XMLCh*, const XMLCh*)': ./include/xqilla/utils/XPath2Utils.hpp:128:16: warning: ISO C++17 does not allow 'register' storage class specifier [-Wregister] 128 | register int cmp; | ^~~ libtool: compile: x86_64-pld-linux-gnux32-g++ -DHAVE_CONFIG_H -I. -I./src/config -I./include/ -I/usr/include -I./src/lexer/ -D_GNU_SOURCE -D_REENTRANT -O2 -fwrapv -pipe -Wformat -Werror=format-security -gdwarf-4 -fno-debug-types-section -fvar-tracking-assignments -g2 -Wp,-D_FORTIFY_SOURCE=2 -fstack-protector-strong --param=ssp-buffer-size=4 -Werror=trampolines -fPIC -mtune=generic -march=x86-64 -gdwarf-4 -fno-debug-types-section -fvar-tracking-assignments -g2 -ftemplate-depth-50 -MT XQVariable.lo -MD -MP -MF .deps/XQVariable.Tpo -c src/ast/XQVariable.cpp -o XQVariable.o >/dev/null 2>&1 mv -f .deps/XQVariable.Tpo .deps/XQVariable.Plo make[1]: Leaving directory '/tmp/B.ache4phw/BUILD/XQilla-2.3.4' make[1]: Entering directory '/tmp/B.ache4phw/BUILD/XQilla-2.3.4' /bin/sh ./libtool --tag=CXX --mode=compile x86_64-pld-linux-gnux32-g++ -DHAVE_CONFIG_H -I. -I./src/config -I./include/ -I/usr/include -I./src/lexer/ -D_GNU_SOURCE -D_REENTRANT -O2 -fwrapv -pipe -Wformat -Werror=format-security -gdwarf-4 -fno-debug-types-section -fvar-tracking-assignments -g2 -Wp,-D_FORTIFY_SOURCE=2 -fstack-protector-strong --param=ssp-buffer-size=4 -Werror=trampolines -fPIC -mtune=generic -march=x86-64 -gdwarf-4 -fno-debug-types-section -fvar-tracking-assignments -g2 -ftemplate-depth-50 -MT XQStep.lo -MD -MP -MF .deps/XQStep.Tpo -c -o XQStep.lo `test -f 'src/ast/XQStep.cpp' || echo './'`src/ast/XQStep.cpp libtool: compile: x86_64-pld-linux-gnux32-g++ -DHAVE_CONFIG_H -I. -I./src/config -I./include/ -I/usr/include -I./src/lexer/ -D_GNU_SOURCE -D_REENTRANT -O2 -fwrapv -pipe -Wformat -Werror=format-security -gdwarf-4 -fno-debug-types-section -fvar-tracking-assignments -g2 -Wp,-D_FORTIFY_SOURCE=2 -fstack-protector-strong --param=ssp-buffer-size=4 -Werror=trampolines -fPIC -mtune=generic -march=x86-64 -gdwarf-4 -fno-debug-types-section -fvar-tracking-assignments -g2 -ftemplate-depth-50 -MT XQStep.lo -MD -MP -MF .deps/XQStep.Tpo -c src/ast/XQStep.cpp -fPIC -DPIC -o .libs/XQStep.o libtool: compile: x86_64-pld-linux-gnux32-g++ -DHAVE_CONFIG_H -I. -I./src/config -I./include/ -I/usr/include -I./src/lexer/ -D_GNU_SOURCE -D_REENTRANT -O2 -fwrapv -pipe -Wformat -Werror=format-security -gdwarf-4 -fno-debug-types-section -fvar-tracking-assignments -g2 -Wp,-D_FORTIFY_SOURCE=2 -fstack-protector-strong --param=ssp-buffer-size=4 -Werror=trampolines -fPIC -mtune=generic -march=x86-64 -gdwarf-4 -fno-debug-types-section -fvar-tracking-assignments -g2 -ftemplate-depth-50 -MT XQStep.lo -MD -MP -MF .deps/XQStep.Tpo -c src/ast/XQStep.cpp -o XQStep.o >/dev/null 2>&1 mv -f .deps/XQStep.Tpo .deps/XQStep.Plo make[1]: Leaving directory '/tmp/B.ache4phw/BUILD/XQilla-2.3.4' make[1]: Entering directory '/tmp/B.ache4phw/BUILD/XQilla-2.3.4' /bin/sh ./libtool --tag=CXX --mode=compile x86_64-pld-linux-gnux32-g++ -DHAVE_CONFIG_H -I. -I./src/config -I./include/ -I/usr/include -I./src/lexer/ -D_GNU_SOURCE -D_REENTRANT -O2 -fwrapv -pipe -Wformat -Werror=format-security -gdwarf-4 -fno-debug-types-section -fvar-tracking-assignments -g2 -Wp,-D_FORTIFY_SOURCE=2 -fstack-protector-strong --param=ssp-buffer-size=4 -Werror=trampolines -fPIC -mtune=generic -march=x86-64 -gdwarf-4 -fno-debug-types-section -fvar-tracking-assignments -g2 -ftemplate-depth-50 -MT XQFunctionCoercion.lo -MD -MP -MF .deps/XQFunctionCoercion.Tpo -c -o XQFunctionCoercion.lo `test -f 'src/ast/XQFunctionCoercion.cpp' || echo './'`src/ast/XQFunctionCoercion.cpp libtool: compile: x86_64-pld-linux-gnux32-g++ -DHAVE_CONFIG_H -I. -I./src/config -I./include/ -I/usr/include -I./src/lexer/ -D_GNU_SOURCE -D_REENTRANT -O2 -fwrapv -pipe -Wformat -Werror=format-security -gdwarf-4 -fno-debug-types-section -fvar-tracking-assignments -g2 -Wp,-D_FORTIFY_SOURCE=2 -fstack-protector-strong --param=ssp-buffer-size=4 -Werror=trampolines -fPIC -mtune=generic -march=x86-64 -gdwarf-4 -fno-debug-types-section -fvar-tracking-assignments -g2 -ftemplate-depth-50 -MT XQFunctionCoercion.lo -MD -MP -MF .deps/XQFunctionCoercion.Tpo -c src/ast/XQFunctionCoercion.cpp -fPIC -DPIC -o .libs/XQFunctionCoercion.o In file included from src/ast/XQFunctionCoercion.cpp:31: ./include/xqilla/utils/XPath2Utils.hpp: In static member function 'static bool XPath2Utils::equals(const XMLCh*, const XMLCh*)': ./include/xqilla/utils/XPath2Utils.hpp:107:25: warning: ISO C++17 does not allow 'register' storage class specifier [-Wregister] 107 | register const XMLCh* psz1 = str1; | ^~~~ ./include/xqilla/utils/XPath2Utils.hpp:108:25: warning: ISO C++17 does not allow 'register' storage class specifier [-Wregister] 108 | register const XMLCh* psz2 = str2; | ^~~~ ./include/xqilla/utils/XPath2Utils.hpp: In static member function 'static int XPath2Utils::compare(const XMLCh*, const XMLCh*)': ./include/xqilla/utils/XPath2Utils.hpp:128:16: warning: ISO C++17 does not allow 'register' storage class specifier [-Wregister] 128 | register int cmp; | ^~~ libtool: compile: x86_64-pld-linux-gnux32-g++ -DHAVE_CONFIG_H -I. -I./src/config -I./include/ -I/usr/include -I./src/lexer/ -D_GNU_SOURCE -D_REENTRANT -O2 -fwrapv -pipe -Wformat -Werror=format-security -gdwarf-4 -fno-debug-types-section -fvar-tracking-assignments -g2 -Wp,-D_FORTIFY_SOURCE=2 -fstack-protector-strong --param=ssp-buffer-size=4 -Werror=trampolines -fPIC -mtune=generic -march=x86-64 -gdwarf-4 -fno-debug-types-section -fvar-tracking-assignments -g2 -ftemplate-depth-50 -MT XQFunctionCoercion.lo -MD -MP -MF .deps/XQFunctionCoercion.Tpo -c src/ast/XQFunctionCoercion.cpp -o XQFunctionCoercion.o >/dev/null 2>&1 mv -f .deps/XQFunctionCoercion.Tpo .deps/XQFunctionCoercion.Plo make[1]: Leaving directory '/tmp/B.ache4phw/BUILD/XQilla-2.3.4' make[1]: Entering directory '/tmp/B.ache4phw/BUILD/XQilla-2.3.4' /bin/sh ./libtool --tag=CXX --mode=compile x86_64-pld-linux-gnux32-g++ -DHAVE_CONFIG_H -I. -I./src/config -I./include/ -I/usr/include -I./src/lexer/ -D_GNU_SOURCE -D_REENTRANT -O2 -fwrapv -pipe -Wformat -Werror=format-security -gdwarf-4 -fno-debug-types-section -fvar-tracking-assignments -g2 -Wp,-D_FORTIFY_SOURCE=2 -fstack-protector-strong --param=ssp-buffer-size=4 -Werror=trampolines -fPIC -mtune=generic -march=x86-64 -gdwarf-4 -fno-debug-types-section -fvar-tracking-assignments -g2 -ftemplate-depth-50 -MT NumericFunction.lo -MD -MP -MF .deps/NumericFunction.Tpo -c -o NumericFunction.lo `test -f 'src/ast/NumericFunction.cpp' || echo './'`src/ast/NumericFunction.cpp libtool: compile: x86_64-pld-linux-gnux32-g++ -DHAVE_CONFIG_H -I. -I./src/config -I./include/ -I/usr/include -I./src/lexer/ -D_GNU_SOURCE -D_REENTRANT -O2 -fwrapv -pipe -Wformat -Werror=format-security -gdwarf-4 -fno-debug-types-section -fvar-tracking-assignments -g2 -Wp,-D_FORTIFY_SOURCE=2 -fstack-protector-strong --param=ssp-buffer-size=4 -Werror=trampolines -fPIC -mtune=generic -march=x86-64 -gdwarf-4 -fno-debug-types-section -fvar-tracking-assignments -g2 -ftemplate-depth-50 -MT NumericFunction.lo -MD -MP -MF .deps/NumericFunction.Tpo -c src/ast/NumericFunction.cpp -fPIC -DPIC -o .libs/NumericFunction.o libtool: compile: x86_64-pld-linux-gnux32-g++ -DHAVE_CONFIG_H -I. -I./src/config -I./include/ -I/usr/include -I./src/lexer/ -D_GNU_SOURCE -D_REENTRANT -O2 -fwrapv -pipe -Wformat -Werror=format-security -gdwarf-4 -fno-debug-types-section -fvar-tracking-assignments -g2 -Wp,-D_FORTIFY_SOURCE=2 -fstack-protector-strong --param=ssp-buffer-size=4 -Werror=trampolines -fPIC -mtune=generic -march=x86-64 -gdwarf-4 -fno-debug-types-section -fvar-tracking-assignments -g2 -ftemplate-depth-50 -MT NumericFunction.lo -MD -MP -MF .deps/NumericFunction.Tpo -c src/ast/NumericFunction.cpp -o NumericFunction.o >/dev/null 2>&1 mv -f .deps/NumericFunction.Tpo .deps/NumericFunction.Plo make[1]: Leaving directory '/tmp/B.ache4phw/BUILD/XQilla-2.3.4' make[1]: Entering directory '/tmp/B.ache4phw/BUILD/XQilla-2.3.4' /bin/sh ./libtool --tag=CXX --mode=compile x86_64-pld-linux-gnux32-g++ -DHAVE_CONFIG_H -I. -I./src/config -I./include/ -I/usr/include -I./src/lexer/ -D_GNU_SOURCE -D_REENTRANT -O2 -fwrapv -pipe -Wformat -Werror=format-security -gdwarf-4 -fno-debug-types-section -fvar-tracking-assignments -g2 -Wp,-D_FORTIFY_SOURCE=2 -fstack-protector-strong --param=ssp-buffer-size=4 -Werror=trampolines -fPIC -mtune=generic -march=x86-64 -gdwarf-4 -fno-debug-types-section -fvar-tracking-assignments -g2 -ftemplate-depth-50 -MT StaticAnalysis.lo -MD -MP -MF .deps/StaticAnalysis.Tpo -c -o StaticAnalysis.lo `test -f 'src/ast/StaticAnalysis.cpp' || echo './'`src/ast/StaticAnalysis.cpp libtool: compile: x86_64-pld-linux-gnux32-g++ -DHAVE_CONFIG_H -I. -I./src/config -I./include/ -I/usr/include -I./src/lexer/ -D_GNU_SOURCE -D_REENTRANT -O2 -fwrapv -pipe -Wformat -Werror=format-security -gdwarf-4 -fno-debug-types-section -fvar-tracking-assignments -g2 -Wp,-D_FORTIFY_SOURCE=2 -fstack-protector-strong --param=ssp-buffer-size=4 -Werror=trampolines -fPIC -mtune=generic -march=x86-64 -gdwarf-4 -fno-debug-types-section -fvar-tracking-assignments -g2 -ftemplate-depth-50 -MT StaticAnalysis.lo -MD -MP -MF .deps/StaticAnalysis.Tpo -c src/ast/StaticAnalysis.cpp -fPIC -DPIC -o .libs/StaticAnalysis.o libtool: compile: x86_64-pld-linux-gnux32-g++ -DHAVE_CONFIG_H -I. -I./src/config -I./include/ -I/usr/include -I./src/lexer/ -D_GNU_SOURCE -D_REENTRANT -O2 -fwrapv -pipe -Wformat -Werror=format-security -gdwarf-4 -fno-debug-types-section -fvar-tracking-assignments -g2 -Wp,-D_FORTIFY_SOURCE=2 -fstack-protector-strong --param=ssp-buffer-size=4 -Werror=trampolines -fPIC -mtune=generic -march=x86-64 -gdwarf-4 -fno-debug-types-section -fvar-tracking-assignments -g2 -ftemplate-depth-50 -MT StaticAnalysis.lo -MD -MP -MF .deps/StaticAnalysis.Tpo -c src/ast/StaticAnalysis.cpp -o StaticAnalysis.o >/dev/null 2>&1 mv -f .deps/StaticAnalysis.Tpo .deps/StaticAnalysis.Plo make[1]: Leaving directory '/tmp/B.ache4phw/BUILD/XQilla-2.3.4' make[1]: Entering directory '/tmp/B.ache4phw/BUILD/XQilla-2.3.4' /bin/sh ./libtool --tag=CXX --mode=compile x86_64-pld-linux-gnux32-g++ -DHAVE_CONFIG_H -I. -I./src/config -I./include/ -I/usr/include -I./src/lexer/ -D_GNU_SOURCE -D_REENTRANT -O2 -fwrapv -pipe -Wformat -Werror=format-security -gdwarf-4 -fno-debug-types-section -fvar-tracking-assignments -g2 -Wp,-D_FORTIFY_SOURCE=2 -fstack-protector-strong --param=ssp-buffer-size=4 -Werror=trampolines -fPIC -mtune=generic -march=x86-64 -gdwarf-4 -fno-debug-types-section -fvar-tracking-assignments -g2 -ftemplate-depth-50 -MT XQDocumentConstructor.lo -MD -MP -MF .deps/XQDocumentConstructor.Tpo -c -o XQDocumentConstructor.lo `test -f 'src/ast/XQDocumentConstructor.cpp' || echo './'`src/ast/XQDocumentConstructor.cpp libtool: compile: x86_64-pld-linux-gnux32-g++ -DHAVE_CONFIG_H -I. -I./src/config -I./include/ -I/usr/include -I./src/lexer/ -D_GNU_SOURCE -D_REENTRANT -O2 -fwrapv -pipe -Wformat -Werror=format-security -gdwarf-4 -fno-debug-types-section -fvar-tracking-assignments -g2 -Wp,-D_FORTIFY_SOURCE=2 -fstack-protector-strong --param=ssp-buffer-size=4 -Werror=trampolines -fPIC -mtune=generic -march=x86-64 -gdwarf-4 -fno-debug-types-section -fvar-tracking-assignments -g2 -ftemplate-depth-50 -MT XQDocumentConstructor.lo -MD -MP -MF .deps/XQDocumentConstructor.Tpo -c src/ast/XQDocumentConstructor.cpp -fPIC -DPIC -o .libs/XQDocumentConstructor.o In file included from src/ast/XQDocumentConstructor.cpp:26: ./include/xqilla/utils/XPath2Utils.hpp: In static member function 'static bool XPath2Utils::equals(const XMLCh*, const XMLCh*)': ./include/xqilla/utils/XPath2Utils.hpp:107:25: warning: ISO C++17 does not allow 'register' storage class specifier [-Wregister] 107 | register const XMLCh* psz1 = str1; | ^~~~ ./include/xqilla/utils/XPath2Utils.hpp:108:25: warning: ISO C++17 does not allow 'register' storage class specifier [-Wregister] 108 | register const XMLCh* psz2 = str2; | ^~~~ ./include/xqilla/utils/XPath2Utils.hpp: In static member function 'static int XPath2Utils::compare(const XMLCh*, const XMLCh*)': ./include/xqilla/utils/XPath2Utils.hpp:128:16: warning: ISO C++17 does not allow 'register' storage class specifier [-Wregister] 128 | register int cmp; | ^~~ libtool: compile: x86_64-pld-linux-gnux32-g++ -DHAVE_CONFIG_H -I. -I./src/config -I./include/ -I/usr/include -I./src/lexer/ -D_GNU_SOURCE -D_REENTRANT -O2 -fwrapv -pipe -Wformat -Werror=format-security -gdwarf-4 -fno-debug-types-section -fvar-tracking-assignments -g2 -Wp,-D_FORTIFY_SOURCE=2 -fstack-protector-strong --param=ssp-buffer-size=4 -Werror=trampolines -fPIC -mtune=generic -march=x86-64 -gdwarf-4 -fno-debug-types-section -fvar-tracking-assignments -g2 -ftemplate-depth-50 -MT XQDocumentConstructor.lo -MD -MP -MF .deps/XQDocumentConstructor.Tpo -c src/ast/XQDocumentConstructor.cpp -o XQDocumentConstructor.o >/dev/null 2>&1 mv -f .deps/XQDocumentConstructor.Tpo .deps/XQDocumentConstructor.Plo make[1]: Leaving directory '/tmp/B.ache4phw/BUILD/XQilla-2.3.4' make[1]: Entering directory '/tmp/B.ache4phw/BUILD/XQilla-2.3.4' /bin/sh ./libtool --tag=CXX --mode=compile x86_64-pld-linux-gnux32-g++ -DHAVE_CONFIG_H -I. -I./src/config -I./include/ -I/usr/include -I./src/lexer/ -D_GNU_SOURCE -D_REENTRANT -O2 -fwrapv -pipe -Wformat -Werror=format-security -gdwarf-4 -fno-debug-types-section -fvar-tracking-assignments -g2 -Wp,-D_FORTIFY_SOURCE=2 -fstack-protector-strong --param=ssp-buffer-size=4 -Werror=trampolines -fPIC -mtune=generic -march=x86-64 -gdwarf-4 -fno-debug-types-section -fvar-tracking-assignments -g2 -ftemplate-depth-50 -MT XQAttributeConstructor.lo -MD -MP -MF .deps/XQAttributeConstructor.Tpo -c -o XQAttributeConstructor.lo `test -f 'src/ast/XQAttributeConstructor.cpp' || echo './'`src/ast/XQAttributeConstructor.cpp libtool: compile: x86_64-pld-linux-gnux32-g++ -DHAVE_CONFIG_H -I. -I./src/config -I./include/ -I/usr/include -I./src/lexer/ -D_GNU_SOURCE -D_REENTRANT -O2 -fwrapv -pipe -Wformat -Werror=format-security -gdwarf-4 -fno-debug-types-section -fvar-tracking-assignments -g2 -Wp,-D_FORTIFY_SOURCE=2 -fstack-protector-strong --param=ssp-buffer-size=4 -Werror=trampolines -fPIC -mtune=generic -march=x86-64 -gdwarf-4 -fno-debug-types-section -fvar-tracking-assignments -g2 -ftemplate-depth-50 -MT XQAttributeConstructor.lo -MD -MP -MF .deps/XQAttributeConstructor.Tpo -c src/ast/XQAttributeConstructor.cpp -fPIC -DPIC -o .libs/XQAttributeConstructor.o In file included from src/ast/XQAttributeConstructor.cpp:29: ./include/xqilla/utils/XPath2Utils.hpp: In static member function 'static bool XPath2Utils::equals(const XMLCh*, const XMLCh*)': ./include/xqilla/utils/XPath2Utils.hpp:107:25: warning: ISO C++17 does not allow 'register' storage class specifier [-Wregister] 107 | register const XMLCh* psz1 = str1; | ^~~~ ./include/xqilla/utils/XPath2Utils.hpp:108:25: warning: ISO C++17 does not allow 'register' storage class specifier [-Wregister] 108 | register const XMLCh* psz2 = str2; | ^~~~ ./include/xqilla/utils/XPath2Utils.hpp: In static member function 'static int XPath2Utils::compare(const XMLCh*, const XMLCh*)': ./include/xqilla/utils/XPath2Utils.hpp:128:16: warning: ISO C++17 does not allow 'register' storage class specifier [-Wregister] 128 | register int cmp; | ^~~ libtool: compile: x86_64-pld-linux-gnux32-g++ -DHAVE_CONFIG_H -I. -I./src/config -I./include/ -I/usr/include -I./src/lexer/ -D_GNU_SOURCE -D_REENTRANT -O2 -fwrapv -pipe -Wformat -Werror=format-security -gdwarf-4 -fno-debug-types-section -fvar-tracking-assignments -g2 -Wp,-D_FORTIFY_SOURCE=2 -fstack-protector-strong --param=ssp-buffer-size=4 -Werror=trampolines -fPIC -mtune=generic -march=x86-64 -gdwarf-4 -fno-debug-types-section -fvar-tracking-assignments -g2 -ftemplate-depth-50 -MT XQAttributeConstructor.lo -MD -MP -MF .deps/XQAttributeConstructor.Tpo -c src/ast/XQAttributeConstructor.cpp -o XQAttributeConstructor.o >/dev/null 2>&1 mv -f .deps/XQAttributeConstructor.Tpo .deps/XQAttributeConstructor.Plo make[1]: Leaving directory '/tmp/B.ache4phw/BUILD/XQilla-2.3.4' make[1]: Entering directory '/tmp/B.ache4phw/BUILD/XQilla-2.3.4' /bin/sh ./libtool --tag=CXX --mode=compile x86_64-pld-linux-gnux32-g++ -DHAVE_CONFIG_H -I. -I./src/config -I./include/ -I/usr/include -I./src/lexer/ -D_GNU_SOURCE -D_REENTRANT -O2 -fwrapv -pipe -Wformat -Werror=format-security -gdwarf-4 -fno-debug-types-section -fvar-tracking-assignments -g2 -Wp,-D_FORTIFY_SOURCE=2 -fstack-protector-strong --param=ssp-buffer-size=4 -Werror=trampolines -fPIC -mtune=generic -march=x86-64 -gdwarf-4 -fno-debug-types-section -fvar-tracking-assignments -g2 -ftemplate-depth-50 -MT XQNamespaceConstructor.lo -MD -MP -MF .deps/XQNamespaceConstructor.Tpo -c -o XQNamespaceConstructor.lo `test -f 'src/ast/XQNamespaceConstructor.cpp' || echo './'`src/ast/XQNamespaceConstructor.cpp libtool: compile: x86_64-pld-linux-gnux32-g++ -DHAVE_CONFIG_H -I. -I./src/config -I./include/ -I/usr/include -I./src/lexer/ -D_GNU_SOURCE -D_REENTRANT -O2 -fwrapv -pipe -Wformat -Werror=format-security -gdwarf-4 -fno-debug-types-section -fvar-tracking-assignments -g2 -Wp,-D_FORTIFY_SOURCE=2 -fstack-protector-strong --param=ssp-buffer-size=4 -Werror=trampolines -fPIC -mtune=generic -march=x86-64 -gdwarf-4 -fno-debug-types-section -fvar-tracking-assignments -g2 -ftemplate-depth-50 -MT XQNamespaceConstructor.lo -MD -MP -MF .deps/XQNamespaceConstructor.Tpo -c src/ast/XQNamespaceConstructor.cpp -fPIC -DPIC -o .libs/XQNamespaceConstructor.o In file included from src/ast/XQNamespaceConstructor.cpp:29: ./include/xqilla/utils/XPath2Utils.hpp: In static member function 'static bool XPath2Utils::equals(const XMLCh*, const XMLCh*)': ./include/xqilla/utils/XPath2Utils.hpp:107:25: warning: ISO C++17 does not allow 'register' storage class specifier [-Wregister] 107 | register const XMLCh* psz1 = str1; | ^~~~ ./include/xqilla/utils/XPath2Utils.hpp:108:25: warning: ISO C++17 does not allow 'register' storage class specifier [-Wregister] 108 | register const XMLCh* psz2 = str2; | ^~~~ ./include/xqilla/utils/XPath2Utils.hpp: In static member function 'static int XPath2Utils::compare(const XMLCh*, const XMLCh*)': ./include/xqilla/utils/XPath2Utils.hpp:128:16: warning: ISO C++17 does not allow 'register' storage class specifier [-Wregister] 128 | register int cmp; | ^~~ libtool: compile: x86_64-pld-linux-gnux32-g++ -DHAVE_CONFIG_H -I. -I./src/config -I./include/ -I/usr/include -I./src/lexer/ -D_GNU_SOURCE -D_REENTRANT -O2 -fwrapv -pipe -Wformat -Werror=format-security -gdwarf-4 -fno-debug-types-section -fvar-tracking-assignments -g2 -Wp,-D_FORTIFY_SOURCE=2 -fstack-protector-strong --param=ssp-buffer-size=4 -Werror=trampolines -fPIC -mtune=generic -march=x86-64 -gdwarf-4 -fno-debug-types-section -fvar-tracking-assignments -g2 -ftemplate-depth-50 -MT XQNamespaceConstructor.lo -MD -MP -MF .deps/XQNamespaceConstructor.Tpo -c src/ast/XQNamespaceConstructor.cpp -o XQNamespaceConstructor.o >/dev/null 2>&1 mv -f .deps/XQNamespaceConstructor.Tpo .deps/XQNamespaceConstructor.Plo make[1]: Leaving directory '/tmp/B.ache4phw/BUILD/XQilla-2.3.4' make[1]: Entering directory '/tmp/B.ache4phw/BUILD/XQilla-2.3.4' /bin/sh ./libtool --tag=CXX --mode=compile x86_64-pld-linux-gnux32-g++ -DHAVE_CONFIG_H -I. -I./src/config -I./include/ -I/usr/include -I./src/lexer/ -D_GNU_SOURCE -D_REENTRANT -O2 -fwrapv -pipe -Wformat -Werror=format-security -gdwarf-4 -fno-debug-types-section -fvar-tracking-assignments -g2 -Wp,-D_FORTIFY_SOURCE=2 -fstack-protector-strong --param=ssp-buffer-size=4 -Werror=trampolines -fPIC -mtune=generic -march=x86-64 -gdwarf-4 -fno-debug-types-section -fvar-tracking-assignments -g2 -ftemplate-depth-50 -MT XQDOMConstructor.lo -MD -MP -MF .deps/XQDOMConstructor.Tpo -c -o XQDOMConstructor.lo `test -f 'src/ast/XQDOMConstructor.cpp' || echo './'`src/ast/XQDOMConstructor.cpp libtool: compile: x86_64-pld-linux-gnux32-g++ -DHAVE_CONFIG_H -I. -I./src/config -I./include/ -I/usr/include -I./src/lexer/ -D_GNU_SOURCE -D_REENTRANT -O2 -fwrapv -pipe -Wformat -Werror=format-security -gdwarf-4 -fno-debug-types-section -fvar-tracking-assignments -g2 -Wp,-D_FORTIFY_SOURCE=2 -fstack-protector-strong --param=ssp-buffer-size=4 -Werror=trampolines -fPIC -mtune=generic -march=x86-64 -gdwarf-4 -fno-debug-types-section -fvar-tracking-assignments -g2 -ftemplate-depth-50 -MT XQDOMConstructor.lo -MD -MP -MF .deps/XQDOMConstructor.Tpo -c src/ast/XQDOMConstructor.cpp -fPIC -DPIC -o .libs/XQDOMConstructor.o In file included from src/ast/XQDOMConstructor.cpp:30: ./include/xqilla/utils/XPath2Utils.hpp: In static member function 'static bool XPath2Utils::equals(const XMLCh*, const XMLCh*)': ./include/xqilla/utils/XPath2Utils.hpp:107:25: warning: ISO C++17 does not allow 'register' storage class specifier [-Wregister] 107 | register const XMLCh* psz1 = str1; | ^~~~ ./include/xqilla/utils/XPath2Utils.hpp:108:25: warning: ISO C++17 does not allow 'register' storage class specifier [-Wregister] 108 | register const XMLCh* psz2 = str2; | ^~~~ ./include/xqilla/utils/XPath2Utils.hpp: In static member function 'static int XPath2Utils::compare(const XMLCh*, const XMLCh*)': ./include/xqilla/utils/XPath2Utils.hpp:128:16: warning: ISO C++17 does not allow 'register' storage class specifier [-Wregister] 128 | register int cmp; | ^~~ libtool: compile: x86_64-pld-linux-gnux32-g++ -DHAVE_CONFIG_H -I. -I./src/config -I./include/ -I/usr/include -I./src/lexer/ -D_GNU_SOURCE -D_REENTRANT -O2 -fwrapv -pipe -Wformat -Werror=format-security -gdwarf-4 -fno-debug-types-section -fvar-tracking-assignments -g2 -Wp,-D_FORTIFY_SOURCE=2 -fstack-protector-strong --param=ssp-buffer-size=4 -Werror=trampolines -fPIC -mtune=generic -march=x86-64 -gdwarf-4 -fno-debug-types-section -fvar-tracking-assignments -g2 -ftemplate-depth-50 -MT XQDOMConstructor.lo -MD -MP -MF .deps/XQDOMConstructor.Tpo -c src/ast/XQDOMConstructor.cpp -o XQDOMConstructor.o >/dev/null 2>&1 mv -f .deps/XQDOMConstructor.Tpo .deps/XQDOMConstructor.Plo make[1]: Leaving directory '/tmp/B.ache4phw/BUILD/XQilla-2.3.4' make[1]: Entering directory '/tmp/B.ache4phw/BUILD/XQilla-2.3.4' /bin/sh ./libtool --tag=CXX --mode=compile x86_64-pld-linux-gnux32-g++ -DHAVE_CONFIG_H -I. -I./src/config -I./include/ -I/usr/include -I./src/lexer/ -D_GNU_SOURCE -D_REENTRANT -O2 -fwrapv -pipe -Wformat -Werror=format-security -gdwarf-4 -fno-debug-types-section -fvar-tracking-assignments -g2 -Wp,-D_FORTIFY_SOURCE=2 -fstack-protector-strong --param=ssp-buffer-size=4 -Werror=trampolines -fPIC -mtune=generic -march=x86-64 -gdwarf-4 -fno-debug-types-section -fvar-tracking-assignments -g2 -ftemplate-depth-50 -MT XQPIConstructor.lo -MD -MP -MF .deps/XQPIConstructor.Tpo -c -o XQPIConstructor.lo `test -f 'src/ast/XQPIConstructor.cpp' || echo './'`src/ast/XQPIConstructor.cpp libtool: compile: x86_64-pld-linux-gnux32-g++ -DHAVE_CONFIG_H -I. -I./src/config -I./include/ -I/usr/include -I./src/lexer/ -D_GNU_SOURCE -D_REENTRANT -O2 -fwrapv -pipe -Wformat -Werror=format-security -gdwarf-4 -fno-debug-types-section -fvar-tracking-assignments -g2 -Wp,-D_FORTIFY_SOURCE=2 -fstack-protector-strong --param=ssp-buffer-size=4 -Werror=trampolines -fPIC -mtune=generic -march=x86-64 -gdwarf-4 -fno-debug-types-section -fvar-tracking-assignments -g2 -ftemplate-depth-50 -MT XQPIConstructor.lo -MD -MP -MF .deps/XQPIConstructor.Tpo -c src/ast/XQPIConstructor.cpp -fPIC -DPIC -o .libs/XQPIConstructor.o libtool: compile: x86_64-pld-linux-gnux32-g++ -DHAVE_CONFIG_H -I. -I./src/config -I./include/ -I/usr/include -I./src/lexer/ -D_GNU_SOURCE -D_REENTRANT -O2 -fwrapv -pipe -Wformat -Werror=format-security -gdwarf-4 -fno-debug-types-section -fvar-tracking-assignments -g2 -Wp,-D_FORTIFY_SOURCE=2 -fstack-protector-strong --param=ssp-buffer-size=4 -Werror=trampolines -fPIC -mtune=generic -march=x86-64 -gdwarf-4 -fno-debug-types-section -fvar-tracking-assignments -g2 -ftemplate-depth-50 -MT XQPIConstructor.lo -MD -MP -MF .deps/XQPIConstructor.Tpo -c src/ast/XQPIConstructor.cpp -o XQPIConstructor.o >/dev/null 2>&1 mv -f .deps/XQPIConstructor.Tpo .deps/XQPIConstructor.Plo make[1]: Leaving directory '/tmp/B.ache4phw/BUILD/XQilla-2.3.4' make[1]: Entering directory '/tmp/B.ache4phw/BUILD/XQilla-2.3.4' /bin/sh ./libtool --tag=CXX --mode=compile x86_64-pld-linux-gnux32-g++ -DHAVE_CONFIG_H -I. -I./src/config -I./include/ -I/usr/include -I./src/lexer/ -D_GNU_SOURCE -D_REENTRANT -O2 -fwrapv -pipe -Wformat -Werror=format-security -gdwarf-4 -fno-debug-types-section -fvar-tracking-assignments -g2 -Wp,-D_FORTIFY_SOURCE=2 -fstack-protector-strong --param=ssp-buffer-size=4 -Werror=trampolines -fPIC -mtune=generic -march=x86-64 -gdwarf-4 -fno-debug-types-section -fvar-tracking-assignments -g2 -ftemplate-depth-50 -MT XQCommentConstructor.lo -MD -MP -MF .deps/XQCommentConstructor.Tpo -c -o XQCommentConstructor.lo `test -f 'src/ast/XQCommentConstructor.cpp' || echo './'`src/ast/XQCommentConstructor.cpp libtool: compile: x86_64-pld-linux-gnux32-g++ -DHAVE_CONFIG_H -I. -I./src/config -I./include/ -I/usr/include -I./src/lexer/ -D_GNU_SOURCE -D_REENTRANT -O2 -fwrapv -pipe -Wformat -Werror=format-security -gdwarf-4 -fno-debug-types-section -fvar-tracking-assignments -g2 -Wp,-D_FORTIFY_SOURCE=2 -fstack-protector-strong --param=ssp-buffer-size=4 -Werror=trampolines -fPIC -mtune=generic -march=x86-64 -gdwarf-4 -fno-debug-types-section -fvar-tracking-assignments -g2 -ftemplate-depth-50 -MT XQCommentConstructor.lo -MD -MP -MF .deps/XQCommentConstructor.Tpo -c src/ast/XQCommentConstructor.cpp -fPIC -DPIC -o .libs/XQCommentConstructor.o libtool: compile: x86_64-pld-linux-gnux32-g++ -DHAVE_CONFIG_H -I. -I./src/config -I./include/ -I/usr/include -I./src/lexer/ -D_GNU_SOURCE -D_REENTRANT -O2 -fwrapv -pipe -Wformat -Werror=format-security -gdwarf-4 -fno-debug-types-section -fvar-tracking-assignments -g2 -Wp,-D_FORTIFY_SOURCE=2 -fstack-protector-strong --param=ssp-buffer-size=4 -Werror=trampolines -fPIC -mtune=generic -march=x86-64 -gdwarf-4 -fno-debug-types-section -fvar-tracking-assignments -g2 -ftemplate-depth-50 -MT XQCommentConstructor.lo -MD -MP -MF .deps/XQCommentConstructor.Tpo -c src/ast/XQCommentConstructor.cpp -o XQCommentConstructor.o >/dev/null 2>&1 mv -f .deps/XQCommentConstructor.Tpo .deps/XQCommentConstructor.Plo make[1]: Leaving directory '/tmp/B.ache4phw/BUILD/XQilla-2.3.4' make[1]: Entering directory '/tmp/B.ache4phw/BUILD/XQilla-2.3.4' /bin/sh ./libtool --tag=CXX --mode=compile x86_64-pld-linux-gnux32-g++ -DHAVE_CONFIG_H -I. -I./src/config -I./include/ -I/usr/include -I./src/lexer/ -D_GNU_SOURCE -D_REENTRANT -O2 -fwrapv -pipe -Wformat -Werror=format-security -gdwarf-4 -fno-debug-types-section -fvar-tracking-assignments -g2 -Wp,-D_FORTIFY_SOURCE=2 -fstack-protector-strong --param=ssp-buffer-size=4 -Werror=trampolines -fPIC -mtune=generic -march=x86-64 -gdwarf-4 -fno-debug-types-section -fvar-tracking-assignments -g2 -ftemplate-depth-50 -MT StaticType.lo -MD -MP -MF .deps/StaticType.Tpo -c -o StaticType.lo `test -f 'src/ast/StaticType.cpp' || echo './'`src/ast/StaticType.cpp libtool: compile: x86_64-pld-linux-gnux32-g++ -DHAVE_CONFIG_H -I. -I./src/config -I./include/ -I/usr/include -I./src/lexer/ -D_GNU_SOURCE -D_REENTRANT -O2 -fwrapv -pipe -Wformat -Werror=format-security -gdwarf-4 -fno-debug-types-section -fvar-tracking-assignments -g2 -Wp,-D_FORTIFY_SOURCE=2 -fstack-protector-strong --param=ssp-buffer-size=4 -Werror=trampolines -fPIC -mtune=generic -march=x86-64 -gdwarf-4 -fno-debug-types-section -fvar-tracking-assignments -g2 -ftemplate-depth-50 -MT StaticType.lo -MD -MP -MF .deps/StaticType.Tpo -c src/ast/StaticType.cpp -fPIC -DPIC -o .libs/StaticType.o In file included from src/ast/StaticType.cpp:27: ./include/xqilla/utils/XPath2Utils.hpp: In static member function 'static bool XPath2Utils::equals(const XMLCh*, const XMLCh*)': ./include/xqilla/utils/XPath2Utils.hpp:107:25: warning: ISO C++17 does not allow 'register' storage class specifier [-Wregister] 107 | register const XMLCh* psz1 = str1; | ^~~~ ./include/xqilla/utils/XPath2Utils.hpp:108:25: warning: ISO C++17 does not allow 'register' storage class specifier [-Wregister] 108 | register const XMLCh* psz2 = str2; | ^~~~ ./include/xqilla/utils/XPath2Utils.hpp: In static member function 'static int XPath2Utils::compare(const XMLCh*, const XMLCh*)': ./include/xqilla/utils/XPath2Utils.hpp:128:16: warning: ISO C++17 does not allow 'register' storage class specifier [-Wregister] 128 | register int cmp; | ^~~ libtool: compile: x86_64-pld-linux-gnux32-g++ -DHAVE_CONFIG_H -I. -I./src/config -I./include/ -I/usr/include -I./src/lexer/ -D_GNU_SOURCE -D_REENTRANT -O2 -fwrapv -pipe -Wformat -Werror=format-security -gdwarf-4 -fno-debug-types-section -fvar-tracking-assignments -g2 -Wp,-D_FORTIFY_SOURCE=2 -fstack-protector-strong --param=ssp-buffer-size=4 -Werror=trampolines -fPIC -mtune=generic -march=x86-64 -gdwarf-4 -fno-debug-types-section -fvar-tracking-assignments -g2 -ftemplate-depth-50 -MT StaticType.lo -MD -MP -MF .deps/StaticType.Tpo -c src/ast/StaticType.cpp -o StaticType.o >/dev/null 2>&1 mv -f .deps/StaticType.Tpo .deps/StaticType.Plo make[1]: Leaving directory '/tmp/B.ache4phw/BUILD/XQilla-2.3.4' make[1]: Entering directory '/tmp/B.ache4phw/BUILD/XQilla-2.3.4' /bin/sh ./libtool --tag=CXX --mode=compile x86_64-pld-linux-gnux32-g++ -DHAVE_CONFIG_H -I. -I./src/config -I./include/ -I/usr/include -I./src/lexer/ -D_GNU_SOURCE -D_REENTRANT -O2 -fwrapv -pipe -Wformat -Werror=format-security -gdwarf-4 -fno-debug-types-section -fvar-tracking-assignments -g2 -Wp,-D_FORTIFY_SOURCE=2 -fstack-protector-strong --param=ssp-buffer-size=4 -Werror=trampolines -fPIC -mtune=generic -march=x86-64 -gdwarf-4 -fno-debug-types-section -fvar-tracking-assignments -g2 -ftemplate-depth-50 -MT XQFunctionCall.lo -MD -MP -MF .deps/XQFunctionCall.Tpo -c -o XQFunctionCall.lo `test -f 'src/ast/XQFunctionCall.cpp' || echo './'`src/ast/XQFunctionCall.cpp libtool: compile: x86_64-pld-linux-gnux32-g++ -DHAVE_CONFIG_H -I. -I./src/config -I./include/ -I/usr/include -I./src/lexer/ -D_GNU_SOURCE -D_REENTRANT -O2 -fwrapv -pipe -Wformat -Werror=format-security -gdwarf-4 -fno-debug-types-section -fvar-tracking-assignments -g2 -Wp,-D_FORTIFY_SOURCE=2 -fstack-protector-strong --param=ssp-buffer-size=4 -Werror=trampolines -fPIC -mtune=generic -march=x86-64 -gdwarf-4 -fno-debug-types-section -fvar-tracking-assignments -g2 -ftemplate-depth-50 -MT XQFunctionCall.lo -MD -MP -MF .deps/XQFunctionCall.Tpo -c src/ast/XQFunctionCall.cpp -fPIC -DPIC -o .libs/XQFunctionCall.o In file included from src/ast/XQFunctionCall.cpp:25: ./include/xqilla/utils/XPath2Utils.hpp: In static member function 'static bool XPath2Utils::equals(const XMLCh*, const XMLCh*)': ./include/xqilla/utils/XPath2Utils.hpp:107:25: warning: ISO C++17 does not allow 'register' storage class specifier [-Wregister] 107 | register const XMLCh* psz1 = str1; | ^~~~ ./include/xqilla/utils/XPath2Utils.hpp:108:25: warning: ISO C++17 does not allow 'register' storage class specifier [-Wregister] 108 | register const XMLCh* psz2 = str2; | ^~~~ ./include/xqilla/utils/XPath2Utils.hpp: In static member function 'static int XPath2Utils::compare(const XMLCh*, const XMLCh*)': ./include/xqilla/utils/XPath2Utils.hpp:128:16: warning: ISO C++17 does not allow 'register' storage class specifier [-Wregister] 128 | register int cmp; | ^~~ libtool: compile: x86_64-pld-linux-gnux32-g++ -DHAVE_CONFIG_H -I. -I./src/config -I./include/ -I/usr/include -I./src/lexer/ -D_GNU_SOURCE -D_REENTRANT -O2 -fwrapv -pipe -Wformat -Werror=format-security -gdwarf-4 -fno-debug-types-section -fvar-tracking-assignments -g2 -Wp,-D_FORTIFY_SOURCE=2 -fstack-protector-strong --param=ssp-buffer-size=4 -Werror=trampolines -fPIC -mtune=generic -march=x86-64 -gdwarf-4 -fno-debug-types-section -fvar-tracking-assignments -g2 -ftemplate-depth-50 -MT XQFunctionCall.lo -MD -MP -MF .deps/XQFunctionCall.Tpo -c src/ast/XQFunctionCall.cpp -o XQFunctionCall.o >/dev/null 2>&1 mv -f .deps/XQFunctionCall.Tpo .deps/XQFunctionCall.Plo make[1]: Leaving directory '/tmp/B.ache4phw/BUILD/XQilla-2.3.4' make[1]: Entering directory '/tmp/B.ache4phw/BUILD/XQilla-2.3.4' /bin/sh ./libtool --tag=CXX --mode=compile x86_64-pld-linux-gnux32-g++ -DHAVE_CONFIG_H -I. -I./src/config -I./include/ -I/usr/include -I./src/lexer/ -D_GNU_SOURCE -D_REENTRANT -O2 -fwrapv -pipe -Wformat -Werror=format-security -gdwarf-4 -fno-debug-types-section -fvar-tracking-assignments -g2 -Wp,-D_FORTIFY_SOURCE=2 -fstack-protector-strong --param=ssp-buffer-size=4 -Werror=trampolines -fPIC -mtune=generic -march=x86-64 -gdwarf-4 -fno-debug-types-section -fvar-tracking-assignments -g2 -ftemplate-depth-50 -MT XQTextConstructor.lo -MD -MP -MF .deps/XQTextConstructor.Tpo -c -o XQTextConstructor.lo `test -f 'src/ast/XQTextConstructor.cpp' || echo './'`src/ast/XQTextConstructor.cpp libtool: compile: x86_64-pld-linux-gnux32-g++ -DHAVE_CONFIG_H -I. -I./src/config -I./include/ -I/usr/include -I./src/lexer/ -D_GNU_SOURCE -D_REENTRANT -O2 -fwrapv -pipe -Wformat -Werror=format-security -gdwarf-4 -fno-debug-types-section -fvar-tracking-assignments -g2 -Wp,-D_FORTIFY_SOURCE=2 -fstack-protector-strong --param=ssp-buffer-size=4 -Werror=trampolines -fPIC -mtune=generic -march=x86-64 -gdwarf-4 -fno-debug-types-section -fvar-tracking-assignments -g2 -ftemplate-depth-50 -MT XQTextConstructor.lo -MD -MP -MF .deps/XQTextConstructor.Tpo -c src/ast/XQTextConstructor.cpp -fPIC -DPIC -o .libs/XQTextConstructor.o libtool: compile: x86_64-pld-linux-gnux32-g++ -DHAVE_CONFIG_H -I. -I./src/config -I./include/ -I/usr/include -I./src/lexer/ -D_GNU_SOURCE -D_REENTRANT -O2 -fwrapv -pipe -Wformat -Werror=format-security -gdwarf-4 -fno-debug-types-section -fvar-tracking-assignments -g2 -Wp,-D_FORTIFY_SOURCE=2 -fstack-protector-strong --param=ssp-buffer-size=4 -Werror=trampolines -fPIC -mtune=generic -march=x86-64 -gdwarf-4 -fno-debug-types-section -fvar-tracking-assignments -g2 -ftemplate-depth-50 -MT XQTextConstructor.lo -MD -MP -MF .deps/XQTextConstructor.Tpo -c src/ast/XQTextConstructor.cpp -o XQTextConstructor.o >/dev/null 2>&1 mv -f .deps/XQTextConstructor.Tpo .deps/XQTextConstructor.Plo make[1]: Leaving directory '/tmp/B.ache4phw/BUILD/XQilla-2.3.4' make[1]: Entering directory '/tmp/B.ache4phw/BUILD/XQilla-2.3.4' /bin/sh ./libtool --tag=CXX --mode=compile x86_64-pld-linux-gnux32-g++ -DHAVE_CONFIG_H -I. -I./src/config -I./include/ -I/usr/include -I./src/lexer/ -D_GNU_SOURCE -D_REENTRANT -O2 -fwrapv -pipe -Wformat -Werror=format-security -gdwarf-4 -fno-debug-types-section -fvar-tracking-assignments -g2 -Wp,-D_FORTIFY_SOURCE=2 -fstack-protector-strong --param=ssp-buffer-size=4 -Werror=trampolines -fPIC -mtune=generic -march=x86-64 -gdwarf-4 -fno-debug-types-section -fvar-tracking-assignments -g2 -ftemplate-depth-50 -MT XQFunctionConversion.lo -MD -MP -MF .deps/XQFunctionConversion.Tpo -c -o XQFunctionConversion.lo `test -f 'src/ast/XQFunctionConversion.cpp' || echo './'`src/ast/XQFunctionConversion.cpp libtool: compile: x86_64-pld-linux-gnux32-g++ -DHAVE_CONFIG_H -I. -I./src/config -I./include/ -I/usr/include -I./src/lexer/ -D_GNU_SOURCE -D_REENTRANT -O2 -fwrapv -pipe -Wformat -Werror=format-security -gdwarf-4 -fno-debug-types-section -fvar-tracking-assignments -g2 -Wp,-D_FORTIFY_SOURCE=2 -fstack-protector-strong --param=ssp-buffer-size=4 -Werror=trampolines -fPIC -mtune=generic -march=x86-64 -gdwarf-4 -fno-debug-types-section -fvar-tracking-assignments -g2 -ftemplate-depth-50 -MT XQFunctionConversion.lo -MD -MP -MF .deps/XQFunctionConversion.Tpo -c src/ast/XQFunctionConversion.cpp -fPIC -DPIC -o .libs/XQFunctionConversion.o libtool: compile: x86_64-pld-linux-gnux32-g++ -DHAVE_CONFIG_H -I. -I./src/config -I./include/ -I/usr/include -I./src/lexer/ -D_GNU_SOURCE -D_REENTRANT -O2 -fwrapv -pipe -Wformat -Werror=format-security -gdwarf-4 -fno-debug-types-section -fvar-tracking-assignments -g2 -Wp,-D_FORTIFY_SOURCE=2 -fstack-protector-strong --param=ssp-buffer-size=4 -Werror=trampolines -fPIC -mtune=generic -march=x86-64 -gdwarf-4 -fno-debug-types-section -fvar-tracking-assignments -g2 -ftemplate-depth-50 -MT XQFunctionConversion.lo -MD -MP -MF .deps/XQFunctionConversion.Tpo -c src/ast/XQFunctionConversion.cpp -o XQFunctionConversion.o >/dev/null 2>&1 mv -f .deps/XQFunctionConversion.Tpo .deps/XQFunctionConversion.Plo make[1]: Leaving directory '/tmp/B.ache4phw/BUILD/XQilla-2.3.4' make[1]: Entering directory '/tmp/B.ache4phw/BUILD/XQilla-2.3.4' /bin/sh ./libtool --tag=CXX --mode=compile x86_64-pld-linux-gnux32-g++ -DHAVE_CONFIG_H -I. -I./src/config -I./include/ -I/usr/include -I./src/lexer/ -D_GNU_SOURCE -D_REENTRANT -O2 -fwrapv -pipe -Wformat -Werror=format-security -gdwarf-4 -fno-debug-types-section -fvar-tracking-assignments -g2 -Wp,-D_FORTIFY_SOURCE=2 -fstack-protector-strong --param=ssp-buffer-size=4 -Werror=trampolines -fPIC -mtune=generic -march=x86-64 -gdwarf-4 -fno-debug-types-section -fvar-tracking-assignments -g2 -ftemplate-depth-50 -MT XQFunctionDeref.lo -MD -MP -MF .deps/XQFunctionDeref.Tpo -c -o XQFunctionDeref.lo `test -f 'src/ast/XQFunctionDeref.cpp' || echo './'`src/ast/XQFunctionDeref.cpp libtool: compile: x86_64-pld-linux-gnux32-g++ -DHAVE_CONFIG_H -I. -I./src/config -I./include/ -I/usr/include -I./src/lexer/ -D_GNU_SOURCE -D_REENTRANT -O2 -fwrapv -pipe -Wformat -Werror=format-security -gdwarf-4 -fno-debug-types-section -fvar-tracking-assignments -g2 -Wp,-D_FORTIFY_SOURCE=2 -fstack-protector-strong --param=ssp-buffer-size=4 -Werror=trampolines -fPIC -mtune=generic -march=x86-64 -gdwarf-4 -fno-debug-types-section -fvar-tracking-assignments -g2 -ftemplate-depth-50 -MT XQFunctionDeref.lo -MD -MP -MF .deps/XQFunctionDeref.Tpo -c src/ast/XQFunctionDeref.cpp -fPIC -DPIC -o .libs/XQFunctionDeref.o libtool: compile: x86_64-pld-linux-gnux32-g++ -DHAVE_CONFIG_H -I. -I./src/config -I./include/ -I/usr/include -I./src/lexer/ -D_GNU_SOURCE -D_REENTRANT -O2 -fwrapv -pipe -Wformat -Werror=format-security -gdwarf-4 -fno-debug-types-section -fvar-tracking-assignments -g2 -Wp,-D_FORTIFY_SOURCE=2 -fstack-protector-strong --param=ssp-buffer-size=4 -Werror=trampolines -fPIC -mtune=generic -march=x86-64 -gdwarf-4 -fno-debug-types-section -fvar-tracking-assignments -g2 -ftemplate-depth-50 -MT XQFunctionDeref.lo -MD -MP -MF .deps/XQFunctionDeref.Tpo -c src/ast/XQFunctionDeref.cpp -o XQFunctionDeref.o >/dev/null 2>&1 mv -f .deps/XQFunctionDeref.Tpo .deps/XQFunctionDeref.Plo make[1]: Leaving directory '/tmp/B.ache4phw/BUILD/XQilla-2.3.4' make[1]: Entering directory '/tmp/B.ache4phw/BUILD/XQilla-2.3.4' /bin/sh ./libtool --tag=CXX --mode=compile x86_64-pld-linux-gnux32-g++ -DHAVE_CONFIG_H -I. -I./src/config -I./include/ -I/usr/include -I./src/lexer/ -D_GNU_SOURCE -D_REENTRANT -O2 -fwrapv -pipe -Wformat -Werror=format-security -gdwarf-4 -fno-debug-types-section -fvar-tracking-assignments -g2 -Wp,-D_FORTIFY_SOURCE=2 -fstack-protector-strong --param=ssp-buffer-size=4 -Werror=trampolines -fPIC -mtune=generic -march=x86-64 -gdwarf-4 -fno-debug-types-section -fvar-tracking-assignments -g2 -ftemplate-depth-50 -MT XQElementConstructor.lo -MD -MP -MF .deps/XQElementConstructor.Tpo -c -o XQElementConstructor.lo `test -f 'src/ast/XQElementConstructor.cpp' || echo './'`src/ast/XQElementConstructor.cpp libtool: compile: x86_64-pld-linux-gnux32-g++ -DHAVE_CONFIG_H -I. -I./src/config -I./include/ -I/usr/include -I./src/lexer/ -D_GNU_SOURCE -D_REENTRANT -O2 -fwrapv -pipe -Wformat -Werror=format-security -gdwarf-4 -fno-debug-types-section -fvar-tracking-assignments -g2 -Wp,-D_FORTIFY_SOURCE=2 -fstack-protector-strong --param=ssp-buffer-size=4 -Werror=trampolines -fPIC -mtune=generic -march=x86-64 -gdwarf-4 -fno-debug-types-section -fvar-tracking-assignments -g2 -ftemplate-depth-50 -MT XQElementConstructor.lo -MD -MP -MF .deps/XQElementConstructor.Tpo -c src/ast/XQElementConstructor.cpp -fPIC -DPIC -o .libs/XQElementConstructor.o In file included from src/ast/XQElementConstructor.cpp:33: ./include/xqilla/utils/XPath2Utils.hpp: In static member function 'static bool XPath2Utils::equals(const XMLCh*, const XMLCh*)': ./include/xqilla/utils/XPath2Utils.hpp:107:25: warning: ISO C++17 does not allow 'register' storage class specifier [-Wregister] 107 | register const XMLCh* psz1 = str1; | ^~~~ ./include/xqilla/utils/XPath2Utils.hpp:108:25: warning: ISO C++17 does not allow 'register' storage class specifier [-Wregister] 108 | register const XMLCh* psz2 = str2; | ^~~~ ./include/xqilla/utils/XPath2Utils.hpp: In static member function 'static int XPath2Utils::compare(const XMLCh*, const XMLCh*)': ./include/xqilla/utils/XPath2Utils.hpp:128:16: warning: ISO C++17 does not allow 'register' storage class specifier [-Wregister] 128 | register int cmp; | ^~~ libtool: compile: x86_64-pld-linux-gnux32-g++ -DHAVE_CONFIG_H -I. -I./src/config -I./include/ -I/usr/include -I./src/lexer/ -D_GNU_SOURCE -D_REENTRANT -O2 -fwrapv -pipe -Wformat -Werror=format-security -gdwarf-4 -fno-debug-types-section -fvar-tracking-assignments -g2 -Wp,-D_FORTIFY_SOURCE=2 -fstack-protector-strong --param=ssp-buffer-size=4 -Werror=trampolines -fPIC -mtune=generic -march=x86-64 -gdwarf-4 -fno-debug-types-section -fvar-tracking-assignments -g2 -ftemplate-depth-50 -MT XQElementConstructor.lo -MD -MP -MF .deps/XQElementConstructor.Tpo -c src/ast/XQElementConstructor.cpp -o XQElementConstructor.o >/dev/null 2>&1 mv -f .deps/XQElementConstructor.Tpo .deps/XQElementConstructor.Plo make[1]: Leaving directory '/tmp/B.ache4phw/BUILD/XQilla-2.3.4' make[1]: Entering directory '/tmp/B.ache4phw/BUILD/XQilla-2.3.4' /bin/sh ./libtool --tag=CXX --mode=compile x86_64-pld-linux-gnux32-g++ -DHAVE_CONFIG_H -I. -I./src/config -I./include/ -I/usr/include -I./src/lexer/ -D_GNU_SOURCE -D_REENTRANT -O2 -fwrapv -pipe -Wformat -Werror=format-security -gdwarf-4 -fno-debug-types-section -fvar-tracking-assignments -g2 -Wp,-D_FORTIFY_SOURCE=2 -fstack-protector-strong --param=ssp-buffer-size=4 -Werror=trampolines -fPIC -mtune=generic -march=x86-64 -gdwarf-4 -fno-debug-types-section -fvar-tracking-assignments -g2 -ftemplate-depth-50 -MT XQFunctionRef.lo -MD -MP -MF .deps/XQFunctionRef.Tpo -c -o XQFunctionRef.lo `test -f 'src/ast/XQFunctionRef.cpp' || echo './'`src/ast/XQFunctionRef.cpp libtool: compile: x86_64-pld-linux-gnux32-g++ -DHAVE_CONFIG_H -I. -I./src/config -I./include/ -I/usr/include -I./src/lexer/ -D_GNU_SOURCE -D_REENTRANT -O2 -fwrapv -pipe -Wformat -Werror=format-security -gdwarf-4 -fno-debug-types-section -fvar-tracking-assignments -g2 -Wp,-D_FORTIFY_SOURCE=2 -fstack-protector-strong --param=ssp-buffer-size=4 -Werror=trampolines -fPIC -mtune=generic -march=x86-64 -gdwarf-4 -fno-debug-types-section -fvar-tracking-assignments -g2 -ftemplate-depth-50 -MT XQFunctionRef.lo -MD -MP -MF .deps/XQFunctionRef.Tpo -c src/ast/XQFunctionRef.cpp -fPIC -DPIC -o .libs/XQFunctionRef.o In file included from src/ast/XQFunctionRef.cpp:26: ./include/xqilla/utils/XPath2Utils.hpp: In static member function 'static bool XPath2Utils::equals(const XMLCh*, const XMLCh*)': ./include/xqilla/utils/XPath2Utils.hpp:107:25: warning: ISO C++17 does not allow 'register' storage class specifier [-Wregister] 107 | register const XMLCh* psz1 = str1; | ^~~~ ./include/xqilla/utils/XPath2Utils.hpp:108:25: warning: ISO C++17 does not allow 'register' storage class specifier [-Wregister] 108 | register const XMLCh* psz2 = str2; | ^~~~ ./include/xqilla/utils/XPath2Utils.hpp: In static member function 'static int XPath2Utils::compare(const XMLCh*, const XMLCh*)': ./include/xqilla/utils/XPath2Utils.hpp:128:16: warning: ISO C++17 does not allow 'register' storage class specifier [-Wregister] 128 | register int cmp; | ^~~ libtool: compile: x86_64-pld-linux-gnux32-g++ -DHAVE_CONFIG_H -I. -I./src/config -I./include/ -I/usr/include -I./src/lexer/ -D_GNU_SOURCE -D_REENTRANT -O2 -fwrapv -pipe -Wformat -Werror=format-security -gdwarf-4 -fno-debug-types-section -fvar-tracking-assignments -g2 -Wp,-D_FORTIFY_SOURCE=2 -fstack-protector-strong --param=ssp-buffer-size=4 -Werror=trampolines -fPIC -mtune=generic -march=x86-64 -gdwarf-4 -fno-debug-types-section -fvar-tracking-assignments -g2 -ftemplate-depth-50 -MT XQFunctionRef.lo -MD -MP -MF .deps/XQFunctionRef.Tpo -c src/ast/XQFunctionRef.cpp -o XQFunctionRef.o >/dev/null 2>&1 mv -f .deps/XQFunctionRef.Tpo .deps/XQFunctionRef.Plo make[1]: Leaving directory '/tmp/B.ache4phw/BUILD/XQilla-2.3.4' make[1]: Entering directory '/tmp/B.ache4phw/BUILD/XQilla-2.3.4' /bin/sh ./libtool --tag=CXX --mode=compile x86_64-pld-linux-gnux32-g++ -DHAVE_CONFIG_H -I. -I./src/config -I./include/ -I/usr/include -I./src/lexer/ -D_GNU_SOURCE -D_REENTRANT -O2 -fwrapv -pipe -Wformat -Werror=format-security -gdwarf-4 -fno-debug-types-section -fvar-tracking-assignments -g2 -Wp,-D_FORTIFY_SOURCE=2 -fstack-protector-strong --param=ssp-buffer-size=4 -Werror=trampolines -fPIC -mtune=generic -march=x86-64 -gdwarf-4 -fno-debug-types-section -fvar-tracking-assignments -g2 -ftemplate-depth-50 -MT XQPartialApply.lo -MD -MP -MF .deps/XQPartialApply.Tpo -c -o XQPartialApply.lo `test -f 'src/ast/XQPartialApply.cpp' || echo './'`src/ast/XQPartialApply.cpp libtool: compile: x86_64-pld-linux-gnux32-g++ -DHAVE_CONFIG_H -I. -I./src/config -I./include/ -I/usr/include -I./src/lexer/ -D_GNU_SOURCE -D_REENTRANT -O2 -fwrapv -pipe -Wformat -Werror=format-security -gdwarf-4 -fno-debug-types-section -fvar-tracking-assignments -g2 -Wp,-D_FORTIFY_SOURCE=2 -fstack-protector-strong --param=ssp-buffer-size=4 -Werror=trampolines -fPIC -mtune=generic -march=x86-64 -gdwarf-4 -fno-debug-types-section -fvar-tracking-assignments -g2 -ftemplate-depth-50 -MT XQPartialApply.lo -MD -MP -MF .deps/XQPartialApply.Tpo -c src/ast/XQPartialApply.cpp -fPIC -DPIC -o .libs/XQPartialApply.o In file included from src/ast/XQPartialApply.cpp:28: ./include/xqilla/utils/XPath2Utils.hpp: In static member function 'static bool XPath2Utils::equals(const XMLCh*, const XMLCh*)': ./include/xqilla/utils/XPath2Utils.hpp:107:25: warning: ISO C++17 does not allow 'register' storage class specifier [-Wregister] 107 | register const XMLCh* psz1 = str1; | ^~~~ ./include/xqilla/utils/XPath2Utils.hpp:108:25: warning: ISO C++17 does not allow 'register' storage class specifier [-Wregister] 108 | register const XMLCh* psz2 = str2; | ^~~~ ./include/xqilla/utils/XPath2Utils.hpp: In static member function 'static int XPath2Utils::compare(const XMLCh*, const XMLCh*)': ./include/xqilla/utils/XPath2Utils.hpp:128:16: warning: ISO C++17 does not allow 'register' storage class specifier [-Wregister] 128 | register int cmp; | ^~~ libtool: compile: x86_64-pld-linux-gnux32-g++ -DHAVE_CONFIG_H -I. -I./src/config -I./include/ -I/usr/include -I./src/lexer/ -D_GNU_SOURCE -D_REENTRANT -O2 -fwrapv -pipe -Wformat -Werror=format-security -gdwarf-4 -fno-debug-types-section -fvar-tracking-assignments -g2 -Wp,-D_FORTIFY_SOURCE=2 -fstack-protector-strong --param=ssp-buffer-size=4 -Werror=trampolines -fPIC -mtune=generic -march=x86-64 -gdwarf-4 -fno-debug-types-section -fvar-tracking-assignments -g2 -ftemplate-depth-50 -MT XQPartialApply.lo -MD -MP -MF .deps/XQPartialApply.Tpo -c src/ast/XQPartialApply.cpp -o XQPartialApply.o >/dev/null 2>&1 mv -f .deps/XQPartialApply.Tpo .deps/XQPartialApply.Plo make[1]: Leaving directory '/tmp/B.ache4phw/BUILD/XQilla-2.3.4' make[1]: Entering directory '/tmp/B.ache4phw/BUILD/XQilla-2.3.4' /bin/sh ./libtool --tag=CXX --mode=compile x86_64-pld-linux-gnux32-g++ -DHAVE_CONFIG_H -I. -I./src/config -I./include/ -I/usr/include -I./src/lexer/ -D_GNU_SOURCE -D_REENTRANT -O2 -fwrapv -pipe -Wformat -Werror=format-security -gdwarf-4 -fno-debug-types-section -fvar-tracking-assignments -g2 -Wp,-D_FORTIFY_SOURCE=2 -fstack-protector-strong --param=ssp-buffer-size=4 -Werror=trampolines -fPIC -mtune=generic -march=x86-64 -gdwarf-4 -fno-debug-types-section -fvar-tracking-assignments -g2 -ftemplate-depth-50 -MT XQDocumentOrder.lo -MD -MP -MF .deps/XQDocumentOrder.Tpo -c -o XQDocumentOrder.lo `test -f 'src/ast/XQDocumentOrder.cpp' || echo './'`src/ast/XQDocumentOrder.cpp libtool: compile: x86_64-pld-linux-gnux32-g++ -DHAVE_CONFIG_H -I. -I./src/config -I./include/ -I/usr/include -I./src/lexer/ -D_GNU_SOURCE -D_REENTRANT -O2 -fwrapv -pipe -Wformat -Werror=format-security -gdwarf-4 -fno-debug-types-section -fvar-tracking-assignments -g2 -Wp,-D_FORTIFY_SOURCE=2 -fstack-protector-strong --param=ssp-buffer-size=4 -Werror=trampolines -fPIC -mtune=generic -march=x86-64 -gdwarf-4 -fno-debug-types-section -fvar-tracking-assignments -g2 -ftemplate-depth-50 -MT XQDocumentOrder.lo -MD -MP -MF .deps/XQDocumentOrder.Tpo -c src/ast/XQDocumentOrder.cpp -fPIC -DPIC -o .libs/XQDocumentOrder.o In file included from /usr/include/c++/12.2.0/set:60, from ./include/xqilla/ast/XQDocumentOrder.hpp:27, from src/ast/XQDocumentOrder.cpp:22: /usr/include/c++/12.2.0/bits/stl_tree.h: In instantiation of 'static const _Key& std::_Rb_tree<_Key, _Val, _KeyOfValue, _Compare, _Alloc>::_S_key(_Const_Link_type) [with _Key = RefCountPointer<const Node>; _Val = RefCountPointer<const Node>; _KeyOfValue = std::_Identity<RefCountPointer<const Node> >; _Compare = UniqueNodesResult::uniqueLessThanCompareFn; _Alloc = std::allocator<RefCountPointer<const Node> >; _Const_Link_type = const std::_Rb_tree_node<RefCountPointer<const Node> >*]': /usr/include/c++/12.2.0/bits/stl_tree.h:2117:47: required from 'std::pair<std::_Rb_tree_node_base*, std::_Rb_tree_node_base*> std::_Rb_tree<_Key, _Val, _KeyOfValue, _Compare, _Alloc>::_M_get_insert_unique_pos(const key_type&) [with _Key = RefCountPointer<const Node>; _Val = RefCountPointer<const Node>; _KeyOfValue = std::_Identity<RefCountPointer<const Node> >; _Compare = UniqueNodesResult::uniqueLessThanCompareFn; _Alloc = std::allocator<RefCountPointer<const Node> >; key_type = RefCountPointer<const Node>]' /usr/include/c++/12.2.0/bits/stl_tree.h:2170:4: required from 'std::pair<std::_Rb_tree_iterator<_Val>, bool> std::_Rb_tree<_Key, _Val, _KeyOfValue, _Compare, _Alloc>::_M_insert_unique(_Arg&&) [with _Arg = RefCountPointer<const Node>; _Key = RefCountPointer<const Node>; _Val = RefCountPointer<const Node>; _KeyOfValue = std::_Identity<RefCountPointer<const Node> >; _Compare = UniqueNodesResult::uniqueLessThanCompareFn; _Alloc = std::allocator<RefCountPointer<const Node> >]' /usr/include/c++/12.2.0/bits/stl_set.h:521:25: required from 'std::pair<typename std::_Rb_tree<_Key, _Key, std::_Identity<_Tp>, _Compare, typename __gnu_cxx::__alloc_traits<_Allocator>::rebind<_Key>::other>::const_iterator, bool> std::set<_Key, _Compare, _Alloc>::insert(value_type&&) [with _Key = RefCountPointer<const Node>; _Compare = UniqueNodesResult::uniqueLessThanCompareFn; _Alloc = std::allocator<RefCountPointer<const Node> >; typename std::_Rb_tree<_Key, _Key, std::_Identity<_Tp>, _Compare, typename __gnu_cxx::__alloc_traits<_Allocator>::rebind<_Key>::other>::const_iterator = std::_Rb_tree<RefCountPointer<const Node>, RefCountPointer<const Node>, std::_Identity<RefCountPointer<const Node> >, UniqueNodesResult::uniqueLessThanCompareFn, std::allocator<RefCountPointer<const Node> > >::const_iterator; typename __gnu_cxx::__alloc_traits<_Allocator>::rebind<_Key>::other = std::allocator<RefCountPointer<const Node> >; typename __gnu_cxx::__alloc_traits<_Allocator>::rebind<_Key> = __gnu_cxx::__alloc_traits<std::allocator<RefCountPointer<const Node> >, RefCountPointer<const Node> >::rebind<RefCountPointer<const Node> >; typename _Allocator::value_type = RefCountPointer<const Node>; value_type = RefCountPointer<const Node>]' src/ast/XQDocumentOrder.cpp:104:22: required from here /usr/include/c++/12.2.0/bits/stl_tree.h:770:15: error: static assertion failed: comparison object must be invocable as const 770 | is_invocable_v<const _Compare&, const _Key&, const _Key&>, | ^~~~~~~~~~~~~~~~~~~~~~~~~~~~~~~~~~~~~~~~~~~~~~~~~~~~~~~~~ /usr/include/c++/12.2.0/bits/stl_tree.h:770:15: note: 'std::is_invocable_v<const UniqueNodesResult::uniqueLessThanCompareFn&, const RefCountPointer<const Node>&, const RefCountPointer<const Node>&>' evaluates to false make[1]: *** [Makefile:2958: XQDocumentOrder.lo] Error 1 make[1]: Leaving directory '/tmp/B.ache4phw/BUILD/XQilla-2.3.4' make[1]: *** Waiting for unfinished jobs.... make[1]: Entering directory '/tmp/B.ache4phw/BUILD/XQilla-2.3.4' /bin/sh ./libtool --tag=CXX --mode=compile x86_64-pld-linux-gnux32-g++ -DHAVE_CONFIG_H -I. -I./src/config -I./include/ -I/usr/include -I./src/lexer/ -D_GNU_SOURCE -D_REENTRANT -O2 -fwrapv -pipe -Wformat -Werror=format-security -gdwarf-4 -fno-debug-types-section -fvar-tracking-assignments -g2 -Wp,-D_FORTIFY_SOURCE=2 -fstack-protector-strong --param=ssp-buffer-size=4 -Werror=trampolines -fPIC -mtune=generic -march=x86-64 -gdwarf-4 -fno-debug-types-section -fvar-tracking-assignments -g2 -ftemplate-depth-50 -MT XQQuantified.lo -MD -MP -MF .deps/XQQuantified.Tpo -c -o XQQuantified.lo `test -f 'src/ast/XQQuantified.cpp' || echo './'`src/ast/XQQuantified.cpp libtool: compile: x86_64-pld-linux-gnux32-g++ -DHAVE_CONFIG_H -I. -I./src/config -I./include/ -I/usr/include -I./src/lexer/ -D_GNU_SOURCE -D_REENTRANT -O2 -fwrapv -pipe -Wformat -Werror=format-security -gdwarf-4 -fno-debug-types-section -fvar-tracking-assignments -g2 -Wp,-D_FORTIFY_SOURCE=2 -fstack-protector-strong --param=ssp-buffer-size=4 -Werror=trampolines -fPIC -mtune=generic -march=x86-64 -gdwarf-4 -fno-debug-types-section -fvar-tracking-assignments -g2 -ftemplate-depth-50 -MT XQQuantified.lo -MD -MP -MF .deps/XQQuantified.Tpo -c src/ast/XQQuantified.cpp -fPIC -DPIC -o .libs/XQQuantified.o In file included from ./include/xqilla/events/EventGenerator.hpp:24, from ./include/xqilla/ast/ASTNode.hpp:27, from ./include/xqilla/ast/ASTNodeImpl.hpp:26, from ./include/xqilla/ast/XQQuantified.hpp:23, from src/ast/XQQuantified.cpp:20: In destructor 'virtual ReferenceCounted::~ReferenceCounted()', inlined from 'virtual void ReferenceCounted::decrementRefCount() const' at ./include/xqilla/framework/ReferenceCounted.hpp:47:14, inlined from 'virtual void ReferenceCounted::decrementRefCount() const' at ./include/xqilla/framework/ReferenceCounted.hpp:44:16, inlined from 'RefCountPointer<T>::~RefCountPointer() [with T = TupleResult]' at ./include/xqilla/framework/ReferenceCounted.hpp:91:38, inlined from 'virtual BoolResult XQQuantified::boolResult(DynamicContext*) const' at src/ast/XQQuantified.cpp:81:1: ./include/xqilla/framework/ReferenceCounted.hpp:35:32: warning: 'void operator delete(void*, std::size_t)' called on pointer 'tuples.RefCountPointer<TupleResult>::_p' with nonzero offset 16 [-Wfree-nonheap-object] 35 | virtual ~ReferenceCounted() {} | ^ In destructor 'virtual ReferenceCounted::~ReferenceCounted()', inlined from 'virtual void ReferenceCounted::decrementRefCount() const' at ./include/xqilla/framework/ReferenceCounted.hpp:47:14, inlined from 'virtual void ReferenceCounted::decrementRefCount() const' at ./include/xqilla/framework/ReferenceCounted.hpp:44:16, inlined from 'RefCountPointer<T>::~RefCountPointer() [with T = TupleResult]' at ./include/xqilla/framework/ReferenceCounted.hpp:91:38, inlined from 'virtual BoolResult XQQuantified::boolResult(DynamicContext*) const' at src/ast/XQQuantified.cpp:81:1: ./include/xqilla/framework/ReferenceCounted.hpp:35:32: warning: 'void operator delete(void*, std::size_t)' called on pointer 'tuples.RefCountPointer<TupleResult>::_p' with nonzero offset 16 [-Wfree-nonheap-object] 35 | virtual ~ReferenceCounted() {} | ^ libtool: compile: x86_64-pld-linux-gnux32-g++ -DHAVE_CONFIG_H -I. -I./src/config -I./include/ -I/usr/include -I./src/lexer/ -D_GNU_SOURCE -D_REENTRANT -O2 -fwrapv -pipe -Wformat -Werror=format-security -gdwarf-4 -fno-debug-types-section -fvar-tracking-assignments -g2 -Wp,-D_FORTIFY_SOURCE=2 -fstack-protector-strong --param=ssp-buffer-size=4 -Werror=trampolines -fPIC -mtune=generic -march=x86-64 -gdwarf-4 -fno-debug-types-section -fvar-tracking-assignments -g2 -ftemplate-depth-50 -MT XQQuantified.lo -MD -MP -MF .deps/XQQuantified.Tpo -c src/ast/XQQuantified.cpp -o XQQuantified.o >/dev/null 2>&1 mv -f .deps/XQQuantified.Tpo .deps/XQQuantified.Plo make[1]: Leaving directory '/tmp/B.ache4phw/BUILD/XQilla-2.3.4' make[1]: Entering directory '/tmp/B.ache4phw/BUILD/XQilla-2.3.4' /bin/sh ./libtool --tag=CXX --mode=compile x86_64-pld-linux-gnux32-g++ -DHAVE_CONFIG_H -I. -I./src/config -I./include/ -I/usr/include -I./src/lexer/ -D_GNU_SOURCE -D_REENTRANT -O2 -fwrapv -pipe -Wformat -Werror=format-security -gdwarf-4 -fno-debug-types-section -fvar-tracking-assignments -g2 -Wp,-D_FORTIFY_SOURCE=2 -fstack-protector-strong --param=ssp-buffer-size=4 -Werror=trampolines -fPIC -mtune=generic -march=x86-64 -gdwarf-4 -fno-debug-types-section -fvar-tracking-assignments -g2 -ftemplate-depth-50 -MT XQOrderingChange.lo -MD -MP -MF .deps/XQOrderingChange.Tpo -c -o XQOrderingChange.lo `test -f 'src/ast/XQOrderingChange.cpp' || echo './'`src/ast/XQOrderingChange.cpp libtool: compile: x86_64-pld-linux-gnux32-g++ -DHAVE_CONFIG_H -I. -I./src/config -I./include/ -I/usr/include -I./src/lexer/ -D_GNU_SOURCE -D_REENTRANT -O2 -fwrapv -pipe -Wformat -Werror=format-security -gdwarf-4 -fno-debug-types-section -fvar-tracking-assignments -g2 -Wp,-D_FORTIFY_SOURCE=2 -fstack-protector-strong --param=ssp-buffer-size=4 -Werror=trampolines -fPIC -mtune=generic -march=x86-64 -gdwarf-4 -fno-debug-types-section -fvar-tracking-assignments -g2 -ftemplate-depth-50 -MT XQOrderingChange.lo -MD -MP -MF .deps/XQOrderingChange.Tpo -c src/ast/XQOrderingChange.cpp -fPIC -DPIC -o .libs/XQOrderingChange.o libtool: compile: x86_64-pld-linux-gnux32-g++ -DHAVE_CONFIG_H -I. -I./src/config -I./include/ -I/usr/include -I./src/lexer/ -D_GNU_SOURCE -D_REENTRANT -O2 -fwrapv -pipe -Wformat -Werror=format-security -gdwarf-4 -fno-debug-types-section -fvar-tracking-assignments -g2 -Wp,-D_FORTIFY_SOURCE=2 -fstack-protector-strong --param=ssp-buffer-size=4 -Werror=trampolines -fPIC -mtune=generic -march=x86-64 -gdwarf-4 -fno-debug-types-section -fvar-tracking-assignments -g2 -ftemplate-depth-50 -MT XQOrderingChange.lo -MD -MP -MF .deps/XQOrderingChange.Tpo -c src/ast/XQOrderingChange.cpp -o XQOrderingChange.o >/dev/null 2>&1 mv -f .deps/XQOrderingChange.Tpo .deps/XQOrderingChange.Plo make[1]: Leaving directory '/tmp/B.ache4phw/BUILD/XQilla-2.3.4' make[1]: Entering directory '/tmp/B.ache4phw/BUILD/XQilla-2.3.4' /bin/sh ./libtool --tag=CXX --mode=compile x86_64-pld-linux-gnux32-g++ -DHAVE_CONFIG_H -I. -I./src/config -I./include/ -I/usr/include -I./src/lexer/ -D_GNU_SOURCE -D_REENTRANT -O2 -fwrapv -pipe -Wformat -Werror=format-security -gdwarf-4 -fno-debug-types-section -fvar-tracking-assignments -g2 -Wp,-D_FORTIFY_SOURCE=2 -fstack-protector-strong --param=ssp-buffer-size=4 -Werror=trampolines -fPIC -mtune=generic -march=x86-64 -gdwarf-4 -fno-debug-types-section -fvar-tracking-assignments -g2 -ftemplate-depth-50 -MT XQGlobalVariable.lo -MD -MP -MF .deps/XQGlobalVariable.Tpo -c -o XQGlobalVariable.lo `test -f 'src/ast/XQGlobalVariable.cpp' || echo './'`src/ast/XQGlobalVariable.cpp libtool: compile: x86_64-pld-linux-gnux32-g++ -DHAVE_CONFIG_H -I. -I./src/config -I./include/ -I/usr/include -I./src/lexer/ -D_GNU_SOURCE -D_REENTRANT -O2 -fwrapv -pipe -Wformat -Werror=format-security -gdwarf-4 -fno-debug-types-section -fvar-tracking-assignments -g2 -Wp,-D_FORTIFY_SOURCE=2 -fstack-protector-strong --param=ssp-buffer-size=4 -Werror=trampolines -fPIC -mtune=generic -march=x86-64 -gdwarf-4 -fno-debug-types-section -fvar-tracking-assignments -g2 -ftemplate-depth-50 -MT XQGlobalVariable.lo -MD -MP -MF .deps/XQGlobalVariable.Tpo -c src/ast/XQGlobalVariable.cpp -fPIC -DPIC -o .libs/XQGlobalVariable.o libtool: compile: x86_64-pld-linux-gnux32-g++ -DHAVE_CONFIG_H -I. -I./src/config -I./include/ -I/usr/include -I./src/lexer/ -D_GNU_SOURCE -D_REENTRANT -O2 -fwrapv -pipe -Wformat -Werror=format-security -gdwarf-4 -fno-debug-types-section -fvar-tracking-assignments -g2 -Wp,-D_FORTIFY_SOURCE=2 -fstack-protector-strong --param=ssp-buffer-size=4 -Werror=trampolines -fPIC -mtune=generic -march=x86-64 -gdwarf-4 -fno-debug-types-section -fvar-tracking-assignments -g2 -ftemplate-depth-50 -MT XQGlobalVariable.lo -MD -MP -MF .deps/XQGlobalVariable.Tpo -c src/ast/XQGlobalVariable.cpp -o XQGlobalVariable.o >/dev/null 2>&1 mv -f .deps/XQGlobalVariable.Tpo .deps/XQGlobalVariable.Plo make[1]: Leaving directory '/tmp/B.ache4phw/BUILD/XQilla-2.3.4' make[1]: Entering directory '/tmp/B.ache4phw/BUILD/XQilla-2.3.4' /bin/sh ./libtool --tag=CXX --mode=compile x86_64-pld-linux-gnux32-g++ -DHAVE_CONFIG_H -I. -I./src/config -I./include/ -I/usr/include -I./src/lexer/ -D_GNU_SOURCE -D_REENTRANT -O2 -fwrapv -pipe -Wformat -Werror=format-security -gdwarf-4 -fno-debug-types-section -fvar-tracking-assignments -g2 -Wp,-D_FORTIFY_SOURCE=2 -fstack-protector-strong --param=ssp-buffer-size=4 -Werror=trampolines -fPIC -mtune=generic -march=x86-64 -gdwarf-4 -fno-debug-types-section -fvar-tracking-assignments -g2 -ftemplate-depth-50 -MT XQTypeswitch.lo -MD -MP -MF .deps/XQTypeswitch.Tpo -c -o XQTypeswitch.lo `test -f 'src/ast/XQTypeswitch.cpp' || echo './'`src/ast/XQTypeswitch.cpp libtool: compile: x86_64-pld-linux-gnux32-g++ -DHAVE_CONFIG_H -I. -I./src/config -I./include/ -I/usr/include -I./src/lexer/ -D_GNU_SOURCE -D_REENTRANT -O2 -fwrapv -pipe -Wformat -Werror=format-security -gdwarf-4 -fno-debug-types-section -fvar-tracking-assignments -g2 -Wp,-D_FORTIFY_SOURCE=2 -fstack-protector-strong --param=ssp-buffer-size=4 -Werror=trampolines -fPIC -mtune=generic -march=x86-64 -gdwarf-4 -fno-debug-types-section -fvar-tracking-assignments -g2 -ftemplate-depth-50 -MT XQTypeswitch.lo -MD -MP -MF .deps/XQTypeswitch.Tpo -c src/ast/XQTypeswitch.cpp -fPIC -DPIC -o .libs/XQTypeswitch.o libtool: compile: x86_64-pld-linux-gnux32-g++ -DHAVE_CONFIG_H -I. -I./src/config -I./include/ -I/usr/include -I./src/lexer/ -D_GNU_SOURCE -D_REENTRANT -O2 -fwrapv -pipe -Wformat -Werror=format-security -gdwarf-4 -fno-debug-types-section -fvar-tracking-assignments -g2 -Wp,-D_FORTIFY_SOURCE=2 -fstack-protector-strong --param=ssp-buffer-size=4 -Werror=trampolines -fPIC -mtune=generic -march=x86-64 -gdwarf-4 -fno-debug-types-section -fvar-tracking-assignments -g2 -ftemplate-depth-50 -MT XQTypeswitch.lo -MD -MP -MF .deps/XQTypeswitch.Tpo -c src/ast/XQTypeswitch.cpp -o XQTypeswitch.o >/dev/null 2>&1 mv -f .deps/XQTypeswitch.Tpo .deps/XQTypeswitch.Plo make[1]: Leaving directory '/tmp/B.ache4phw/BUILD/XQilla-2.3.4' make[1]: Entering directory '/tmp/B.ache4phw/BUILD/XQilla-2.3.4' /bin/sh ./libtool --tag=CXX --mode=compile x86_64-pld-linux-gnux32-g++ -DHAVE_CONFIG_H -I. -I./src/config -I./include/ -I/usr/include -I./src/lexer/ -D_GNU_SOURCE -D_REENTRANT -O2 -fwrapv -pipe -Wformat -Werror=format-security -gdwarf-4 -fno-debug-types-section -fvar-tracking-assignments -g2 -Wp,-D_FORTIFY_SOURCE=2 -fstack-protector-strong --param=ssp-buffer-size=4 -Werror=trampolines -fPIC -mtune=generic -march=x86-64 -gdwarf-4 -fno-debug-types-section -fvar-tracking-assignments -g2 -ftemplate-depth-50 -MT XQValidate.lo -MD -MP -MF .deps/XQValidate.Tpo -c -o XQValidate.lo `test -f 'src/ast/XQValidate.cpp' || echo './'`src/ast/XQValidate.cpp libtool: compile: x86_64-pld-linux-gnux32-g++ -DHAVE_CONFIG_H -I. -I./src/config -I./include/ -I/usr/include -I./src/lexer/ -D_GNU_SOURCE -D_REENTRANT -O2 -fwrapv -pipe -Wformat -Werror=format-security -gdwarf-4 -fno-debug-types-section -fvar-tracking-assignments -g2 -Wp,-D_FORTIFY_SOURCE=2 -fstack-protector-strong --param=ssp-buffer-size=4 -Werror=trampolines -fPIC -mtune=generic -march=x86-64 -gdwarf-4 -fno-debug-types-section -fvar-tracking-assignments -g2 -ftemplate-depth-50 -MT XQValidate.lo -MD -MP -MF .deps/XQValidate.Tpo -c src/ast/XQValidate.cpp -fPIC -DPIC -o .libs/XQValidate.o libtool: compile: x86_64-pld-linux-gnux32-g++ -DHAVE_CONFIG_H -I. -I./src/config -I./include/ -I/usr/include -I./src/lexer/ -D_GNU_SOURCE -D_REENTRANT -O2 -fwrapv -pipe -Wformat -Werror=format-security -gdwarf-4 -fno-debug-types-section -fvar-tracking-assignments -g2 -Wp,-D_FORTIFY_SOURCE=2 -fstack-protector-strong --param=ssp-buffer-size=4 -Werror=trampolines -fPIC -mtune=generic -march=x86-64 -gdwarf-4 -fno-debug-types-section -fvar-tracking-assignments -g2 -ftemplate-depth-50 -MT XQValidate.lo -MD -MP -MF .deps/XQValidate.Tpo -c src/ast/XQValidate.cpp -o XQValidate.o >/dev/null 2>&1 mv -f .deps/XQValidate.Tpo .deps/XQValidate.Plo make[1]: Leaving directory '/tmp/B.ache4phw/BUILD/XQilla-2.3.4' make[1]: Entering directory '/tmp/B.ache4phw/BUILD/XQilla-2.3.4' /bin/sh ./libtool --tag=CXX --mode=compile x86_64-pld-linux-gnux32-g++ -DHAVE_CONFIG_H -I. -I./src/config -I./include/ -I/usr/include -I./src/lexer/ -D_GNU_SOURCE -D_REENTRANT -O2 -fwrapv -pipe -Wformat -Werror=format-security -gdwarf-4 -fno-debug-types-section -fvar-tracking-assignments -g2 -Wp,-D_FORTIFY_SOURCE=2 -fstack-protector-strong --param=ssp-buffer-size=4 -Werror=trampolines -fPIC -mtune=generic -march=x86-64 -gdwarf-4 -fno-debug-types-section -fvar-tracking-assignments -g2 -ftemplate-depth-50 -MT ConvertFunctionArg.lo -MD -MP -MF .deps/ConvertFunctionArg.Tpo -c -o ConvertFunctionArg.lo `test -f 'src/ast/ConvertFunctionArg.cpp' || echo './'`src/ast/ConvertFunctionArg.cpp libtool: compile: x86_64-pld-linux-gnux32-g++ -DHAVE_CONFIG_H -I. -I./src/config -I./include/ -I/usr/include -I./src/lexer/ -D_GNU_SOURCE -D_REENTRANT -O2 -fwrapv -pipe -Wformat -Werror=format-security -gdwarf-4 -fno-debug-types-section -fvar-tracking-assignments -g2 -Wp,-D_FORTIFY_SOURCE=2 -fstack-protector-strong --param=ssp-buffer-size=4 -Werror=trampolines -fPIC -mtune=generic -march=x86-64 -gdwarf-4 -fno-debug-types-section -fvar-tracking-assignments -g2 -ftemplate-depth-50 -MT ConvertFunctionArg.lo -MD -MP -MF .deps/ConvertFunctionArg.Tpo -c src/ast/ConvertFunctionArg.cpp -fPIC -DPIC -o .libs/ConvertFunctionArg.o In file included from src/ast/ConvertFunctionArg.cpp:25: ./include/xqilla/utils/XPath2Utils.hpp: In static member function 'static bool XPath2Utils::equals(const XMLCh*, const XMLCh*)': ./include/xqilla/utils/XPath2Utils.hpp:107:25: warning: ISO C++17 does not allow 'register' storage class specifier [-Wregister] 107 | register const XMLCh* psz1 = str1; | ^~~~ ./include/xqilla/utils/XPath2Utils.hpp:108:25: warning: ISO C++17 does not allow 'register' storage class specifier [-Wregister] 108 | register const XMLCh* psz2 = str2; | ^~~~ ./include/xqilla/utils/XPath2Utils.hpp: In static member function 'static int XPath2Utils::compare(const XMLCh*, const XMLCh*)': ./include/xqilla/utils/XPath2Utils.hpp:128:16: warning: ISO C++17 does not allow 'register' storage class specifier [-Wregister] 128 | register int cmp; | ^~~ libtool: compile: x86_64-pld-linux-gnux32-g++ -DHAVE_CONFIG_H -I. -I./src/config -I./include/ -I/usr/include -I./src/lexer/ -D_GNU_SOURCE -D_REENTRANT -O2 -fwrapv -pipe -Wformat -Werror=format-security -gdwarf-4 -fno-debug-types-section -fvar-tracking-assignments -g2 -Wp,-D_FORTIFY_SOURCE=2 -fstack-protector-strong --param=ssp-buffer-size=4 -Werror=trampolines -fPIC -mtune=generic -march=x86-64 -gdwarf-4 -fno-debug-types-section -fvar-tracking-assignments -g2 -ftemplate-depth-50 -MT ConvertFunctionArg.lo -MD -MP -MF .deps/ConvertFunctionArg.Tpo -c src/ast/ConvertFunctionArg.cpp -o ConvertFunctionArg.o >/dev/null 2>&1 mv -f .deps/ConvertFunctionArg.Tpo .deps/ConvertFunctionArg.Plo make[1]: Leaving directory '/tmp/B.ache4phw/BUILD/XQilla-2.3.4' make[1]: Entering directory '/tmp/B.ache4phw/BUILD/XQilla-2.3.4' /bin/sh ./libtool --tag=CXX --mode=compile x86_64-pld-linux-gnux32-g++ -DHAVE_CONFIG_H -I. -I./src/config -I./include/ -I/usr/include -I./src/lexer/ -D_GNU_SOURCE -D_REENTRANT -O2 -fwrapv -pipe -Wformat -Werror=format-security -gdwarf-4 -fno-debug-types-section -fvar-tracking-assignments -g2 -Wp,-D_FORTIFY_SOURCE=2 -fstack-protector-strong --param=ssp-buffer-size=4 -Werror=trampolines -fPIC -mtune=generic -march=x86-64 -gdwarf-4 -fno-debug-types-section -fvar-tracking-assignments -g2 -ftemplate-depth-50 -MT XQPredicate.lo -MD -MP -MF .deps/XQPredicate.Tpo -c -o XQPredicate.lo `test -f 'src/ast/XQPredicate.cpp' || echo './'`src/ast/XQPredicate.cpp libtool: compile: x86_64-pld-linux-gnux32-g++ -DHAVE_CONFIG_H -I. -I./src/config -I./include/ -I/usr/include -I./src/lexer/ -D_GNU_SOURCE -D_REENTRANT -O2 -fwrapv -pipe -Wformat -Werror=format-security -gdwarf-4 -fno-debug-types-section -fvar-tracking-assignments -g2 -Wp,-D_FORTIFY_SOURCE=2 -fstack-protector-strong --param=ssp-buffer-size=4 -Werror=trampolines -fPIC -mtune=generic -march=x86-64 -gdwarf-4 -fno-debug-types-section -fvar-tracking-assignments -g2 -ftemplate-depth-50 -MT XQPredicate.lo -MD -MP -MF .deps/XQPredicate.Tpo -c src/ast/XQPredicate.cpp -fPIC -DPIC -o .libs/XQPredicate.o libtool: compile: x86_64-pld-linux-gnux32-g++ -DHAVE_CONFIG_H -I. -I./src/config -I./include/ -I/usr/include -I./src/lexer/ -D_GNU_SOURCE -D_REENTRANT -O2 -fwrapv -pipe -Wformat -Werror=format-security -gdwarf-4 -fno-debug-types-section -fvar-tracking-assignments -g2 -Wp,-D_FORTIFY_SOURCE=2 -fstack-protector-strong --param=ssp-buffer-size=4 -Werror=trampolines -fPIC -mtune=generic -march=x86-64 -gdwarf-4 -fno-debug-types-section -fvar-tracking-assignments -g2 -ftemplate-depth-50 -MT XQPredicate.lo -MD -MP -MF .deps/XQPredicate.Tpo -c src/ast/XQPredicate.cpp -o XQPredicate.o >/dev/null 2>&1 mv -f .deps/XQPredicate.Tpo .deps/XQPredicate.Plo make[1]: Leaving directory '/tmp/B.ache4phw/BUILD/XQilla-2.3.4' make[1]: Entering directory '/tmp/B.ache4phw/BUILD/XQilla-2.3.4' /bin/sh ./libtool --tag=CXX --mode=compile x86_64-pld-linux-gnux32-g++ -DHAVE_CONFIG_H -I. -I./src/config -I./include/ -I/usr/include -I./src/lexer/ -D_GNU_SOURCE -D_REENTRANT -O2 -fwrapv -pipe -Wformat -Werror=format-security -gdwarf-4 -fno-debug-types-section -fvar-tracking-assignments -g2 -Wp,-D_FORTIFY_SOURCE=2 -fstack-protector-strong --param=ssp-buffer-size=4 -Werror=trampolines -fPIC -mtune=generic -march=x86-64 -gdwarf-4 -fno-debug-types-section -fvar-tracking-assignments -g2 -ftemplate-depth-50 -MT XQReturn.lo -MD -MP -MF .deps/XQReturn.Tpo -c -o XQReturn.lo `test -f 'src/ast/XQReturn.cpp' || echo './'`src/ast/XQReturn.cpp libtool: compile: x86_64-pld-linux-gnux32-g++ -DHAVE_CONFIG_H -I. -I./src/config -I./include/ -I/usr/include -I./src/lexer/ -D_GNU_SOURCE -D_REENTRANT -O2 -fwrapv -pipe -Wformat -Werror=format-security -gdwarf-4 -fno-debug-types-section -fvar-tracking-assignments -g2 -Wp,-D_FORTIFY_SOURCE=2 -fstack-protector-strong --param=ssp-buffer-size=4 -Werror=trampolines -fPIC -mtune=generic -march=x86-64 -gdwarf-4 -fno-debug-types-section -fvar-tracking-assignments -g2 -ftemplate-depth-50 -MT XQReturn.lo -MD -MP -MF .deps/XQReturn.Tpo -c src/ast/XQReturn.cpp -fPIC -DPIC -o .libs/XQReturn.o In file included from src/ast/XQReturn.cpp:26: ./include/xqilla/utils/XPath2Utils.hpp: In static member function 'static bool XPath2Utils::equals(const XMLCh*, const XMLCh*)': ./include/xqilla/utils/XPath2Utils.hpp:107:25: warning: ISO C++17 does not allow 'register' storage class specifier [-Wregister] 107 | register const XMLCh* psz1 = str1; | ^~~~ ./include/xqilla/utils/XPath2Utils.hpp:108:25: warning: ISO C++17 does not allow 'register' storage class specifier [-Wregister] 108 | register const XMLCh* psz2 = str2; | ^~~~ ./include/xqilla/utils/XPath2Utils.hpp: In static member function 'static int XPath2Utils::compare(const XMLCh*, const XMLCh*)': ./include/xqilla/utils/XPath2Utils.hpp:128:16: warning: ISO C++17 does not allow 'register' storage class specifier [-Wregister] 128 | register int cmp; | ^~~ In file included from ./include/xqilla/events/EventGenerator.hpp:24, from ./include/xqilla/ast/ASTNode.hpp:27, from ./include/xqilla/ast/ASTNodeImpl.hpp:26, from ./include/xqilla/ast/XQReturn.hpp:23, from src/ast/XQReturn.cpp:20: In destructor 'virtual ReferenceCounted::~ReferenceCounted()', inlined from 'virtual void ReferenceCounted::decrementRefCount() const' at ./include/xqilla/framework/ReferenceCounted.hpp:47:14, inlined from 'virtual void ReferenceCounted::decrementRefCount() const' at ./include/xqilla/framework/ReferenceCounted.hpp:44:16, inlined from 'RefCountPointer<T>::~RefCountPointer() [with T = TupleResult]' at ./include/xqilla/framework/ReferenceCounted.hpp:91:38, inlined from 'ReturnResult::~ReturnResult()' at src/ast/XQReturn.cpp:58:7: ./include/xqilla/framework/ReferenceCounted.hpp:35:32: warning: 'void operator delete(void*, std::size_t)' called on pointer '((RefCountPointer<TupleResult>*)this)[6].RefCountPointer<TupleResult>::_p' with nonzero offset 16 [-Wfree-nonheap-object] 35 | virtual ~ReferenceCounted() {} | ^ In destructor 'virtual ReferenceCounted::~ReferenceCounted()', inlined from 'virtual void ReferenceCounted::decrementRefCount() const' at ./include/xqilla/framework/ReferenceCounted.hpp:47:14, inlined from 'virtual void ReferenceCounted::decrementRefCount() const' at ./include/xqilla/framework/ReferenceCounted.hpp:44:16, inlined from 'RefCountPointer<T>::~RefCountPointer() [with T = TupleResult]' at ./include/xqilla/framework/ReferenceCounted.hpp:91:38, inlined from 'virtual ReturnResult::~ReturnResult()' at src/ast/XQReturn.cpp:58:7, inlined from 'virtual ReturnResult::~ReturnResult()' at src/ast/XQReturn.cpp:58:7: ./include/xqilla/framework/ReferenceCounted.hpp:35:32: warning: 'void operator delete(void*, std::size_t)' called on pointer '((RefCountPointer<TupleResult>*)this)[6].RefCountPointer<TupleResult>::_p' with nonzero offset 16 [-Wfree-nonheap-object] 35 | virtual ~ReferenceCounted() {} | ^ In destructor 'virtual ReferenceCounted::~ReferenceCounted()', inlined from 'virtual void ReferenceCounted::decrementRefCount() const' at ./include/xqilla/framework/ReferenceCounted.hpp:47:14, inlined from 'virtual void ReferenceCounted::decrementRefCount() const' at ./include/xqilla/framework/ReferenceCounted.hpp:44:16, inlined from 'RefCountPointer<T>& RefCountPointer<T>::operator=(const RefCountPointer<T>&) [with T = TupleResult]' at ./include/xqilla/framework/ReferenceCounted.hpp:82:40, inlined from 'virtual Item::Ptr ReturnResult::next(DynamicContext*)' at src/ast/XQReturn.cpp:78:18: ./include/xqilla/framework/ReferenceCounted.hpp:35:32: warning: 'void operator delete(void*, std::size_t)' called on pointer '((const RefCountPointer<TupleResult>*)this)[6].RefCountPointer<TupleResult>::_p' with nonzero offset 16 [-Wfree-nonheap-object] 35 | virtual ~ReferenceCounted() {} | ^ In destructor 'virtual ReferenceCounted::~ReferenceCounted()', inlined from 'virtual void ReferenceCounted::decrementRefCount() const' at ./include/xqilla/framework/ReferenceCounted.hpp:47:14, inlined from 'virtual void ReferenceCounted::decrementRefCount() const' at ./include/xqilla/framework/ReferenceCounted.hpp:44:16, inlined from 'RefCountPointer<T>::~RefCountPointer() [with T = TupleResult]' at ./include/xqilla/framework/ReferenceCounted.hpp:91:38: ./include/xqilla/framework/ReferenceCounted.hpp:35:32: warning: 'void operator delete(void*, std::size_t)' called on pointer '*this.RefCountPointer<TupleResult>::_p' with nonzero offset 16 [-Wfree-nonheap-object] 35 | virtual ~ReferenceCounted() {} | ^ In destructor 'virtual ReferenceCounted::~ReferenceCounted()', inlined from 'virtual void ReferenceCounted::decrementRefCount() const' at ./include/xqilla/framework/ReferenceCounted.hpp:47:14, inlined from 'virtual void ReferenceCounted::decrementRefCount() const' at ./include/xqilla/framework/ReferenceCounted.hpp:44:16, inlined from 'RefCountPointer<T>::~RefCountPointer() [with T = TupleResult]' at ./include/xqilla/framework/ReferenceCounted.hpp:91:38, inlined from 'virtual Result XQReturn::createResult(DynamicContext*, int) const' at src/ast/XQReturn.cpp:100:49: ./include/xqilla/framework/ReferenceCounted.hpp:35:32: warning: 'void operator delete(void*, std::size_t)' called on pointer '<anonymous>.RefCountPointer<TupleResult>::_p' with nonzero offset 16 [-Wfree-nonheap-object] 35 | virtual ~ReferenceCounted() {} | ^ In destructor 'virtual ReferenceCounted::~ReferenceCounted()', inlined from 'virtual void ReferenceCounted::decrementRefCount() const' at ./include/xqilla/framework/ReferenceCounted.hpp:47:14, inlined from 'virtual void ReferenceCounted::decrementRefCount() const' at ./include/xqilla/framework/ReferenceCounted.hpp:44:16, inlined from 'RefCountPointer<T>::~RefCountPointer() [with T = TupleResult]' at ./include/xqilla/framework/ReferenceCounted.hpp:91:38, inlined from 'virtual EventGenerator::Ptr XQReturn::generateEvents(EventHandler*, DynamicContext*, bool, bool) const' at src/ast/XQReturn.cpp:116:1: ./include/xqilla/framework/ReferenceCounted.hpp:35:32: warning: 'void operator delete(void*, std::size_t)' called on pointer 'tuples.RefCountPointer<TupleResult>::_p' with nonzero offset 16 [-Wfree-nonheap-object] 35 | virtual ~ReferenceCounted() {} | ^ In destructor 'virtual ReferenceCounted::~ReferenceCounted()', inlined from 'virtual void ReferenceCounted::decrementRefCount() const' at ./include/xqilla/framework/ReferenceCounted.hpp:47:14, inlined from 'virtual void ReferenceCounted::decrementRefCount() const' at ./include/xqilla/framework/ReferenceCounted.hpp:44:16, inlined from 'RefCountPointer<T>::~RefCountPointer() [with T = TupleResult]' at ./include/xqilla/framework/ReferenceCounted.hpp:91:38, inlined from 'virtual PendingUpdateList XQReturn::createUpdateList(DynamicContext*) const' at src/ast/XQReturn.cpp:131:1: ./include/xqilla/framework/ReferenceCounted.hpp:35:32: warning: 'void operator delete(void*, std::size_t)' called on pointer 'tuples.RefCountPointer<TupleResult>::_p' with nonzero offset 16 [-Wfree-nonheap-object] 35 | virtual ~ReferenceCounted() {} | ^ libtool: compile: x86_64-pld-linux-gnux32-g++ -DHAVE_CONFIG_H -I. -I./src/config -I./include/ -I/usr/include -I./src/lexer/ -D_GNU_SOURCE -D_REENTRANT -O2 -fwrapv -pipe -Wformat -Werror=format-security -gdwarf-4 -fno-debug-types-section -fvar-tracking-assignments -g2 -Wp,-D_FORTIFY_SOURCE=2 -fstack-protector-strong --param=ssp-buffer-size=4 -Werror=trampolines -fPIC -mtune=generic -march=x86-64 -gdwarf-4 -fno-debug-types-section -fvar-tracking-assignments -g2 -ftemplate-depth-50 -MT XQReturn.lo -MD -MP -MF .deps/XQReturn.Tpo -c src/ast/XQReturn.cpp -o XQReturn.o >/dev/null 2>&1 mv -f .deps/XQReturn.Tpo .deps/XQReturn.Plo make[1]: Leaving directory '/tmp/B.ache4phw/BUILD/XQilla-2.3.4' make: *** [Makefile:5269: all-recursive] Error 1 error: Bad exit status from /tmp/B.ache4phw/BUILD/tmp/rpm-tmp.tWAJ6R (%build) RPM build errors: Bad exit status from /tmp/B.ache4phw/BUILD/tmp/rpm-tmp.tWAJ6R (%build) ended at: Sat Sep 24 21:39:17 2022, done in 0:00:38.276692 error: No files produced. + chmod -R u+rwX /tmp/B.ache4phw/BUILD + rm -rf /tmp/B.ache4phw/tmp /tmp/B.ache4phw/BUILD + rm -rf /tmp/B.ache4phw Begin-PLD-Builder-Info Build-Time: user:147.07s sys:15.76s real:41.59s (faults io:5 non-io:2925801) End-PLD-Builder-Info
[Back to list of logs] [View rpm -qa of builder]