FailedOk

th/SRPMS[OK]
th/x32[OK]
th/i686[OK]
th/x86_64[OK]

ac/SRPMS[OK]
ac/i386[OK]
ac/i586[OK]
ac/i686[OK]
ac/alpha[OK]
ac/amd64[OK]
ac/athlon[OK]
ac/ppc[OK]
ac/sparc[OK]
ac/sparc64[OK]

Advanced Search
main()
Powered by PLD Linux
(c) 2002-2021 PLD Team
$Revision: 1.37 $
Powered by The Golden Path.
Your IP: 3.236.122.9

xtrabackup 6ec5869e-6dae-4e8a-9d50-c326f228cc99

Status:Failed
Source URL:https://buildlogs.pld-linux.org/pld/th/x32/FAIL/xtrabackup,6ec5869e-6dae-4e8a-9d50-c326f228cc99.bz2
text/plain URL:View!
full text:View!
rpm -qa of builder:View!
Date:2021/04/27 17:35:29
Runtime:0:01:54.295546

Toc:

  • error 1
  • collect2: error: ld returned 1 exit status
  • error 2
  • make[2]: *** [storage/innobase/xtrabackup/src/CMakeFiles/xbstream.dir/build.make:255: storage/innobase/xtrabackup/src/xbstream] Error 1
  • error 3
  • make[1]: *** [CMakeFiles/Makefile2:2274: storage/innobase/xtrabackup/src/CMakeFiles/xbstream.dir/all] Error 2
  • error 4
  • /usr/include/c++/10.3.0/bits/unique_ptr.h:270:9: error: no matching function for call to 'std::__uniq_ptr_data<xbcloud::S3_signer, std::default_delete<xbcloud::S3_signer>, true, true>::__uniq_ptr_data()'
  • error 5
  • /usr/include/c++/10.3.0/bits/unique_ptr.h:321:9: error: no matching function for call to 'std::__uniq_ptr_data<xbcloud::Object_store, std::default_delete<xbcloud::Object_store>, true, true>::__uniq_ptr_data()'
  • error 6
  • /usr/include/c++/10.3.0/bits/unique_ptr.h:270:9: error: no matching function for call to 'std::__uniq_ptr_data<xbcloud_put(xbcloud::Object_store*, const string&, const string&, bool)::file_entry_t, std::default_delete<xbcloud_put(xbcloud::Object_store*, const string&, const string&, bool)::file_entry_t>, true, true>::__uniq_ptr_data()'
  • error 7
  • make[2]: *** [storage/innobase/xtrabackup/src/xbcloud/CMakeFiles/xbcloud.dir/build.make:86: storage/innobase/xtrabackup/src/xbcloud/CMakeFiles/xbcloud.dir/xbcloud.cc.o] Error 1
  • error 8
  • /usr/include/c++/10.3.0/bits/unique_ptr.h:270:9: error: no matching function for call to 'std::__uniq_ptr_data<xbcloud::S3_signer, std::default_delete<xbcloud::S3_signer>, true, true>::__uniq_ptr_data()'
  • error 9
  • make[2]: *** [storage/innobase/xtrabackup/src/xbcloud/CMakeFiles/xbcloud.dir/build.make:125: storage/innobase/xtrabackup/src/xbcloud/CMakeFiles/xbcloud.dir/s3.cc.o] Error 1
  • error 10
  • make[1]: *** [CMakeFiles/Makefile2:3171: storage/innobase/xtrabackup/src/xbcloud/CMakeFiles/xbcloud.dir/all] Error 2
  • error 11
  • error: Bad exit status from /tmp/B.M3c9ho/BUILD/tmp/rpm-tmp.NFzwi7 (%build)
  • error 12
  • RPM build errors:
  • error 13
  • error: No files produced.

Content:

[ 28%] Building C object storage/innobase/xtrabackup/src/CMakeFiles/xbcrypt.dir/ds_encrypt.c.o
cd /tmp/B.M3c9ho/BUILD/percona-xtrabackup-percona-xtrabackup-2.4.20/build/storage/innobase/xtrabackup/src && /usr/bin/x86_64-pld-linux-gnux32-gcc -DBOOST_GEOMETRY_SQRT_CHECK_FINITENESS -DCOMPILER_HINTS -DHAVE_CONFIG_H -DHAVE_FALLOC_PUNCH_HOLE_AND_KEEP_SIZE=1 -DHAVE_IB_ATOMIC_PTHREAD_T_GCC=1 -DHAVE_IB_GCC_ATOMIC_COMPARE_EXCHANGE=1 -DHAVE_IB_GCC_ATOMIC_THREAD_FENCE=1 -DHAVE_IB_GCC_SYNC_SYNCHRONISE=1 -DHAVE_IB_LINUX_FUTEX=1 -DHAVE_LIBEVENT2 -DHAVE_LZ4=1 -DHAVE_NANOSLEEP=1 -DHAVE_OPENSSL -DHAVE_SCHED_GETCPU=1 -DLINUX_NATIVE_AIO=1 -DMUTEX_EVENT -DXTRABACKUP -D_FILE_OFFSET_BITS=64 -D_GNU_SOURCE -I/tmp/B.M3c9ho/BUILD/percona-xtrabackup-percona-xtrabackup-2.4.20/build/include -I/tmp/B.M3c9ho/BUILD/percona-xtrabackup-percona-xtrabackup-2.4.20/extra/rapidjson/include -I/tmp/B.M3c9ho/BUILD/percona-xtrabackup-percona-xtrabackup-2.4.20/build/libbinlogevents/include -I/tmp/B.M3c9ho/BUILD/percona-xtrabackup-percona-xtrabackup-2.4.20/libbinlogevents/export -I/tmp/B.M3c9ho/BUILD/percona-xtrabackup-percona-xtrabackup-2.4.20/storage/innobase/include -I/tmp/B.M3c9ho/BUILD/percona-xtrabackup-percona-xtrabackup-2.4.20/storage/innobase/handler -I/tmp/B.M3c9ho/BUILD/percona-xtrabackup-percona-xtrabackup-2.4.20/libbinlogevents/include -I/tmp/B.M3c9ho/BUILD/percona-xtrabackup-percona-xtrabackup-2.4.20/include -I/tmp/B.M3c9ho/BUILD/percona-xtrabackup-percona-xtrabackup-2.4.20/sql -I/tmp/B.M3c9ho/BUILD/percona-xtrabackup-percona-xtrabackup-2.4.20/sql/auth -I/tmp/B.M3c9ho/BUILD/percona-xtrabackup-percona-xtrabackup-2.4.20/regex -I/tmp/B.M3c9ho/BUILD/percona-xtrabackup-percona-xtrabackup-2.4.20/storage/innobase/xtrabackup/src -I/tmp/B.M3c9ho/BUILD/percona-xtrabackup-percona-xtrabackup-2.4.20/storage/innobase/xtrabackup/src/libarchive/libarchive -I/tmp/B.M3c9ho/BUILD/percona-xtrabackup-percona-xtrabackup-2.4.20/storage/innobase/xtrabackup/src/quicklz -I/tmp/B.M3c9ho/BUILD/percona-xtrabackup-percona-xtrabackup-2.4.20/storage/innobase/xtrabackup/src/crc -I/tmp/B.M3c9ho/BUILD/percona-xtrabackup-percona-xtrabackup-2.4.20/build/storage/innobase/xtrabackup/src -I/tmp/B.M3c9ho/BUILD/percona-xtrabackup-percona-xtrabackup-2.4.20/plugin/keyring -I/tmp/B.M3c9ho/BUILD/percona-xtrabackup-percona-xtrabackup-2.4.20/plugin/keyring_vault -I/tmp/B.M3c9ho/BUILD/percona-xtrabackup-percona-xtrabackup-2.4.20/include/boost_1_59_0/patches  -fPIC -Wall -Wextra -Wformat-security -Wvla -Wimplicit-fallthrough=2 -Wwrite-strings -Wdeclaration-after-statement -O3 -g -fabi-version=2 -fno-omit-frame-pointer -fno-strict-aliasing -DDBUG_OFF   -DUNIV_LINUX -D_GNU_SOURCE=1 -o CMakeFiles/xbcrypt.dir/ds_encrypt.c.o   -c /tmp/B.M3c9ho/BUILD/percona-xtrabackup-percona-xtrabackup-2.4.20/storage/innobase/xtrabackup/src/ds_encrypt.c
make[2]: Leaving directory '/tmp/B.M3c9ho/BUILD/percona-xtrabackup-percona-xtrabackup-2.4.20/build'
make[2]: Entering directory '/tmp/B.M3c9ho/BUILD/percona-xtrabackup-percona-xtrabackup-2.4.20/build'
[ 27%] Building C object extra/CMakeFiles/comp_err.dir/comp_err.c.o
cd /tmp/B.M3c9ho/BUILD/percona-xtrabackup-percona-xtrabackup-2.4.20/build/extra && /usr/bin/x86_64-pld-linux-gnux32-gcc -DBOOST_GEOMETRY_SQRT_CHECK_FINITENESS -DHAVE_CONFIG_H -DHAVE_LIBEVENT2 -DMUTEX_EVENT -DXTRABACKUP -D_FILE_OFFSET_BITS=64 -D_GNU_SOURCE -I/tmp/B.M3c9ho/BUILD/percona-xtrabackup-percona-xtrabackup-2.4.20/build/include -I/tmp/B.M3c9ho/BUILD/percona-xtrabackup-percona-xtrabackup-2.4.20/extra/rapidjson/include -I/tmp/B.M3c9ho/BUILD/percona-xtrabackup-percona-xtrabackup-2.4.20/build/libbinlogevents/include -I/tmp/B.M3c9ho/BUILD/percona-xtrabackup-percona-xtrabackup-2.4.20/libbinlogevents/export -I/tmp/B.M3c9ho/BUILD/percona-xtrabackup-percona-xtrabackup-2.4.20/include -I/tmp/B.M3c9ho/BUILD/percona-xtrabackup-percona-xtrabackup-2.4.20/storage/ndb/include -I/tmp/B.M3c9ho/BUILD/percona-xtrabackup-percona-xtrabackup-2.4.20/build/storage/ndb/include -I/tmp/B.M3c9ho/BUILD/percona-xtrabackup-percona-xtrabackup-2.4.20/storage/ndb/include/ndbapi -I/tmp/B.M3c9ho/BUILD/percona-xtrabackup-percona-xtrabackup-2.4.20/storage/ndb/include/mgmapi  -fPIC -Wall -Wextra -Wformat-security -Wvla -Wimplicit-fallthrough=2 -Wwrite-strings -Wdeclaration-after-statement -O3 -g -fabi-version=2 -fno-omit-frame-pointer -fno-strict-aliasing -DDBUG_OFF   -o CMakeFiles/comp_err.dir/comp_err.c.o   -c /tmp/B.M3c9ho/BUILD/percona-xtrabackup-percona-xtrabackup-2.4.20/extra/comp_err.c
make[2]: Leaving directory '/tmp/B.M3c9ho/BUILD/percona-xtrabackup-percona-xtrabackup-2.4.20/build'
make[2]: Entering directory '/tmp/B.M3c9ho/BUILD/percona-xtrabackup-percona-xtrabackup-2.4.20/build'
[ 28%] Building C object storage/innobase/xtrabackup/src/CMakeFiles/xbstream.dir/datasink.c.o
cd /tmp/B.M3c9ho/BUILD/percona-xtrabackup-percona-xtrabackup-2.4.20/build/storage/innobase/xtrabackup/src && /usr/bin/x86_64-pld-linux-gnux32-gcc -DBOOST_GEOMETRY_SQRT_CHECK_FINITENESS -DCOMPILER_HINTS -DHAVE_CONFIG_H -DHAVE_FALLOC_PUNCH_HOLE_AND_KEEP_SIZE=1 -DHAVE_IB_ATOMIC_PTHREAD_T_GCC=1 -DHAVE_IB_GCC_ATOMIC_COMPARE_EXCHANGE=1 -DHAVE_IB_GCC_ATOMIC_THREAD_FENCE=1 -DHAVE_IB_GCC_SYNC_SYNCHRONISE=1 -DHAVE_IB_LINUX_FUTEX=1 -DHAVE_LIBEVENT2 -DHAVE_LZ4=1 -DHAVE_NANOSLEEP=1 -DHAVE_OPENSSL -DHAVE_SCHED_GETCPU=1 -DLINUX_NATIVE_AIO=1 -DMUTEX_EVENT -DXTRABACKUP -D_FILE_OFFSET_BITS=64 -D_GNU_SOURCE -I/tmp/B.M3c9ho/BUILD/percona-xtrabackup-percona-xtrabackup-2.4.20/build/include -I/tmp/B.M3c9ho/BUILD/percona-xtrabackup-percona-xtrabackup-2.4.20/extra/rapidjson/include -I/tmp/B.M3c9ho/BUILD/percona-xtrabackup-percona-xtrabackup-2.4.20/build/libbinlogevents/include -I/tmp/B.M3c9ho/BUILD/percona-xtrabackup-percona-xtrabackup-2.4.20/libbinlogevents/export -I/tmp/B.M3c9ho/BUILD/percona-xtrabackup-percona-xtrabackup-2.4.20/storage/innobase/include -I/tmp/B.M3c9ho/BUILD/percona-xtrabackup-percona-xtrabackup-2.4.20/storage/innobase/handler -I/tmp/B.M3c9ho/BUILD/percona-xtrabackup-percona-xtrabackup-2.4.20/libbinlogevents/include -I/tmp/B.M3c9ho/BUILD/percona-xtrabackup-percona-xtrabackup-2.4.20/include -I/tmp/B.M3c9ho/BUILD/percona-xtrabackup-percona-xtrabackup-2.4.20/sql -I/tmp/B.M3c9ho/BUILD/percona-xtrabackup-percona-xtrabackup-2.4.20/sql/auth -I/tmp/B.M3c9ho/BUILD/percona-xtrabackup-percona-xtrabackup-2.4.20/regex -I/tmp/B.M3c9ho/BUILD/percona-xtrabackup-percona-xtrabackup-2.4.20/storage/innobase/xtrabackup/src -I/tmp/B.M3c9ho/BUILD/percona-xtrabackup-percona-xtrabackup-2.4.20/storage/innobase/xtrabackup/src/libarchive/libarchive -I/tmp/B.M3c9ho/BUILD/percona-xtrabackup-percona-xtrabackup-2.4.20/storage/innobase/xtrabackup/src/quicklz -I/tmp/B.M3c9ho/BUILD/percona-xtrabackup-percona-xtrabackup-2.4.20/storage/innobase/xtrabackup/src/crc -I/tmp/B.M3c9ho/BUILD/percona-xtrabackup-percona-xtrabackup-2.4.20/build/storage/innobase/xtrabackup/src -I/tmp/B.M3c9ho/BUILD/percona-xtrabackup-percona-xtrabackup-2.4.20/plugin/keyring -I/tmp/B.M3c9ho/BUILD/percona-xtrabackup-percona-xtrabackup-2.4.20/plugin/keyring_vault -I/tmp/B.M3c9ho/BUILD/percona-xtrabackup-percona-xtrabackup-2.4.20/include/boost_1_59_0/patches  -fPIC -Wall -Wextra -Wformat-security -Wvla -Wimplicit-fallthrough=2 -Wwrite-strings -Wdeclaration-after-statement -O3 -g -fabi-version=2 -fno-omit-frame-pointer -fno-strict-aliasing -DDBUG_OFF   -DUNIV_LINUX -D_GNU_SOURCE=1 -o CMakeFiles/xbstream.dir/datasink.c.o   -c /tmp/B.M3c9ho/BUILD/percona-xtrabackup-percona-xtrabackup-2.4.20/storage/innobase/xtrabackup/src/datasink.c
make[2]: Leaving directory '/tmp/B.M3c9ho/BUILD/percona-xtrabackup-percona-xtrabackup-2.4.20/build'
make[2]: Entering directory '/tmp/B.M3c9ho/BUILD/percona-xtrabackup-percona-xtrabackup-2.4.20/build'
[ 28%] Building C object storage/innobase/xtrabackup/src/CMakeFiles/xbcrypt.dir/ds_local.c.o
cd /tmp/B.M3c9ho/BUILD/percona-xtrabackup-percona-xtrabackup-2.4.20/build/storage/innobase/xtrabackup/src && /usr/bin/x86_64-pld-linux-gnux32-gcc -DBOOST_GEOMETRY_SQRT_CHECK_FINITENESS -DCOMPILER_HINTS -DHAVE_CONFIG_H -DHAVE_FALLOC_PUNCH_HOLE_AND_KEEP_SIZE=1 -DHAVE_IB_ATOMIC_PTHREAD_T_GCC=1 -DHAVE_IB_GCC_ATOMIC_COMPARE_EXCHANGE=1 -DHAVE_IB_GCC_ATOMIC_THREAD_FENCE=1 -DHAVE_IB_GCC_SYNC_SYNCHRONISE=1 -DHAVE_IB_LINUX_FUTEX=1 -DHAVE_LIBEVENT2 -DHAVE_LZ4=1 -DHAVE_NANOSLEEP=1 -DHAVE_OPENSSL -DHAVE_SCHED_GETCPU=1 -DLINUX_NATIVE_AIO=1 -DMUTEX_EVENT -DXTRABACKUP -D_FILE_OFFSET_BITS=64 -D_GNU_SOURCE -I/tmp/B.M3c9ho/BUILD/percona-xtrabackup-percona-xtrabackup-2.4.20/build/include -I/tmp/B.M3c9ho/BUILD/percona-xtrabackup-percona-xtrabackup-2.4.20/extra/rapidjson/include -I/tmp/B.M3c9ho/BUILD/percona-xtrabackup-percona-xtrabackup-2.4.20/build/libbinlogevents/include -I/tmp/B.M3c9ho/BUILD/percona-xtrabackup-percona-xtrabackup-2.4.20/libbinlogevents/export -I/tmp/B.M3c9ho/BUILD/percona-xtrabackup-percona-xtrabackup-2.4.20/storage/innobase/include -I/tmp/B.M3c9ho/BUILD/percona-xtrabackup-percona-xtrabackup-2.4.20/storage/innobase/handler -I/tmp/B.M3c9ho/BUILD/percona-xtrabackup-percona-xtrabackup-2.4.20/libbinlogevents/include -I/tmp/B.M3c9ho/BUILD/percona-xtrabackup-percona-xtrabackup-2.4.20/include -I/tmp/B.M3c9ho/BUILD/percona-xtrabackup-percona-xtrabackup-2.4.20/sql -I/tmp/B.M3c9ho/BUILD/percona-xtrabackup-percona-xtrabackup-2.4.20/sql/auth -I/tmp/B.M3c9ho/BUILD/percona-xtrabackup-percona-xtrabackup-2.4.20/regex -I/tmp/B.M3c9ho/BUILD/percona-xtrabackup-percona-xtrabackup-2.4.20/storage/innobase/xtrabackup/src -I/tmp/B.M3c9ho/BUILD/percona-xtrabackup-percona-xtrabackup-2.4.20/storage/innobase/xtrabackup/src/libarchive/libarchive -I/tmp/B.M3c9ho/BUILD/percona-xtrabackup-percona-xtrabackup-2.4.20/storage/innobase/xtrabackup/src/quicklz -I/tmp/B.M3c9ho/BUILD/percona-xtrabackup-percona-xtrabackup-2.4.20/storage/innobase/xtrabackup/src/crc -I/tmp/B.M3c9ho/BUILD/percona-xtrabackup-percona-xtrabackup-2.4.20/build/storage/innobase/xtrabackup/src -I/tmp/B.M3c9ho/BUILD/percona-xtrabackup-percona-xtrabackup-2.4.20/plugin/keyring -I/tmp/B.M3c9ho/BUILD/percona-xtrabackup-percona-xtrabackup-2.4.20/plugin/keyring_vault -I/tmp/B.M3c9ho/BUILD/percona-xtrabackup-percona-xtrabackup-2.4.20/include/boost_1_59_0/patches  -fPIC -Wall -Wextra -Wformat-security -Wvla -Wimplicit-fallthrough=2 -Wwrite-strings -Wdeclaration-after-statement -O3 -g -fabi-version=2 -fno-omit-frame-pointer -fno-strict-aliasing -DDBUG_OFF   -DUNIV_LINUX -D_GNU_SOURCE=1 -o CMakeFiles/xbcrypt.dir/ds_local.c.o   -c /tmp/B.M3c9ho/BUILD/percona-xtrabackup-percona-xtrabackup-2.4.20/storage/innobase/xtrabackup/src/ds_local.c
make[2]: Leaving directory '/tmp/B.M3c9ho/BUILD/percona-xtrabackup-percona-xtrabackup-2.4.20/build'
make[2]: Entering directory '/tmp/B.M3c9ho/BUILD/percona-xtrabackup-percona-xtrabackup-2.4.20/build'
[ 28%] Building C object storage/innobase/xtrabackup/src/CMakeFiles/xbstream.dir/ds_decrypt.c.o
cd /tmp/B.M3c9ho/BUILD/percona-xtrabackup-percona-xtrabackup-2.4.20/build/storage/innobase/xtrabackup/src && /usr/bin/x86_64-pld-linux-gnux32-gcc -DBOOST_GEOMETRY_SQRT_CHECK_FINITENESS -DCOMPILER_HINTS -DHAVE_CONFIG_H -DHAVE_FALLOC_PUNCH_HOLE_AND_KEEP_SIZE=1 -DHAVE_IB_ATOMIC_PTHREAD_T_GCC=1 -DHAVE_IB_GCC_ATOMIC_COMPARE_EXCHANGE=1 -DHAVE_IB_GCC_ATOMIC_THREAD_FENCE=1 -DHAVE_IB_GCC_SYNC_SYNCHRONISE=1 -DHAVE_IB_LINUX_FUTEX=1 -DHAVE_LIBEVENT2 -DHAVE_LZ4=1 -DHAVE_NANOSLEEP=1 -DHAVE_OPENSSL -DHAVE_SCHED_GETCPU=1 -DLINUX_NATIVE_AIO=1 -DMUTEX_EVENT -DXTRABACKUP -D_FILE_OFFSET_BITS=64 -D_GNU_SOURCE -I/tmp/B.M3c9ho/BUILD/percona-xtrabackup-percona-xtrabackup-2.4.20/build/include -I/tmp/B.M3c9ho/BUILD/percona-xtrabackup-percona-xtrabackup-2.4.20/extra/rapidjson/include -I/tmp/B.M3c9ho/BUILD/percona-xtrabackup-percona-xtrabackup-2.4.20/build/libbinlogevents/include -I/tmp/B.M3c9ho/BUILD/percona-xtrabackup-percona-xtrabackup-2.4.20/libbinlogevents/export -I/tmp/B.M3c9ho/BUILD/percona-xtrabackup-percona-xtrabackup-2.4.20/storage/innobase/include -I/tmp/B.M3c9ho/BUILD/percona-xtrabackup-percona-xtrabackup-2.4.20/storage/innobase/handler -I/tmp/B.M3c9ho/BUILD/percona-xtrabackup-percona-xtrabackup-2.4.20/libbinlogevents/include -I/tmp/B.M3c9ho/BUILD/percona-xtrabackup-percona-xtrabackup-2.4.20/include -I/tmp/B.M3c9ho/BUILD/percona-xtrabackup-percona-xtrabackup-2.4.20/sql -I/tmp/B.M3c9ho/BUILD/percona-xtrabackup-percona-xtrabackup-2.4.20/sql/auth -I/tmp/B.M3c9ho/BUILD/percona-xtrabackup-percona-xtrabackup-2.4.20/regex -I/tmp/B.M3c9ho/BUILD/percona-xtrabackup-percona-xtrabackup-2.4.20/storage/innobase/xtrabackup/src -I/tmp/B.M3c9ho/BUILD/percona-xtrabackup-percona-xtrabackup-2.4.20/storage/innobase/xtrabackup/src/libarchive/libarchive -I/tmp/B.M3c9ho/BUILD/percona-xtrabackup-percona-xtrabackup-2.4.20/storage/innobase/xtrabackup/src/quicklz -I/tmp/B.M3c9ho/BUILD/percona-xtrabackup-percona-xtrabackup-2.4.20/storage/innobase/xtrabackup/src/crc -I/tmp/B.M3c9ho/BUILD/percona-xtrabackup-percona-xtrabackup-2.4.20/build/storage/innobase/xtrabackup/src -I/tmp/B.M3c9ho/BUILD/percona-xtrabackup-percona-xtrabackup-2.4.20/plugin/keyring -I/tmp/B.M3c9ho/BUILD/percona-xtrabackup-percona-xtrabackup-2.4.20/plugin/keyring_vault -I/tmp/B.M3c9ho/BUILD/percona-xtrabackup-percona-xtrabackup-2.4.20/include/boost_1_59_0/patches  -fPIC -Wall -Wextra -Wformat-security -Wvla -Wimplicit-fallthrough=2 -Wwrite-strings -Wdeclaration-after-statement -O3 -g -fabi-version=2 -fno-omit-frame-pointer -fno-strict-aliasing -DDBUG_OFF   -DUNIV_LINUX -D_GNU_SOURCE=1 -o CMakeFiles/xbstream.dir/ds_decrypt.c.o   -c /tmp/B.M3c9ho/BUILD/percona-xtrabackup-percona-xtrabackup-2.4.20/storage/innobase/xtrabackup/src/ds_decrypt.c
make[2]: Leaving directory '/tmp/B.M3c9ho/BUILD/percona-xtrabackup-percona-xtrabackup-2.4.20/build'
make[2]: Entering directory '/tmp/B.M3c9ho/BUILD/percona-xtrabackup-percona-xtrabackup-2.4.20/build'
[ 28%] Building C object storage/innobase/xtrabackup/src/CMakeFiles/xbcrypt.dir/ds_decrypt.c.o
cd /tmp/B.M3c9ho/BUILD/percona-xtrabackup-percona-xtrabackup-2.4.20/build/storage/innobase/xtrabackup/src && /usr/bin/x86_64-pld-linux-gnux32-gcc -DBOOST_GEOMETRY_SQRT_CHECK_FINITENESS -DCOMPILER_HINTS -DHAVE_CONFIG_H -DHAVE_FALLOC_PUNCH_HOLE_AND_KEEP_SIZE=1 -DHAVE_IB_ATOMIC_PTHREAD_T_GCC=1 -DHAVE_IB_GCC_ATOMIC_COMPARE_EXCHANGE=1 -DHAVE_IB_GCC_ATOMIC_THREAD_FENCE=1 -DHAVE_IB_GCC_SYNC_SYNCHRONISE=1 -DHAVE_IB_LINUX_FUTEX=1 -DHAVE_LIBEVENT2 -DHAVE_LZ4=1 -DHAVE_NANOSLEEP=1 -DHAVE_OPENSSL -DHAVE_SCHED_GETCPU=1 -DLINUX_NATIVE_AIO=1 -DMUTEX_EVENT -DXTRABACKUP -D_FILE_OFFSET_BITS=64 -D_GNU_SOURCE -I/tmp/B.M3c9ho/BUILD/percona-xtrabackup-percona-xtrabackup-2.4.20/build/include -I/tmp/B.M3c9ho/BUILD/percona-xtrabackup-percona-xtrabackup-2.4.20/extra/rapidjson/include -I/tmp/B.M3c9ho/BUILD/percona-xtrabackup-percona-xtrabackup-2.4.20/build/libbinlogevents/include -I/tmp/B.M3c9ho/BUILD/percona-xtrabackup-percona-xtrabackup-2.4.20/libbinlogevents/export -I/tmp/B.M3c9ho/BUILD/percona-xtrabackup-percona-xtrabackup-2.4.20/storage/innobase/include -I/tmp/B.M3c9ho/BUILD/percona-xtrabackup-percona-xtrabackup-2.4.20/storage/innobase/handler -I/tmp/B.M3c9ho/BUILD/percona-xtrabackup-percona-xtrabackup-2.4.20/libbinlogevents/include -I/tmp/B.M3c9ho/BUILD/percona-xtrabackup-percona-xtrabackup-2.4.20/include -I/tmp/B.M3c9ho/BUILD/percona-xtrabackup-percona-xtrabackup-2.4.20/sql -I/tmp/B.M3c9ho/BUILD/percona-xtrabackup-percona-xtrabackup-2.4.20/sql/auth -I/tmp/B.M3c9ho/BUILD/percona-xtrabackup-percona-xtrabackup-2.4.20/regex -I/tmp/B.M3c9ho/BUILD/percona-xtrabackup-percona-xtrabackup-2.4.20/storage/innobase/xtrabackup/src -I/tmp/B.M3c9ho/BUILD/percona-xtrabackup-percona-xtrabackup-2.4.20/storage/innobase/xtrabackup/src/libarchive/libarchive -I/tmp/B.M3c9ho/BUILD/percona-xtrabackup-percona-xtrabackup-2.4.20/storage/innobase/xtrabackup/src/quicklz -I/tmp/B.M3c9ho/BUILD/percona-xtrabackup-percona-xtrabackup-2.4.20/storage/innobase/xtrabackup/src/crc -I/tmp/B.M3c9ho/BUILD/percona-xtrabackup-percona-xtrabackup-2.4.20/build/storage/innobase/xtrabackup/src -I/tmp/B.M3c9ho/BUILD/percona-xtrabackup-percona-xtrabackup-2.4.20/plugin/keyring -I/tmp/B.M3c9ho/BUILD/percona-xtrabackup-percona-xtrabackup-2.4.20/plugin/keyring_vault -I/tmp/B.M3c9ho/BUILD/percona-xtrabackup-percona-xtrabackup-2.4.20/include/boost_1_59_0/patches  -fPIC -Wall -Wextra -Wformat-security -Wvla -Wimplicit-fallthrough=2 -Wwrite-strings -Wdeclaration-after-statement -O3 -g -fabi-version=2 -fno-omit-frame-pointer -fno-strict-aliasing -DDBUG_OFF   -DUNIV_LINUX -D_GNU_SOURCE=1 -o CMakeFiles/xbcrypt.dir/ds_decrypt.c.o   -c /tmp/B.M3c9ho/BUILD/percona-xtrabackup-percona-xtrabackup-2.4.20/storage/innobase/xtrabackup/src/ds_decrypt.c
make[2]: Leaving directory '/tmp/B.M3c9ho/BUILD/percona-xtrabackup-percona-xtrabackup-2.4.20/build'
make[2]: Entering directory '/tmp/B.M3c9ho/BUILD/percona-xtrabackup-percona-xtrabackup-2.4.20/build'
[ 29%] Building C object storage/innobase/xtrabackup/src/CMakeFiles/xbcrypt.dir/ds_stdout.c.o
cd /tmp/B.M3c9ho/BUILD/percona-xtrabackup-percona-xtrabackup-2.4.20/build/storage/innobase/xtrabackup/src && /usr/bin/x86_64-pld-linux-gnux32-gcc -DBOOST_GEOMETRY_SQRT_CHECK_FINITENESS -DCOMPILER_HINTS -DHAVE_CONFIG_H -DHAVE_FALLOC_PUNCH_HOLE_AND_KEEP_SIZE=1 -DHAVE_IB_ATOMIC_PTHREAD_T_GCC=1 -DHAVE_IB_GCC_ATOMIC_COMPARE_EXCHANGE=1 -DHAVE_IB_GCC_ATOMIC_THREAD_FENCE=1 -DHAVE_IB_GCC_SYNC_SYNCHRONISE=1 -DHAVE_IB_LINUX_FUTEX=1 -DHAVE_LIBEVENT2 -DHAVE_LZ4=1 -DHAVE_NANOSLEEP=1 -DHAVE_OPENSSL -DHAVE_SCHED_GETCPU=1 -DLINUX_NATIVE_AIO=1 -DMUTEX_EVENT -DXTRABACKUP -D_FILE_OFFSET_BITS=64 -D_GNU_SOURCE -I/tmp/B.M3c9ho/BUILD/percona-xtrabackup-percona-xtrabackup-2.4.20/build/include -I/tmp/B.M3c9ho/BUILD/percona-xtrabackup-percona-xtrabackup-2.4.20/extra/rapidjson/include -I/tmp/B.M3c9ho/BUILD/percona-xtrabackup-percona-xtrabackup-2.4.20/build/libbinlogevents/include -I/tmp/B.M3c9ho/BUILD/percona-xtrabackup-percona-xtrabackup-2.4.20/libbinlogevents/export -I/tmp/B.M3c9ho/BUILD/percona-xtrabackup-percona-xtrabackup-2.4.20/storage/innobase/include -I/tmp/B.M3c9ho/BUILD/percona-xtrabackup-percona-xtrabackup-2.4.20/storage/innobase/handler -I/tmp/B.M3c9ho/BUILD/percona-xtrabackup-percona-xtrabackup-2.4.20/libbinlogevents/include -I/tmp/B.M3c9ho/BUILD/percona-xtrabackup-percona-xtrabackup-2.4.20/include -I/tmp/B.M3c9ho/BUILD/percona-xtrabackup-percona-xtrabackup-2.4.20/sql -I/tmp/B.M3c9ho/BUILD/percona-xtrabackup-percona-xtrabackup-2.4.20/sql/auth -I/tmp/B.M3c9ho/BUILD/percona-xtrabackup-percona-xtrabackup-2.4.20/regex -I/tmp/B.M3c9ho/BUILD/percona-xtrabackup-percona-xtrabackup-2.4.20/storage/innobase/xtrabackup/src -I/tmp/B.M3c9ho/BUILD/percona-xtrabackup-percona-xtrabackup-2.4.20/storage/innobase/xtrabackup/src/libarchive/libarchive -I/tmp/B.M3c9ho/BUILD/percona-xtrabackup-percona-xtrabackup-2.4.20/storage/innobase/xtrabackup/src/quicklz -I/tmp/B.M3c9ho/BUILD/percona-xtrabackup-percona-xtrabackup-2.4.20/storage/innobase/xtrabackup/src/crc -I/tmp/B.M3c9ho/BUILD/percona-xtrabackup-percona-xtrabackup-2.4.20/build/storage/innobase/xtrabackup/src -I/tmp/B.M3c9ho/BUILD/percona-xtrabackup-percona-xtrabackup-2.4.20/plugin/keyring -I/tmp/B.M3c9ho/BUILD/percona-xtrabackup-percona-xtrabackup-2.4.20/plugin/keyring_vault -I/tmp/B.M3c9ho/BUILD/percona-xtrabackup-percona-xtrabackup-2.4.20/include/boost_1_59_0/patches  -fPIC -Wall -Wextra -Wformat-security -Wvla -Wimplicit-fallthrough=2 -Wwrite-strings -Wdeclaration-after-statement -O3 -g -fabi-version=2 -fno-omit-frame-pointer -fno-strict-aliasing -DDBUG_OFF   -DUNIV_LINUX -D_GNU_SOURCE=1 -o CMakeFiles/xbcrypt.dir/ds_stdout.c.o   -c /tmp/B.M3c9ho/BUILD/percona-xtrabackup-percona-xtrabackup-2.4.20/storage/innobase/xtrabackup/src/ds_stdout.c
make[2]: Leaving directory '/tmp/B.M3c9ho/BUILD/percona-xtrabackup-percona-xtrabackup-2.4.20/build'
make[2]: Entering directory '/tmp/B.M3c9ho/BUILD/percona-xtrabackup-percona-xtrabackup-2.4.20/build'
[ 28%] Building C object storage/innobase/xtrabackup/src/CMakeFiles/xbstream.dir/xbstream.c.o
cd /tmp/B.M3c9ho/BUILD/percona-xtrabackup-percona-xtrabackup-2.4.20/build/storage/innobase/xtrabackup/src && /usr/bin/x86_64-pld-linux-gnux32-gcc -DBOOST_GEOMETRY_SQRT_CHECK_FINITENESS -DCOMPILER_HINTS -DHAVE_CONFIG_H -DHAVE_FALLOC_PUNCH_HOLE_AND_KEEP_SIZE=1 -DHAVE_IB_ATOMIC_PTHREAD_T_GCC=1 -DHAVE_IB_GCC_ATOMIC_COMPARE_EXCHANGE=1 -DHAVE_IB_GCC_ATOMIC_THREAD_FENCE=1 -DHAVE_IB_GCC_SYNC_SYNCHRONISE=1 -DHAVE_IB_LINUX_FUTEX=1 -DHAVE_LIBEVENT2 -DHAVE_LZ4=1 -DHAVE_NANOSLEEP=1 -DHAVE_OPENSSL -DHAVE_SCHED_GETCPU=1 -DLINUX_NATIVE_AIO=1 -DMUTEX_EVENT -DXTRABACKUP -D_FILE_OFFSET_BITS=64 -D_GNU_SOURCE -I/tmp/B.M3c9ho/BUILD/percona-xtrabackup-percona-xtrabackup-2.4.20/build/include -I/tmp/B.M3c9ho/BUILD/percona-xtrabackup-percona-xtrabackup-2.4.20/extra/rapidjson/include -I/tmp/B.M3c9ho/BUILD/percona-xtrabackup-percona-xtrabackup-2.4.20/build/libbinlogevents/include -I/tmp/B.M3c9ho/BUILD/percona-xtrabackup-percona-xtrabackup-2.4.20/libbinlogevents/export -I/tmp/B.M3c9ho/BUILD/percona-xtrabackup-percona-xtrabackup-2.4.20/storage/innobase/include -I/tmp/B.M3c9ho/BUILD/percona-xtrabackup-percona-xtrabackup-2.4.20/storage/innobase/handler -I/tmp/B.M3c9ho/BUILD/percona-xtrabackup-percona-xtrabackup-2.4.20/libbinlogevents/include -I/tmp/B.M3c9ho/BUILD/percona-xtrabackup-percona-xtrabackup-2.4.20/include -I/tmp/B.M3c9ho/BUILD/percona-xtrabackup-percona-xtrabackup-2.4.20/sql -I/tmp/B.M3c9ho/BUILD/percona-xtrabackup-percona-xtrabackup-2.4.20/sql/auth -I/tmp/B.M3c9ho/BUILD/percona-xtrabackup-percona-xtrabackup-2.4.20/regex -I/tmp/B.M3c9ho/BUILD/percona-xtrabackup-percona-xtrabackup-2.4.20/storage/innobase/xtrabackup/src -I/tmp/B.M3c9ho/BUILD/percona-xtrabackup-percona-xtrabackup-2.4.20/storage/innobase/xtrabackup/src/libarchive/libarchive -I/tmp/B.M3c9ho/BUILD/percona-xtrabackup-percona-xtrabackup-2.4.20/storage/innobase/xtrabackup/src/quicklz -I/tmp/B.M3c9ho/BUILD/percona-xtrabackup-percona-xtrabackup-2.4.20/storage/innobase/xtrabackup/src/crc -I/tmp/B.M3c9ho/BUILD/percona-xtrabackup-percona-xtrabackup-2.4.20/build/storage/innobase/xtrabackup/src -I/tmp/B.M3c9ho/BUILD/percona-xtrabackup-percona-xtrabackup-2.4.20/plugin/keyring -I/tmp/B.M3c9ho/BUILD/percona-xtrabackup-percona-xtrabackup-2.4.20/plugin/keyring_vault -I/tmp/B.M3c9ho/BUILD/percona-xtrabackup-percona-xtrabackup-2.4.20/include/boost_1_59_0/patches  -fPIC -Wall -Wextra -Wformat-security -Wvla -Wimplicit-fallthrough=2 -Wwrite-strings -Wdeclaration-after-statement -O3 -g -fabi-version=2 -fno-omit-frame-pointer -fno-strict-aliasing -DDBUG_OFF   -DUNIV_LINUX -D_GNU_SOURCE=1 -o CMakeFiles/xbstream.dir/xbstream.c.o   -c /tmp/B.M3c9ho/BUILD/percona-xtrabackup-percona-xtrabackup-2.4.20/storage/innobase/xtrabackup/src/xbstream.c
make[2]: Leaving directory '/tmp/B.M3c9ho/BUILD/percona-xtrabackup-percona-xtrabackup-2.4.20/build'
make[2]: Entering directory '/tmp/B.M3c9ho/BUILD/percona-xtrabackup-percona-xtrabackup-2.4.20/build'
[ 29%] Building C object storage/innobase/xtrabackup/src/CMakeFiles/xbstream.dir/xbstream_read.c.o
cd /tmp/B.M3c9ho/BUILD/percona-xtrabackup-percona-xtrabackup-2.4.20/build/storage/innobase/xtrabackup/src && /usr/bin/x86_64-pld-linux-gnux32-gcc -DBOOST_GEOMETRY_SQRT_CHECK_FINITENESS -DCOMPILER_HINTS -DHAVE_CONFIG_H -DHAVE_FALLOC_PUNCH_HOLE_AND_KEEP_SIZE=1 -DHAVE_IB_ATOMIC_PTHREAD_T_GCC=1 -DHAVE_IB_GCC_ATOMIC_COMPARE_EXCHANGE=1 -DHAVE_IB_GCC_ATOMIC_THREAD_FENCE=1 -DHAVE_IB_GCC_SYNC_SYNCHRONISE=1 -DHAVE_IB_LINUX_FUTEX=1 -DHAVE_LIBEVENT2 -DHAVE_LZ4=1 -DHAVE_NANOSLEEP=1 -DHAVE_OPENSSL -DHAVE_SCHED_GETCPU=1 -DLINUX_NATIVE_AIO=1 -DMUTEX_EVENT -DXTRABACKUP -D_FILE_OFFSET_BITS=64 -D_GNU_SOURCE -I/tmp/B.M3c9ho/BUILD/percona-xtrabackup-percona-xtrabackup-2.4.20/build/include -I/tmp/B.M3c9ho/BUILD/percona-xtrabackup-percona-xtrabackup-2.4.20/extra/rapidjson/include -I/tmp/B.M3c9ho/BUILD/percona-xtrabackup-percona-xtrabackup-2.4.20/build/libbinlogevents/include -I/tmp/B.M3c9ho/BUILD/percona-xtrabackup-percona-xtrabackup-2.4.20/libbinlogevents/export -I/tmp/B.M3c9ho/BUILD/percona-xtrabackup-percona-xtrabackup-2.4.20/storage/innobase/include -I/tmp/B.M3c9ho/BUILD/percona-xtrabackup-percona-xtrabackup-2.4.20/storage/innobase/handler -I/tmp/B.M3c9ho/BUILD/percona-xtrabackup-percona-xtrabackup-2.4.20/libbinlogevents/include -I/tmp/B.M3c9ho/BUILD/percona-xtrabackup-percona-xtrabackup-2.4.20/include -I/tmp/B.M3c9ho/BUILD/percona-xtrabackup-percona-xtrabackup-2.4.20/sql -I/tmp/B.M3c9ho/BUILD/percona-xtrabackup-percona-xtrabackup-2.4.20/sql/auth -I/tmp/B.M3c9ho/BUILD/percona-xtrabackup-percona-xtrabackup-2.4.20/regex -I/tmp/B.M3c9ho/BUILD/percona-xtrabackup-percona-xtrabackup-2.4.20/storage/innobase/xtrabackup/src -I/tmp/B.M3c9ho/BUILD/percona-xtrabackup-percona-xtrabackup-2.4.20/storage/innobase/xtrabackup/src/libarchive/libarchive -I/tmp/B.M3c9ho/BUILD/percona-xtrabackup-percona-xtrabackup-2.4.20/storage/innobase/xtrabackup/src/quicklz -I/tmp/B.M3c9ho/BUILD/percona-xtrabackup-percona-xtrabackup-2.4.20/storage/innobase/xtrabackup/src/crc -I/tmp/B.M3c9ho/BUILD/percona-xtrabackup-percona-xtrabackup-2.4.20/build/storage/innobase/xtrabackup/src -I/tmp/B.M3c9ho/BUILD/percona-xtrabackup-percona-xtrabackup-2.4.20/plugin/keyring -I/tmp/B.M3c9ho/BUILD/percona-xtrabackup-percona-xtrabackup-2.4.20/plugin/keyring_vault -I/tmp/B.M3c9ho/BUILD/percona-xtrabackup-percona-xtrabackup-2.4.20/include/boost_1_59_0/patches  -fPIC -Wall -Wextra -Wformat-security -Wvla -Wimplicit-fallthrough=2 -Wwrite-strings -Wdeclaration-after-statement -O3 -g -fabi-version=2 -fno-omit-frame-pointer -fno-strict-aliasing -DDBUG_OFF   -DUNIV_LINUX -D_GNU_SOURCE=1 -o CMakeFiles/xbstream.dir/xbstream_read.c.o   -c /tmp/B.M3c9ho/BUILD/percona-xtrabackup-percona-xtrabackup-2.4.20/storage/innobase/xtrabackup/src/xbstream_read.c
make[2]: Leaving directory '/tmp/B.M3c9ho/BUILD/percona-xtrabackup-percona-xtrabackup-2.4.20/build'
make[2]: Entering directory '/tmp/B.M3c9ho/BUILD/percona-xtrabackup-percona-xtrabackup-2.4.20/build'
[ 29%] Linking CXX executable comp_err
cd /tmp/B.M3c9ho/BUILD/percona-xtrabackup-percona-xtrabackup-2.4.20/build/extra && /usr/bin/cmake -E cmake_link_script CMakeFiles/comp_err.dir/link.txt --verbose=1
/usr/bin/x86_64-pld-linux-gnux32-g++   -fPIC -Wall -Wextra -Wformat-security -Wvla -Wimplicit-fallthrough=2 -Woverloaded-virtual -Wno-unused-parameter -Wimplicit-fallthrough=2 -O3 -g -fabi-version=2 -fno-omit-frame-pointer -fno-strict-aliasing -std=gnu++03 -DDBUG_OFF   CMakeFiles/comp_err.dir/comp_err.c.o  -o comp_err  -lpthread ../archive_output_directory/libmysys.a ../archive_output_directory/libmysys_ssl.a ../archive_output_directory/libmysys.a ../archive_output_directory/libdbug.a ../archive_output_directory/libmysys.a ../archive_output_directory/libdbug.a -lm -lrt -latomic ../archive_output_directory/libstrings.a -lpthread -lssl -lcrypto -ldl -lz 
make[2]: Leaving directory '/tmp/B.M3c9ho/BUILD/percona-xtrabackup-percona-xtrabackup-2.4.20/build'
make[1]: Entering directory '/tmp/B.M3c9ho/BUILD/percona-xtrabackup-percona-xtrabackup-2.4.20/build'
[ 29%] Built target comp_err
make[1]: Leaving directory '/tmp/B.M3c9ho/BUILD/percona-xtrabackup-percona-xtrabackup-2.4.20/build'
/usr/bin/make  -f extra/CMakeFiles/GenError.dir/build.make extra/CMakeFiles/GenError.dir/depend
make[2]: Entering directory '/tmp/B.M3c9ho/BUILD/percona-xtrabackup-percona-xtrabackup-2.4.20/build'
[ 29%] Building C object storage/innobase/xtrabackup/src/CMakeFiles/xbstream.dir/xbstream_write.c.o
cd /tmp/B.M3c9ho/BUILD/percona-xtrabackup-percona-xtrabackup-2.4.20/build/storage/innobase/xtrabackup/src && /usr/bin/x86_64-pld-linux-gnux32-gcc -DBOOST_GEOMETRY_SQRT_CHECK_FINITENESS -DCOMPILER_HINTS -DHAVE_CONFIG_H -DHAVE_FALLOC_PUNCH_HOLE_AND_KEEP_SIZE=1 -DHAVE_IB_ATOMIC_PTHREAD_T_GCC=1 -DHAVE_IB_GCC_ATOMIC_COMPARE_EXCHANGE=1 -DHAVE_IB_GCC_ATOMIC_THREAD_FENCE=1 -DHAVE_IB_GCC_SYNC_SYNCHRONISE=1 -DHAVE_IB_LINUX_FUTEX=1 -DHAVE_LIBEVENT2 -DHAVE_LZ4=1 -DHAVE_NANOSLEEP=1 -DHAVE_OPENSSL -DHAVE_SCHED_GETCPU=1 -DLINUX_NATIVE_AIO=1 -DMUTEX_EVENT -DXTRABACKUP -D_FILE_OFFSET_BITS=64 -D_GNU_SOURCE -I/tmp/B.M3c9ho/BUILD/percona-xtrabackup-percona-xtrabackup-2.4.20/build/include -I/tmp/B.M3c9ho/BUILD/percona-xtrabackup-percona-xtrabackup-2.4.20/extra/rapidjson/include -I/tmp/B.M3c9ho/BUILD/percona-xtrabackup-percona-xtrabackup-2.4.20/build/libbinlogevents/include -I/tmp/B.M3c9ho/BUILD/percona-xtrabackup-percona-xtrabackup-2.4.20/libbinlogevents/export -I/tmp/B.M3c9ho/BUILD/percona-xtrabackup-percona-xtrabackup-2.4.20/storage/innobase/include -I/tmp/B.M3c9ho/BUILD/percona-xtrabackup-percona-xtrabackup-2.4.20/storage/innobase/handler -I/tmp/B.M3c9ho/BUILD/percona-xtrabackup-percona-xtrabackup-2.4.20/libbinlogevents/include -I/tmp/B.M3c9ho/BUILD/percona-xtrabackup-percona-xtrabackup-2.4.20/include -I/tmp/B.M3c9ho/BUILD/percona-xtrabackup-percona-xtrabackup-2.4.20/sql -I/tmp/B.M3c9ho/BUILD/percona-xtrabackup-percona-xtrabackup-2.4.20/sql/auth -I/tmp/B.M3c9ho/BUILD/percona-xtrabackup-percona-xtrabackup-2.4.20/regex -I/tmp/B.M3c9ho/BUILD/percona-xtrabackup-percona-xtrabackup-2.4.20/storage/innobase/xtrabackup/src -I/tmp/B.M3c9ho/BUILD/percona-xtrabackup-percona-xtrabackup-2.4.20/storage/innobase/xtrabackup/src/libarchive/libarchive -I/tmp/B.M3c9ho/BUILD/percona-xtrabackup-percona-xtrabackup-2.4.20/storage/innobase/xtrabackup/src/quicklz -I/tmp/B.M3c9ho/BUILD/percona-xtrabackup-percona-xtrabackup-2.4.20/storage/innobase/xtrabackup/src/crc -I/tmp/B.M3c9ho/BUILD/percona-xtrabackup-percona-xtrabackup-2.4.20/build/storage/innobase/xtrabackup/src -I/tmp/B.M3c9ho/BUILD/percona-xtrabackup-percona-xtrabackup-2.4.20/plugin/keyring -I/tmp/B.M3c9ho/BUILD/percona-xtrabackup-percona-xtrabackup-2.4.20/plugin/keyring_vault -I/tmp/B.M3c9ho/BUILD/percona-xtrabackup-percona-xtrabackup-2.4.20/include/boost_1_59_0/patches  -fPIC -Wall -Wextra -Wformat-security -Wvla -Wimplicit-fallthrough=2 -Wwrite-strings -Wdeclaration-after-statement -O3 -g -fabi-version=2 -fno-omit-frame-pointer -fno-strict-aliasing -DDBUG_OFF   -DUNIV_LINUX -D_GNU_SOURCE=1 -o CMakeFiles/xbstream.dir/xbstream_write.c.o   -c /tmp/B.M3c9ho/BUILD/percona-xtrabackup-percona-xtrabackup-2.4.20/storage/innobase/xtrabackup/src/xbstream_write.c
make[2]: Leaving directory '/tmp/B.M3c9ho/BUILD/percona-xtrabackup-percona-xtrabackup-2.4.20/build'
make[2]: Entering directory '/tmp/B.M3c9ho/BUILD/percona-xtrabackup-percona-xtrabackup-2.4.20/build'
cd /tmp/B.M3c9ho/BUILD/percona-xtrabackup-percona-xtrabackup-2.4.20/build && /usr/bin/cmake -E cmake_depends "Unix Makefiles" /tmp/B.M3c9ho/BUILD/percona-xtrabackup-percona-xtrabackup-2.4.20 /tmp/B.M3c9ho/BUILD/percona-xtrabackup-percona-xtrabackup-2.4.20/extra /tmp/B.M3c9ho/BUILD/percona-xtrabackup-percona-xtrabackup-2.4.20/build /tmp/B.M3c9ho/BUILD/percona-xtrabackup-percona-xtrabackup-2.4.20/build/extra /tmp/B.M3c9ho/BUILD/percona-xtrabackup-percona-xtrabackup-2.4.20/build/extra/CMakeFiles/GenError.dir/DependInfo.cmake --color=
Scanning dependencies of target GenError
make[2]: Leaving directory '/tmp/B.M3c9ho/BUILD/percona-xtrabackup-percona-xtrabackup-2.4.20/build'
/usr/bin/make  -f extra/CMakeFiles/GenError.dir/build.make extra/CMakeFiles/GenError.dir/build
make[2]: Entering directory '/tmp/B.M3c9ho/BUILD/percona-xtrabackup-percona-xtrabackup-2.4.20/build'
[ 29%] Building C object storage/innobase/xtrabackup/src/CMakeFiles/xbstream.dir/xbcrypt_write.c.o
cd /tmp/B.M3c9ho/BUILD/percona-xtrabackup-percona-xtrabackup-2.4.20/build/storage/innobase/xtrabackup/src && /usr/bin/x86_64-pld-linux-gnux32-gcc -DBOOST_GEOMETRY_SQRT_CHECK_FINITENESS -DCOMPILER_HINTS -DHAVE_CONFIG_H -DHAVE_FALLOC_PUNCH_HOLE_AND_KEEP_SIZE=1 -DHAVE_IB_ATOMIC_PTHREAD_T_GCC=1 -DHAVE_IB_GCC_ATOMIC_COMPARE_EXCHANGE=1 -DHAVE_IB_GCC_ATOMIC_THREAD_FENCE=1 -DHAVE_IB_GCC_SYNC_SYNCHRONISE=1 -DHAVE_IB_LINUX_FUTEX=1 -DHAVE_LIBEVENT2 -DHAVE_LZ4=1 -DHAVE_NANOSLEEP=1 -DHAVE_OPENSSL -DHAVE_SCHED_GETCPU=1 -DLINUX_NATIVE_AIO=1 -DMUTEX_EVENT -DXTRABACKUP -D_FILE_OFFSET_BITS=64 -D_GNU_SOURCE -I/tmp/B.M3c9ho/BUILD/percona-xtrabackup-percona-xtrabackup-2.4.20/build/include -I/tmp/B.M3c9ho/BUILD/percona-xtrabackup-percona-xtrabackup-2.4.20/extra/rapidjson/include -I/tmp/B.M3c9ho/BUILD/percona-xtrabackup-percona-xtrabackup-2.4.20/build/libbinlogevents/include -I/tmp/B.M3c9ho/BUILD/percona-xtrabackup-percona-xtrabackup-2.4.20/libbinlogevents/export -I/tmp/B.M3c9ho/BUILD/percona-xtrabackup-percona-xtrabackup-2.4.20/storage/innobase/include -I/tmp/B.M3c9ho/BUILD/percona-xtrabackup-percona-xtrabackup-2.4.20/storage/innobase/handler -I/tmp/B.M3c9ho/BUILD/percona-xtrabackup-percona-xtrabackup-2.4.20/libbinlogevents/include -I/tmp/B.M3c9ho/BUILD/percona-xtrabackup-percona-xtrabackup-2.4.20/include -I/tmp/B.M3c9ho/BUILD/percona-xtrabackup-percona-xtrabackup-2.4.20/sql -I/tmp/B.M3c9ho/BUILD/percona-xtrabackup-percona-xtrabackup-2.4.20/sql/auth -I/tmp/B.M3c9ho/BUILD/percona-xtrabackup-percona-xtrabackup-2.4.20/regex -I/tmp/B.M3c9ho/BUILD/percona-xtrabackup-percona-xtrabackup-2.4.20/storage/innobase/xtrabackup/src -I/tmp/B.M3c9ho/BUILD/percona-xtrabackup-percona-xtrabackup-2.4.20/storage/innobase/xtrabackup/src/libarchive/libarchive -I/tmp/B.M3c9ho/BUILD/percona-xtrabackup-percona-xtrabackup-2.4.20/storage/innobase/xtrabackup/src/quicklz -I/tmp/B.M3c9ho/BUILD/percona-xtrabackup-percona-xtrabackup-2.4.20/storage/innobase/xtrabackup/src/crc -I/tmp/B.M3c9ho/BUILD/percona-xtrabackup-percona-xtrabackup-2.4.20/build/storage/innobase/xtrabackup/src -I/tmp/B.M3c9ho/BUILD/percona-xtrabackup-percona-xtrabackup-2.4.20/plugin/keyring -I/tmp/B.M3c9ho/BUILD/percona-xtrabackup-percona-xtrabackup-2.4.20/plugin/keyring_vault -I/tmp/B.M3c9ho/BUILD/percona-xtrabackup-percona-xtrabackup-2.4.20/include/boost_1_59_0/patches  -fPIC -Wall -Wextra -Wformat-security -Wvla -Wimplicit-fallthrough=2 -Wwrite-strings -Wdeclaration-after-statement -O3 -g -fabi-version=2 -fno-omit-frame-pointer -fno-strict-aliasing -DDBUG_OFF   -DUNIV_LINUX -D_GNU_SOURCE=1 -o CMakeFiles/xbstream.dir/xbcrypt_write.c.o   -c /tmp/B.M3c9ho/BUILD/percona-xtrabackup-percona-xtrabackup-2.4.20/storage/innobase/xtrabackup/src/xbcrypt_write.c
make[2]: Leaving directory '/tmp/B.M3c9ho/BUILD/percona-xtrabackup-percona-xtrabackup-2.4.20/build'
make[2]: Entering directory '/tmp/B.M3c9ho/BUILD/percona-xtrabackup-percona-xtrabackup-2.4.20/build'
[ 29%] Building C object storage/innobase/xtrabackup/src/CMakeFiles/xbstream.dir/xbcrypt_common.c.o
cd /tmp/B.M3c9ho/BUILD/percona-xtrabackup-percona-xtrabackup-2.4.20/build/storage/innobase/xtrabackup/src && /usr/bin/x86_64-pld-linux-gnux32-gcc -DBOOST_GEOMETRY_SQRT_CHECK_FINITENESS -DCOMPILER_HINTS -DHAVE_CONFIG_H -DHAVE_FALLOC_PUNCH_HOLE_AND_KEEP_SIZE=1 -DHAVE_IB_ATOMIC_PTHREAD_T_GCC=1 -DHAVE_IB_GCC_ATOMIC_COMPARE_EXCHANGE=1 -DHAVE_IB_GCC_ATOMIC_THREAD_FENCE=1 -DHAVE_IB_GCC_SYNC_SYNCHRONISE=1 -DHAVE_IB_LINUX_FUTEX=1 -DHAVE_LIBEVENT2 -DHAVE_LZ4=1 -DHAVE_NANOSLEEP=1 -DHAVE_OPENSSL -DHAVE_SCHED_GETCPU=1 -DLINUX_NATIVE_AIO=1 -DMUTEX_EVENT -DXTRABACKUP -D_FILE_OFFSET_BITS=64 -D_GNU_SOURCE -I/tmp/B.M3c9ho/BUILD/percona-xtrabackup-percona-xtrabackup-2.4.20/build/include -I/tmp/B.M3c9ho/BUILD/percona-xtrabackup-percona-xtrabackup-2.4.20/extra/rapidjson/include -I/tmp/B.M3c9ho/BUILD/percona-xtrabackup-percona-xtrabackup-2.4.20/build/libbinlogevents/include -I/tmp/B.M3c9ho/BUILD/percona-xtrabackup-percona-xtrabackup-2.4.20/libbinlogevents/export -I/tmp/B.M3c9ho/BUILD/percona-xtrabackup-percona-xtrabackup-2.4.20/storage/innobase/include -I/tmp/B.M3c9ho/BUILD/percona-xtrabackup-percona-xtrabackup-2.4.20/storage/innobase/handler -I/tmp/B.M3c9ho/BUILD/percona-xtrabackup-percona-xtrabackup-2.4.20/libbinlogevents/include -I/tmp/B.M3c9ho/BUILD/percona-xtrabackup-percona-xtrabackup-2.4.20/include -I/tmp/B.M3c9ho/BUILD/percona-xtrabackup-percona-xtrabackup-2.4.20/sql -I/tmp/B.M3c9ho/BUILD/percona-xtrabackup-percona-xtrabackup-2.4.20/sql/auth -I/tmp/B.M3c9ho/BUILD/percona-xtrabackup-percona-xtrabackup-2.4.20/regex -I/tmp/B.M3c9ho/BUILD/percona-xtrabackup-percona-xtrabackup-2.4.20/storage/innobase/xtrabackup/src -I/tmp/B.M3c9ho/BUILD/percona-xtrabackup-percona-xtrabackup-2.4.20/storage/innobase/xtrabackup/src/libarchive/libarchive -I/tmp/B.M3c9ho/BUILD/percona-xtrabackup-percona-xtrabackup-2.4.20/storage/innobase/xtrabackup/src/quicklz -I/tmp/B.M3c9ho/BUILD/percona-xtrabackup-percona-xtrabackup-2.4.20/storage/innobase/xtrabackup/src/crc -I/tmp/B.M3c9ho/BUILD/percona-xtrabackup-percona-xtrabackup-2.4.20/build/storage/innobase/xtrabackup/src -I/tmp/B.M3c9ho/BUILD/percona-xtrabackup-percona-xtrabackup-2.4.20/plugin/keyring -I/tmp/B.M3c9ho/BUILD/percona-xtrabackup-percona-xtrabackup-2.4.20/plugin/keyring_vault -I/tmp/B.M3c9ho/BUILD/percona-xtrabackup-percona-xtrabackup-2.4.20/include/boost_1_59_0/patches  -fPIC -Wall -Wextra -Wformat-security -Wvla -Wimplicit-fallthrough=2 -Wwrite-strings -Wdeclaration-after-statement -O3 -g -fabi-version=2 -fno-omit-frame-pointer -fno-strict-aliasing -DDBUG_OFF   -DUNIV_LINUX -D_GNU_SOURCE=1 -o CMakeFiles/xbstream.dir/xbcrypt_common.c.o   -c /tmp/B.M3c9ho/BUILD/percona-xtrabackup-percona-xtrabackup-2.4.20/storage/innobase/xtrabackup/src/xbcrypt_common.c
make[2]: Leaving directory '/tmp/B.M3c9ho/BUILD/percona-xtrabackup-percona-xtrabackup-2.4.20/build'
make[2]: Entering directory '/tmp/B.M3c9ho/BUILD/percona-xtrabackup-percona-xtrabackup-2.4.20/build'
[ 29%] Generating ../include/mysqld_error.h, ../sql/share/english/errmsg.sys
cd /tmp/B.M3c9ho/BUILD/percona-xtrabackup-percona-xtrabackup-2.4.20/build/extra && ./comp_err --charset=/tmp/B.M3c9ho/BUILD/percona-xtrabackup-percona-xtrabackup-2.4.20/sql/share/charsets --out-dir=/tmp/B.M3c9ho/BUILD/percona-xtrabackup-percona-xtrabackup-2.4.20/build/sql/share/ --header_file=/tmp/B.M3c9ho/BUILD/percona-xtrabackup-percona-xtrabackup-2.4.20/build/include/mysqld_error.h --name_file=/tmp/B.M3c9ho/BUILD/percona-xtrabackup-percona-xtrabackup-2.4.20/build/include/mysqld_ername.h --state_file=/tmp/B.M3c9ho/BUILD/percona-xtrabackup-percona-xtrabackup-2.4.20/build/include/sql_state.h --in_file=/tmp/B.M3c9ho/BUILD/percona-xtrabackup-percona-xtrabackup-2.4.20/sql/share/errmsg-utf8.txt
make[2]: Leaving directory '/tmp/B.M3c9ho/BUILD/percona-xtrabackup-percona-xtrabackup-2.4.20/build'
make[1]: Entering directory '/tmp/B.M3c9ho/BUILD/percona-xtrabackup-percona-xtrabackup-2.4.20/build'
[ 29%] Built target GenError
make[1]: Leaving directory '/tmp/B.M3c9ho/BUILD/percona-xtrabackup-percona-xtrabackup-2.4.20/build'
/usr/bin/make  -f libmysql/CMakeFiles/clientlib.dir/build.make libmysql/CMakeFiles/clientlib.dir/depend
/usr/bin/make  -f libbinlogevents/src/CMakeFiles/binlogevents_static.dir/build.make libbinlogevents/src/CMakeFiles/binlogevents_static.dir/depend
/usr/bin/make  -f storage/archive/CMakeFiles/archive_embedded.dir/build.make storage/archive/CMakeFiles/archive_embedded.dir/depend
make[2]: Entering directory '/tmp/B.M3c9ho/BUILD/percona-xtrabackup-percona-xtrabackup-2.4.20/build'
cd /tmp/B.M3c9ho/BUILD/percona-xtrabackup-percona-xtrabackup-2.4.20/build && /usr/bin/cmake -E cmake_depends "Unix Makefiles" /tmp/B.M3c9ho/BUILD/percona-xtrabackup-percona-xtrabackup-2.4.20 /tmp/B.M3c9ho/BUILD/percona-xtrabackup-percona-xtrabackup-2.4.20/libmysql /tmp/B.M3c9ho/BUILD/percona-xtrabackup-percona-xtrabackup-2.4.20/build /tmp/B.M3c9ho/BUILD/percona-xtrabackup-percona-xtrabackup-2.4.20/build/libmysql /tmp/B.M3c9ho/BUILD/percona-xtrabackup-percona-xtrabackup-2.4.20/build/libmysql/CMakeFiles/clientlib.dir/DependInfo.cmake --color=
Scanning dependencies of target clientlib
make[2]: Leaving directory '/tmp/B.M3c9ho/BUILD/percona-xtrabackup-percona-xtrabackup-2.4.20/build'
/usr/bin/make  -f libmysql/CMakeFiles/clientlib.dir/build.make libmysql/CMakeFiles/clientlib.dir/build
make[2]: Entering directory '/tmp/B.M3c9ho/BUILD/percona-xtrabackup-percona-xtrabackup-2.4.20/build'
cd /tmp/B.M3c9ho/BUILD/percona-xtrabackup-percona-xtrabackup-2.4.20/build && /usr/bin/cmake -E cmake_depends "Unix Makefiles" /tmp/B.M3c9ho/BUILD/percona-xtrabackup-percona-xtrabackup-2.4.20 /tmp/B.M3c9ho/BUILD/percona-xtrabackup-percona-xtrabackup-2.4.20/libbinlogevents/src /tmp/B.M3c9ho/BUILD/percona-xtrabackup-percona-xtrabackup-2.4.20/build /tmp/B.M3c9ho/BUILD/percona-xtrabackup-percona-xtrabackup-2.4.20/build/libbinlogevents/src /tmp/B.M3c9ho/BUILD/percona-xtrabackup-percona-xtrabackup-2.4.20/build/libbinlogevents/src/CMakeFiles/binlogevents_static.dir/DependInfo.cmake --color=
Scanning dependencies of target binlogevents_static
make[2]: Leaving directory '/tmp/B.M3c9ho/BUILD/percona-xtrabackup-percona-xtrabackup-2.4.20/build'
/usr/bin/make  -f libbinlogevents/src/CMakeFiles/binlogevents_static.dir/build.make libbinlogevents/src/CMakeFiles/binlogevents_static.dir/build
make[2]: Entering directory '/tmp/B.M3c9ho/BUILD/percona-xtrabackup-percona-xtrabackup-2.4.20/build'
cd /tmp/B.M3c9ho/BUILD/percona-xtrabackup-percona-xtrabackup-2.4.20/build && /usr/bin/cmake -E cmake_depends "Unix Makefiles" /tmp/B.M3c9ho/BUILD/percona-xtrabackup-percona-xtrabackup-2.4.20 /tmp/B.M3c9ho/BUILD/percona-xtrabackup-percona-xtrabackup-2.4.20/storage/archive /tmp/B.M3c9ho/BUILD/percona-xtrabackup-percona-xtrabackup-2.4.20/build /tmp/B.M3c9ho/BUILD/percona-xtrabackup-percona-xtrabackup-2.4.20/build/storage/archive /tmp/B.M3c9ho/BUILD/percona-xtrabackup-percona-xtrabackup-2.4.20/build/storage/archive/CMakeFiles/archive_embedded.dir/DependInfo.cmake --color=
Scanning dependencies of target archive_embedded
make[2]: Leaving directory '/tmp/B.M3c9ho/BUILD/percona-xtrabackup-percona-xtrabackup-2.4.20/build'
/usr/bin/make  -f storage/archive/CMakeFiles/archive_embedded.dir/build.make storage/archive/CMakeFiles/archive_embedded.dir/build
make[2]: Entering directory '/tmp/B.M3c9ho/BUILD/percona-xtrabackup-percona-xtrabackup-2.4.20/build'
[ 29%] Linking CXX executable xbcrypt
cd /tmp/B.M3c9ho/BUILD/percona-xtrabackup-percona-xtrabackup-2.4.20/build/storage/innobase/xtrabackup/src && /usr/bin/cmake -E cmake_link_script CMakeFiles/xbcrypt.dir/link.txt --verbose=1
/usr/bin/x86_64-pld-linux-gnux32-g++   -fPIC -Wall -Wextra -Wformat-security -Wvla -Wimplicit-fallthrough=2 -Woverloaded-virtual -Wno-unused-parameter -Wimplicit-fallthrough=2 -O3 -g -fabi-version=2 -fno-omit-frame-pointer -fno-strict-aliasing -std=gnu++03 -DDBUG_OFF   CMakeFiles/xbcrypt.dir/xbcrypt.c.o CMakeFiles/xbcrypt.dir/xbcrypt_common.c.o CMakeFiles/xbcrypt.dir/xbcrypt_read.c.o CMakeFiles/xbcrypt.dir/xbcrypt_write.c.o CMakeFiles/xbcrypt.dir/datasink.c.o CMakeFiles/xbcrypt.dir/ds_encrypt.c.o CMakeFiles/xbcrypt.dir/ds_decrypt.c.o CMakeFiles/xbcrypt.dir/ds_local.c.o CMakeFiles/xbcrypt.dir/ds_stdout.c.o  -o xbcrypt  -lpthread -laio -lgcrypt -lgpg-error ../../../../archive_output_directory/libmysys.a ../../../../archive_output_directory/libmysys_ssl.a crc/libcrc.a ../../../../archive_output_directory/libmysys.a ../../../../archive_output_directory/libdbug.a ../../../../archive_output_directory/libmysys.a ../../../../archive_output_directory/libdbug.a -lm -lrt -latomic ../../../../archive_output_directory/libstrings.a -lssl -lcrypto -ldl -lz -lpthread -laio 
make[2]: Leaving directory '/tmp/B.M3c9ho/BUILD/percona-xtrabackup-percona-xtrabackup-2.4.20/build'
make[1]: Entering directory '/tmp/B.M3c9ho/BUILD/percona-xtrabackup-percona-xtrabackup-2.4.20/build'
[ 29%] Built target xbcrypt
make[1]: Leaving directory '/tmp/B.M3c9ho/BUILD/percona-xtrabackup-percona-xtrabackup-2.4.20/build'
make[2]: Entering directory '/tmp/B.M3c9ho/BUILD/percona-xtrabackup-percona-xtrabackup-2.4.20/build'
[ 29%] Linking CXX executable xbstream
cd /tmp/B.M3c9ho/BUILD/percona-xtrabackup-percona-xtrabackup-2.4.20/build/storage/innobase/xtrabackup/src && /usr/bin/cmake -E cmake_link_script CMakeFiles/xbstream.dir/link.txt --verbose=1
/usr/bin/x86_64-pld-linux-gnux32-g++   -fPIC -Wall -Wextra -Wformat-security -Wvla -Wimplicit-fallthrough=2 -Woverloaded-virtual -Wno-unused-parameter -Wimplicit-fallthrough=2 -O3 -g -fabi-version=2 -fno-omit-frame-pointer -fno-strict-aliasing -std=gnu++03 -DDBUG_OFF   CMakeFiles/xbstream.dir/ds_buffer.c.o CMakeFiles/xbstream.dir/ds_local.c.o CMakeFiles/xbstream.dir/ds_stdout.c.o CMakeFiles/xbstream.dir/ds_decrypt.c.o CMakeFiles/xbstream.dir/datasink.c.o CMakeFiles/xbstream.dir/xbstream.c.o CMakeFiles/xbstream.dir/xbstream_read.c.o CMakeFiles/xbstream.dir/xbstream_write.c.o CMakeFiles/xbstream.dir/xbcrypt_common.c.o CMakeFiles/xbstream.dir/xbcrypt_write.c.o  -o xbstream  -lpthread -laio -lgcrypt -lgpg-error ../../../../archive_output_directory/libmysys.a ../../../../archive_output_directory/libmysys_ssl.a crc/libcrc.a ../../../../archive_output_directory/libmysys.a ../../../../archive_output_directory/libdbug.a ../../../../archive_output_directory/libmysys.a ../../../../archive_output_directory/libdbug.a -lm -lrt -latomic ../../../../archive_output_directory/libstrings.a -lssl -lcrypto -ldl -lz -lpthread -laio 
/usr/bin/ld: CMakeFiles/xbstream.dir/xbstream.c.o:/tmp/B.M3c9ho/BUILD/percona-xtrabackup-percona-xtrabackup-2.4.20/storage/innobase/xtrabackup/src/xbstream.c:58: multiple definition of `datasink_buffer'; CMakeFiles/xbstream.dir/ds_buffer.c.o:/tmp/B.M3c9ho/BUILD/percona-xtrabackup-percona-xtrabackup-2.4.20/storage/innobase/xtrabackup/src/ds_buffer.c:52: first defined here
collect2: error: ld returned 1 exit status
make[2]: *** [storage/innobase/xtrabackup/src/CMakeFiles/xbstream.dir/build.make:255: storage/innobase/xtrabackup/src/xbstream] Error 1
make[2]: Leaving directory '/tmp/B.M3c9ho/BUILD/percona-xtrabackup-percona-xtrabackup-2.4.20/build'
make[1]: *** [CMakeFiles/Makefile2:2274: storage/innobase/xtrabackup/src/CMakeFiles/xbstream.dir/all] Error 2
make[1]: *** Waiting for unfinished jobs....
make[2]: Entering directory '/tmp/B.M3c9ho/BUILD/percona-xtrabackup-percona-xtrabackup-2.4.20/build'
[ 29%] Building C object storage/archive/CMakeFiles/archive_embedded.dir/azio.c.o
cd /tmp/B.M3c9ho/BUILD/percona-xtrabackup-percona-xtrabackup-2.4.20/build/storage/archive && /usr/bin/x86_64-pld-linux-gnux32-gcc -DBOOST_GEOMETRY_SQRT_CHECK_FINITENESS -DEMBEDDED_LIBRARY -DHAVE_CONFIG_H -DHAVE_LIBEVENT2 -DMYSQL_SERVER -DXTRABACKUP -D_FILE_OFFSET_BITS=64 -D_GNU_SOURCE -I/tmp/B.M3c9ho/BUILD/percona-xtrabackup-percona-xtrabackup-2.4.20/build/include -I/tmp/B.M3c9ho/BUILD/percona-xtrabackup-percona-xtrabackup-2.4.20/extra/rapidjson/include -I/tmp/B.M3c9ho/BUILD/percona-xtrabackup-percona-xtrabackup-2.4.20/build/libbinlogevents/include -I/tmp/B.M3c9ho/BUILD/percona-xtrabackup-percona-xtrabackup-2.4.20/libbinlogevents/export -I/tmp/B.M3c9ho/BUILD/percona-xtrabackup-percona-xtrabackup-2.4.20/include -I/tmp/B.M3c9ho/BUILD/percona-xtrabackup-percona-xtrabackup-2.4.20/sql -I/tmp/B.M3c9ho/BUILD/percona-xtrabackup-percona-xtrabackup-2.4.20/libbinlogevents/include -I/tmp/B.M3c9ho/BUILD/percona-xtrabackup-percona-xtrabackup-2.4.20/sql/auth -I/tmp/B.M3c9ho/BUILD/percona-xtrabackup-percona-xtrabackup-2.4.20/regex  -fPIC -Wall -Wextra -Wformat-security -Wvla -Wimplicit-fallthrough=2 -Wwrite-strings -Wdeclaration-after-statement -O3 -g -fabi-version=2 -fno-omit-frame-pointer -fno-strict-aliasing -DDBUG_OFF   -o CMakeFiles/archive_embedded.dir/azio.c.o   -c /tmp/B.M3c9ho/BUILD/percona-xtrabackup-percona-xtrabackup-2.4.20/storage/archive/azio.c
make[2]: Leaving directory '/tmp/B.M3c9ho/BUILD/percona-xtrabackup-percona-xtrabackup-2.4.20/build'
make[2]: Entering directory '/tmp/B.M3c9ho/BUILD/percona-xtrabackup-percona-xtrabackup-2.4.20/build'
[ 29%] Building CXX object libbinlogevents/src/CMakeFiles/binlogevents_static.dir/statement_events.cpp.o
cd /tmp/B.M3c9ho/BUILD/percona-xtrabackup-percona-xtrabackup-2.4.20/build/libbinlogevents/src && /usr/bin/x86_64-pld-linux-gnux32-g++  -DBOOST_GEOMETRY_SQRT_CHECK_FINITENESS -DHAVE_CONFIG_H -DHAVE_LIBEVENT2 -DXTRABACKUP -D_FILE_OFFSET_BITS=64 -D_GNU_SOURCE -I/tmp/B.M3c9ho/BUILD/percona-xtrabackup-percona-xtrabackup-2.4.20/build/include -I/tmp/B.M3c9ho/BUILD/percona-xtrabackup-percona-xtrabackup-2.4.20/extra/rapidjson/include -I/tmp/B.M3c9ho/BUILD/percona-xtrabackup-percona-xtrabackup-2.4.20/build/libbinlogevents/include -I/tmp/B.M3c9ho/BUILD/percona-xtrabackup-percona-xtrabackup-2.4.20/libbinlogevents/export -I/tmp/B.M3c9ho/BUILD/percona-xtrabackup-percona-xtrabackup-2.4.20/include -I/tmp/B.M3c9ho/BUILD/percona-xtrabackup-percona-xtrabackup-2.4.20/libbinlogevents/include  -fPIC -Wall -Wextra -Wformat-security -Wvla -Wimplicit-fallthrough=2 -Woverloaded-virtual -Wno-unused-parameter -Wimplicit-fallthrough=2 -O3 -g -fabi-version=2 -fno-omit-frame-pointer -fno-strict-aliasing -std=gnu++03 -DDBUG_OFF   -o CMakeFiles/binlogevents_static.dir/statement_events.cpp.o -c /tmp/B.M3c9ho/BUILD/percona-xtrabackup-percona-xtrabackup-2.4.20/libbinlogevents/src/statement_events.cpp
make[2]: Leaving directory '/tmp/B.M3c9ho/BUILD/percona-xtrabackup-percona-xtrabackup-2.4.20/build'
make[2]: Entering directory '/tmp/B.M3c9ho/BUILD/percona-xtrabackup-percona-xtrabackup-2.4.20/build'
[ 27%] Building CXX object storage/innobase/xtrabackup/src/xbcloud/CMakeFiles/xbcloud.dir/xbcloud.cc.o
cd /tmp/B.M3c9ho/BUILD/percona-xtrabackup-percona-xtrabackup-2.4.20/build/storage/innobase/xtrabackup/src/xbcloud && /usr/bin/x86_64-pld-linux-gnux32-g++  -DBOOST_GEOMETRY_SQRT_CHECK_FINITENESS -DCOMPILER_HINTS -DHAVE_CONFIG_H -DHAVE_FALLOC_PUNCH_HOLE_AND_KEEP_SIZE=1 -DHAVE_IB_ATOMIC_PTHREAD_T_GCC=1 -DHAVE_IB_GCC_ATOMIC_COMPARE_EXCHANGE=1 -DHAVE_IB_GCC_ATOMIC_THREAD_FENCE=1 -DHAVE_IB_GCC_SYNC_SYNCHRONISE=1 -DHAVE_IB_LINUX_FUTEX=1 -DHAVE_LIBEVENT2 -DHAVE_LZ4=1 -DHAVE_NANOSLEEP=1 -DHAVE_SCHED_GETCPU=1 -DLINUX_NATIVE_AIO=1 -DMUTEX_EVENT -DXTRABACKUP -D_FILE_OFFSET_BITS=64 -D_GNU_SOURCE -I/tmp/B.M3c9ho/BUILD/percona-xtrabackup-percona-xtrabackup-2.4.20/build/include -I/tmp/B.M3c9ho/BUILD/percona-xtrabackup-percona-xtrabackup-2.4.20/extra/rapidjson/include -I/tmp/B.M3c9ho/BUILD/percona-xtrabackup-percona-xtrabackup-2.4.20/build/libbinlogevents/include -I/tmp/B.M3c9ho/BUILD/percona-xtrabackup-percona-xtrabackup-2.4.20/libbinlogevents/export -I/tmp/B.M3c9ho/BUILD/percona-xtrabackup-percona-xtrabackup-2.4.20/storage/innobase/include -I/tmp/B.M3c9ho/BUILD/percona-xtrabackup-percona-xtrabackup-2.4.20/storage/innobase/handler -I/tmp/B.M3c9ho/BUILD/percona-xtrabackup-percona-xtrabackup-2.4.20/libbinlogevents/include -I/tmp/B.M3c9ho/BUILD/percona-xtrabackup-percona-xtrabackup-2.4.20/include -I/tmp/B.M3c9ho/BUILD/percona-xtrabackup-percona-xtrabackup-2.4.20/sql -I/tmp/B.M3c9ho/BUILD/percona-xtrabackup-percona-xtrabackup-2.4.20/sql/auth -I/tmp/B.M3c9ho/BUILD/percona-xtrabackup-percona-xtrabackup-2.4.20/regex -I/tmp/B.M3c9ho/BUILD/percona-xtrabackup-percona-xtrabackup-2.4.20/storage/innobase/xtrabackup/src -I/tmp/B.M3c9ho/BUILD/percona-xtrabackup-percona-xtrabackup-2.4.20/storage/innobase/xtrabackup/src/crc -I/tmp/B.M3c9ho/BUILD/percona-xtrabackup-percona-xtrabackup-2.4.20/build/storage/innobase/xtrabackup/src/xbcloud/..  -Wno-deprecated-declarations  -fPIC -Wall -Wextra -Wformat-security -Wvla -Wimplicit-fallthrough=2 -Woverloaded-virtual -Wno-unused-parameter -Wimplicit-fallthrough=2 -O3 -g -fabi-version=2 -fno-omit-frame-pointer -fno-strict-aliasing -std=gnu++03 -DDBUG_OFF   -DUNIV_LINUX -D_GNU_SOURCE=1 -std=c++11 -o CMakeFiles/xbcloud.dir/xbcloud.cc.o -c /tmp/B.M3c9ho/BUILD/percona-xtrabackup-percona-xtrabackup-2.4.20/storage/innobase/xtrabackup/src/xbcloud/xbcloud.cc
In file included from /usr/include/c++/10.3.0/memory:83,
                 from /tmp/B.M3c9ho/BUILD/percona-xtrabackup-percona-xtrabackup-2.4.20/storage/innobase/xtrabackup/src/xbcloud/http.h:28,
                 from /tmp/B.M3c9ho/BUILD/percona-xtrabackup-percona-xtrabackup-2.4.20/storage/innobase/xtrabackup/src/xbcloud/object_store.h:28,
                 from /tmp/B.M3c9ho/BUILD/percona-xtrabackup-percona-xtrabackup-2.4.20/storage/innobase/xtrabackup/src/xbcloud/s3.h:24,
                 from /tmp/B.M3c9ho/BUILD/percona-xtrabackup-percona-xtrabackup-2.4.20/storage/innobase/xtrabackup/src/xbcloud/xbcloud.cc:43:
/usr/include/c++/10.3.0/bits/unique_ptr.h: In instantiation of 'constexpr std::unique_ptr<_Tp, _Dp>::unique_ptr() [with _Del = std::default_delete<xbcloud::S3_signer>; <template-parameter-2-2> = void; _Tp = xbcloud::S3_signer; _Dp = std::default_delete<xbcloud::S3_signer>]':
/tmp/B.M3c9ho/BUILD/percona-xtrabackup-percona-xtrabackup-2.4.20/storage/innobase/xtrabackup/src/xbcloud/s3.h:164:30:   required from here
/usr/include/c++/10.3.0/bits/unique_ptr.h:270:9: error: no matching function for call to 'std::__uniq_ptr_data<xbcloud::S3_signer, std::default_delete<xbcloud::S3_signer>, true, true>::__uniq_ptr_data()'
  270 |  : _M_t()
      |         ^
/usr/include/c++/10.3.0/bits/unique_ptr.h:210:40: note: candidate: 'std::__uniq_ptr_data<xbcloud::S3_signer, std::default_delete<xbcloud::S3_signer>, true, true>::__uniq_ptr_data(std::__uniq_ptr_impl<xbcloud::S3_signer, std::default_delete<xbcloud::S3_signer> >::pointer) [inherited from std::__uniq_ptr_impl<xbcloud::S3_signer, std::default_delete<xbcloud::S3_signer> >]'
  210 |       using __uniq_ptr_impl<_Tp, _Dp>::__uniq_ptr_impl;
      |                                        ^~~~~~~~~~~~~~~
/usr/include/c++/10.3.0/bits/unique_ptr.h:210:40: note:   candidate expects 1 argument, 0 provided
/usr/include/c++/10.3.0/bits/unique_ptr.h:210:40: note: candidate: 'template<class _Del> std::__uniq_ptr_data<xbcloud::S3_signer, std::default_delete<xbcloud::S3_signer>, true, true>::__uniq_ptr_data(std::__uniq_ptr_impl<xbcloud::S3_signer, std::default_delete<xbcloud::S3_signer> >::pointer, _Del&&) [inherited from std::__uniq_ptr_impl<xbcloud::S3_signer, std::default_delete<xbcloud::S3_signer> >]'
/usr/include/c++/10.3.0/bits/unique_ptr.h:210:40: note:   template argument deduction/substitution failed:
/usr/include/c++/10.3.0/bits/unique_ptr.h:270:9: note:   candidate expects 2 arguments, 0 provided
  270 |  : _M_t()
      |         ^
/usr/include/c++/10.3.0/bits/unique_ptr.h:211:7: note: candidate: 'std::__uniq_ptr_data<_Tp, _Dp, <anonymous>, <anonymous> >::__uniq_ptr_data(std::__uniq_ptr_data<_Tp, _Dp, <anonymous>, <anonymous> >&&) [with _Tp = xbcloud::S3_signer; _Dp = std::default_delete<xbcloud::S3_signer>; bool <anonymous> = true; bool <anonymous> = true]'
  211 |       __uniq_ptr_data(__uniq_ptr_data&&) = default;
      |       ^~~~~~~~~~~~~~~
/usr/include/c++/10.3.0/bits/unique_ptr.h:211:7: note:   candidate expects 1 argument, 0 provided
/usr/include/c++/10.3.0/bits/unique_ptr.h: In instantiation of 'constexpr std::unique_ptr<_Tp, _Dp>::unique_ptr(std::nullptr_t) [with _Del = std::default_delete<xbcloud::Object_store>; <template-parameter-2-2> = void; _Tp = xbcloud::Object_store; _Dp = std::default_delete<xbcloud::Object_store>; std::nullptr_t = std::nullptr_t]':
/tmp/B.M3c9ho/BUILD/percona-xtrabackup-percona-xtrabackup-2.4.20/storage/innobase/xtrabackup/src/xbcloud/xbcloud.cc:914:48:   required from here
/usr/include/c++/10.3.0/bits/unique_ptr.h:321:9: error: no matching function for call to 'std::__uniq_ptr_data<xbcloud::Object_store, std::default_delete<xbcloud::Object_store>, true, true>::__uniq_ptr_data()'
  321 |  : _M_t()
      |         ^
/usr/include/c++/10.3.0/bits/unique_ptr.h:210:40: note: candidate: 'std::__uniq_ptr_data<xbcloud::Object_store, std::default_delete<xbcloud::Object_store>, true, true>::__uniq_ptr_data(std::__uniq_ptr_impl<xbcloud::Object_store, std::default_delete<xbcloud::Object_store> >::pointer) [inherited from std::__uniq_ptr_impl<xbcloud::Object_store, std::default_delete<xbcloud::Object_store> >]'
  210 |       using __uniq_ptr_impl<_Tp, _Dp>::__uniq_ptr_impl;
      |                                        ^~~~~~~~~~~~~~~
/usr/include/c++/10.3.0/bits/unique_ptr.h:210:40: note:   candidate expects 1 argument, 0 provided
/usr/include/c++/10.3.0/bits/unique_ptr.h:210:40: note: candidate: 'template<class _Del> std::__uniq_ptr_data<xbcloud::Object_store, std::default_delete<xbcloud::Object_store>, true, true>::__uniq_ptr_data(std::__uniq_ptr_impl<xbcloud::Object_store, std::default_delete<xbcloud::Object_store> >::pointer, _Del&&) [inherited from std::__uniq_ptr_impl<xbcloud::Object_store, std::default_delete<xbcloud::Object_store> >]'
/usr/include/c++/10.3.0/bits/unique_ptr.h:210:40: note:   template argument deduction/substitution failed:
/usr/include/c++/10.3.0/bits/unique_ptr.h:321:9: note:   candidate expects 2 arguments, 0 provided
  321 |  : _M_t()
      |         ^
/usr/include/c++/10.3.0/bits/unique_ptr.h:211:7: note: candidate: 'std::__uniq_ptr_data<_Tp, _Dp, <anonymous>, <anonymous> >::__uniq_ptr_data(std::__uniq_ptr_data<_Tp, _Dp, <anonymous>, <anonymous> >&&) [with _Tp = xbcloud::Object_store; _Dp = std::default_delete<xbcloud::Object_store>; bool <anonymous> = true; bool <anonymous> = true]'
  211 |       __uniq_ptr_data(__uniq_ptr_data&&) = default;
      |       ^~~~~~~~~~~~~~~
/usr/include/c++/10.3.0/bits/unique_ptr.h:211:7: note:   candidate expects 1 argument, 0 provided
/usr/include/c++/10.3.0/bits/unique_ptr.h: In instantiation of 'constexpr std::unique_ptr<_Tp, _Dp>::unique_ptr() [with _Del = std::default_delete<xbcloud_put(xbcloud::Object_store*, const string&, const string&, bool)::file_entry_t>; <template-parameter-2-2> = void; _Tp = xbcloud_put(xbcloud::Object_store*, const string&, const string&, bool)::file_entry_t; _Dp = std::default_delete<xbcloud_put(xbcloud::Object_store*, const string&, const string&, bool)::file_entry_t>]':
/usr/include/c++/10.3.0/tuple:1693:70:   required from 'std::pair<_T1, _T2>::pair(std::tuple<_Args1 ...>&, std::tuple<_Args2 ...>&, std::_Index_tuple<_Indexes1 ...>, std::_Index_tuple<_Indexes2 ...>) [with _Args1 = {std::__cxx11::basic_string<char, std::char_traits<char>, std::allocator<char> >&&}; unsigned int ..._Indexes1 = {0}; _Args2 = {}; unsigned int ..._Indexes2 = {}; _T1 = const std::__cxx11::basic_string<char>; _T2 = std::unique_ptr<xbcloud_put(xbcloud::Object_store*, const string&, const string&, bool)::file_entry_t>]'
/usr/include/c++/10.3.0/tuple:1682:63:   required from 'std::pair<_T1, _T2>::pair(std::piecewise_construct_t, std::tuple<_Args1 ...>, std::tuple<_Args2 ...>) [with _Args1 = {std::__cxx11::basic_string<char, std::char_traits<char>, std::allocator<char> >&&}; _Args2 = {}; _T1 = const std::__cxx11::basic_string<char>; _T2 = std::unique_ptr<xbcloud_put(xbcloud::Object_store*, const string&, const string&, bool)::file_entry_t>]'
/usr/include/c++/10.3.0/ext/new_allocator.h:150:4:   required from 'void __gnu_cxx::new_allocator<_Tp>::construct(_Up*, _Args&& ...) [with _Up = std::pair<const std::__cxx11::basic_string<char>, std::unique_ptr<xbcloud_put(xbcloud::Object_store*, const string&, const string&, bool)::file_entry_t> >; _Args = {const std::piecewise_construct_t&, std::tuple<std::__cxx11::basic_string<char, std::char_traits<char>, std::allocator<char> >&&>, std::tuple<>}; _Tp = std::__detail::_Hash_node<std::pair<const std::__cxx11::basic_string<char>, std::unique_ptr<xbcloud_put(xbcloud::Object_store*, const string&, const string&, bool)::file_entry_t> >, true>]'
/usr/include/c++/10.3.0/bits/alloc_traits.h:512:17:   required from 'static void std::allocator_traits<std::allocator<_CharT> >::construct(std::allocator_traits<std::allocator<_CharT> >::allocator_type&, _Up*, _Args&& ...) [with _Up = std::pair<const std::__cxx11::basic_string<char>, std::unique_ptr<xbcloud_put(xbcloud::Object_store*, const string&, const string&, bool)::file_entry_t> >; _Args = {const std::piecewise_construct_t&, std::tuple<std::__cxx11::basic_string<char, std::char_traits<char>, std::allocator<char> >&&>, std::tuple<>}; _Tp = std::__detail::_Hash_node<std::pair<const std::__cxx11::basic_string<char>, std::unique_ptr<xbcloud_put(xbcloud::Object_store*, const string&, const string&, bool)::file_entry_t> >, true>; std::allocator_traits<std::allocator<_CharT> >::allocator_type = std::allocator<std::__detail::_Hash_node<std::pair<const std::__cxx11::basic_string<char>, std::unique_ptr<xbcloud_put(xbcloud::Object_store*, const string&, const string&, bool)::file_entry_t> >, true> >]'
/usr/include/c++/10.3.0/bits/hashtable_policy.h:2037:36:   required from 'std::__detail::_Hashtable_alloc<_NodeAlloc>::__node_type* std::__detail::_Hashtable_alloc<_NodeAlloc>::_M_allocate_node(_Args&& ...) [with _Args = {const std::piecewise_construct_t&, std::tuple<std::__cxx11::basic_string<char, std::char_traits<char>, std::allocator<char> >&&>, std::tuple<>}; _NodeAlloc = std::allocator<std::__detail::_Hash_node<std::pair<const std::__cxx11::basic_string<char>, std::unique_ptr<xbcloud_put(xbcloud::Object_store*, const string&, const string&, bool)::file_entry_t> >, true> >; std::__detail::_Hashtable_alloc<_NodeAlloc>::__node_type = std::allocator<std::__detail::_Hash_node<std::pair<const std::__cxx11::basic_string<char>, std::unique_ptr<xbcloud_put(xbcloud::Object_store*, const string&, const string&, bool)::file_entry_t> >, true> >::value_type]'
/usr/include/c++/10.3.0/bits/hashtable.h:272:35:   required from 'std::_Hashtable<_Key, _Value, _Alloc, _ExtractKey, _Equal, _H1, _H2, _Hash, _RehashPolicy, _Traits>::_Scoped_node::_Scoped_node(std::_Hashtable<_Key, _Value, _Alloc, _ExtractKey, _Equal, _H1, _H2, _Hash, _RehashPolicy, _Traits>::__hashtable_alloc*, _Args&& ...) [with _Args = {const std::piecewise_construct_t&, std::tuple<std::__cxx11::basic_string<char, std::char_traits<char>, std::allocator<char> >&&>, std::tuple<>}; _Key = std::__cxx11::basic_string<char>; _Value = std::pair<const std::__cxx11::basic_string<char>, std::unique_ptr<xbcloud_put(xbcloud::Object_store*, const string&, const string&, bool)::file_entry_t> >; _Alloc = std::allocator<std::pair<const std::__cxx11::basic_string<char>, std::unique_ptr<xbcloud_put(xbcloud::Object_store*, const string&, const string&, bool)::file_entry_t> > >; _ExtractKey = std::__detail::_Select1st; _Equal = std::equal_to<std::__cxx11::basic_string<char> >; _H1 = std::hash<std::__cxx11::basic_string<char> >; _H2 = std::__detail::_Mod_range_hashing; _Hash = std::__detail::_Default_ranged_hash; _RehashPolicy = std::__detail::_Prime_rehash_policy; _Traits = std::__detail::_Hashtable_traits<true, false, true>; std::_Hashtable<_Key, _Value, _Alloc, _ExtractKey, _Equal, _H1, _H2, _Hash, _RehashPolicy, _Traits>::__hashtable_alloc = std::_Hashtable<std::__cxx11::basic_string<char>, std::pair<const std::__cxx11::basic_string<char>, std::unique_ptr<xbcloud_put(xbcloud::Object_store*, const string&, const string&, bool)::file_entry_t> >, std::allocator<std::pair<const std::__cxx11::basic_string<char>, std::unique_ptr<xbcloud_put(xbcloud::Object_store*, const string&, const string&, bool)::file_entry_t> > >, std::__detail::_Select1st, std::equal_to<std::__cxx11::basic_string<char> >, std::hash<std::__cxx11::basic_string<char> >, std::__detail::_Mod_range_hashing, std::__detail::_Default_ranged_hash, std::__detail::_Prime_rehash_policy, std::__detail::_Hashtable_traits<true, false, true> >::__hashtable_alloc]'
/usr/include/c++/10.3.0/bits/hashtable_policy.h:739:42:   required from 'std::__detail::_Map_base<_Key, _Pair, _Alloc, std::__detail::_Select1st, _Equal, _H1, _H2, _Hash, _RehashPolicy, _Traits, true>::mapped_type& std::__detail::_Map_base<_Key, _Pair, _Alloc, std::__detail::_Select1st, _Equal, _H1, _H2, _Hash, _RehashPolicy, _Traits, true>::operator[](std::__detail::_Map_base<_Key, _Pair, _Alloc, std::__detail::_Select1st, _Equal, _H1, _H2, _Hash, _RehashPolicy, _Traits, true>::key_type&&) [with _Key = std::__cxx11::basic_string<char>; _Pair = std::pair<const std::__cxx11::basic_string<char>, std::unique_ptr<xbcloud_put(xbcloud::Object_store*, const string&, const string&, bool)::file_entry_t> >; _Alloc = std::allocator<std::pair<const std::__cxx11::basic_string<char>, std::unique_ptr<xbcloud_put(xbcloud::Object_store*, const string&, const string&, bool)::file_entry_t> > >; _Equal = std::equal_to<std::__cxx11::basic_string<char> >; _H1 = std::hash<std::__cxx11::basic_string<char> >; _H2 = std::__detail::_Mod_range_hashing; _Hash = std::__detail::_Default_ranged_hash; _RehashPolicy = std::__detail::_Prime_rehash_policy; _Traits = std::__detail::_Hashtable_traits<true, false, true>; std::__detail::_Map_base<_Key, _Pair, _Alloc, std::__detail::_Select1st, _Equal, _H1, _H2, _Hash, _RehashPolicy, _Traits, true>::mapped_type = std::unique_ptr<xbcloud_put(xbcloud::Object_store*, const string&, const string&, bool)::file_entry_t>; std::__detail::_Map_base<_Key, _Pair, _Alloc, std::__detail::_Select1st, _Equal, _H1, _H2, _Hash, _RehashPolicy, _Traits, true>::key_type = std::__cxx11::basic_string<char>]'
/usr/include/c++/10.3.0/bits/unordered_map.h:988:20:   required from 'std::unordered_map<_Key, _Tp, _Hash, _Pred, _Alloc>::mapped_type& std::unordered_map<_Key, _Tp, _Hash, _Pred, _Alloc>::operator[](std::unordered_map<_Key, _Tp, _Hash, _Pred, _Alloc>::key_type&&) [with _Key = std::__cxx11::basic_string<char>; _Tp = std::unique_ptr<xbcloud_put(xbcloud::Object_store*, const string&, const string&, bool)::file_entry_t>; _Hash = std::hash<std::__cxx11::basic_string<char> >; _Pred = std::equal_to<std::__cxx11::basic_string<char> >; _Alloc = std::allocator<std::pair<const std::__cxx11::basic_string<char>, std::unique_ptr<xbcloud_put(xbcloud::Object_store*, const string&, const string&, bool)::file_entry_t> > >; std::unordered_map<_Key, _Tp, _Hash, _Pred, _Alloc>::mapped_type = std::unique_ptr<xbcloud_put(xbcloud::Object_store*, const string&, const string&, bool)::file_entry_t>; std::unordered_map<_Key, _Tp, _Hash, _Pred, _Alloc>::key_type = std::__cxx11::basic_string<char>]'
/tmp/B.M3c9ho/BUILD/percona-xtrabackup-percona-xtrabackup-2.4.20/storage/innobase/xtrabackup/src/xbcloud/xbcloud.cc:602:46:   required from here
/usr/include/c++/10.3.0/bits/unique_ptr.h:270:9: error: no matching function for call to 'std::__uniq_ptr_data<xbcloud_put(xbcloud::Object_store*, const string&, const string&, bool)::file_entry_t, std::default_delete<xbcloud_put(xbcloud::Object_store*, const string&, const string&, bool)::file_entry_t>, true, true>::__uniq_ptr_data()'
  270 |  : _M_t()
      |         ^
/usr/include/c++/10.3.0/bits/unique_ptr.h:210:40: note: candidate: 'std::__uniq_ptr_data<xbcloud_put(xbcloud::Object_store*, const string&, const string&, bool)::file_entry_t, std::default_delete<xbcloud_put(xbcloud::Object_store*, const string&, const string&, bool)::file_entry_t>, true, true>::__uniq_ptr_data(std::__uniq_ptr_impl<xbcloud_put(xbcloud::Object_store*, const string&, const string&, bool)::file_entry_t, std::default_delete<xbcloud_put(xbcloud::Object_store*, const string&, const string&, bool)::file_entry_t> >::pointer) [inherited from std::__uniq_ptr_impl<xbcloud_put(xbcloud::Object_store*, const string&, const string&, bool)::file_entry_t, std::default_delete<xbcloud_put(xbcloud::Object_store*, const string&, const string&, bool)::file_entry_t> >]'
  210 |       using __uniq_ptr_impl<_Tp, _Dp>::__uniq_ptr_impl;
      |                                        ^~~~~~~~~~~~~~~
/usr/include/c++/10.3.0/bits/unique_ptr.h:210:40: note:   candidate expects 1 argument, 0 provided
/usr/include/c++/10.3.0/bits/unique_ptr.h:210:40: note: candidate: 'template<class _Del> std::__uniq_ptr_data<xbcloud_put(xbcloud::Object_store*, const string&, const string&, bool)::file_entry_t, std::default_delete<xbcloud_put(xbcloud::Object_store*, const string&, const string&, bool)::file_entry_t>, true, true>::__uniq_ptr_data(std::__uniq_ptr_impl<xbcloud_put(xbcloud::Object_store*, const string&, const string&, bool)::file_entry_t, std::default_delete<xbcloud_put(xbcloud::Object_store*, const string&, const string&, bool)::file_entry_t> >::pointer, _Del&&) [inherited from std::__uniq_ptr_impl<xbcloud_put(xbcloud::Object_store*, const string&, const string&, bool)::file_entry_t, std::default_delete<xbcloud_put(xbcloud::Object_store*, const string&, const string&, bool)::file_entry_t> >]'
/usr/include/c++/10.3.0/bits/unique_ptr.h:210:40: note:   template argument deduction/substitution failed:
/usr/include/c++/10.3.0/bits/unique_ptr.h:270:9: note:   candidate expects 2 arguments, 0 provided
  270 |  : _M_t()
      |         ^
/usr/include/c++/10.3.0/bits/unique_ptr.h:211:7: note: candidate: 'std::__uniq_ptr_data<_Tp, _Dp, <anonymous>, <anonymous> >::__uniq_ptr_data(std::__uniq_ptr_data<_Tp, _Dp, <anonymous>, <anonymous> >&&) [with _Tp = xbcloud_put(xbcloud::Object_store*, const string&, const string&, bool)::file_entry_t; _Dp = std::default_delete<xbcloud_put(xbcloud::Object_store*, const string&, const string&, bool)::file_entry_t>; bool <anonymous> = true; bool <anonymous> = true]'
  211 |       __uniq_ptr_data(__uniq_ptr_data&&) = default;
      |       ^~~~~~~~~~~~~~~
/usr/include/c++/10.3.0/bits/unique_ptr.h:211:7: note:   candidate expects 1 argument, 0 provided
make[2]: *** [storage/innobase/xtrabackup/src/xbcloud/CMakeFiles/xbcloud.dir/build.make:86: storage/innobase/xtrabackup/src/xbcloud/CMakeFiles/xbcloud.dir/xbcloud.cc.o] Error 1
make[2]: Leaving directory '/tmp/B.M3c9ho/BUILD/percona-xtrabackup-percona-xtrabackup-2.4.20/build'
make[2]: *** Waiting for unfinished jobs....
make[2]: Entering directory '/tmp/B.M3c9ho/BUILD/percona-xtrabackup-percona-xtrabackup-2.4.20/build'
[ 29%] Building CXX object storage/innobase/xtrabackup/src/xbcloud/CMakeFiles/xbcloud.dir/s3.cc.o
cd /tmp/B.M3c9ho/BUILD/percona-xtrabackup-percona-xtrabackup-2.4.20/build/storage/innobase/xtrabackup/src/xbcloud && /usr/bin/x86_64-pld-linux-gnux32-g++  -DBOOST_GEOMETRY_SQRT_CHECK_FINITENESS -DCOMPILER_HINTS -DHAVE_CONFIG_H -DHAVE_FALLOC_PUNCH_HOLE_AND_KEEP_SIZE=1 -DHAVE_IB_ATOMIC_PTHREAD_T_GCC=1 -DHAVE_IB_GCC_ATOMIC_COMPARE_EXCHANGE=1 -DHAVE_IB_GCC_ATOMIC_THREAD_FENCE=1 -DHAVE_IB_GCC_SYNC_SYNCHRONISE=1 -DHAVE_IB_LINUX_FUTEX=1 -DHAVE_LIBEVENT2 -DHAVE_LZ4=1 -DHAVE_NANOSLEEP=1 -DHAVE_SCHED_GETCPU=1 -DLINUX_NATIVE_AIO=1 -DMUTEX_EVENT -DXTRABACKUP -D_FILE_OFFSET_BITS=64 -D_GNU_SOURCE -I/tmp/B.M3c9ho/BUILD/percona-xtrabackup-percona-xtrabackup-2.4.20/build/include -I/tmp/B.M3c9ho/BUILD/percona-xtrabackup-percona-xtrabackup-2.4.20/extra/rapidjson/include -I/tmp/B.M3c9ho/BUILD/percona-xtrabackup-percona-xtrabackup-2.4.20/build/libbinlogevents/include -I/tmp/B.M3c9ho/BUILD/percona-xtrabackup-percona-xtrabackup-2.4.20/libbinlogevents/export -I/tmp/B.M3c9ho/BUILD/percona-xtrabackup-percona-xtrabackup-2.4.20/storage/innobase/include -I/tmp/B.M3c9ho/BUILD/percona-xtrabackup-percona-xtrabackup-2.4.20/storage/innobase/handler -I/tmp/B.M3c9ho/BUILD/percona-xtrabackup-percona-xtrabackup-2.4.20/libbinlogevents/include -I/tmp/B.M3c9ho/BUILD/percona-xtrabackup-percona-xtrabackup-2.4.20/include -I/tmp/B.M3c9ho/BUILD/percona-xtrabackup-percona-xtrabackup-2.4.20/sql -I/tmp/B.M3c9ho/BUILD/percona-xtrabackup-percona-xtrabackup-2.4.20/sql/auth -I/tmp/B.M3c9ho/BUILD/percona-xtrabackup-percona-xtrabackup-2.4.20/regex -I/tmp/B.M3c9ho/BUILD/percona-xtrabackup-percona-xtrabackup-2.4.20/storage/innobase/xtrabackup/src -I/tmp/B.M3c9ho/BUILD/percona-xtrabackup-percona-xtrabackup-2.4.20/storage/innobase/xtrabackup/src/crc -I/tmp/B.M3c9ho/BUILD/percona-xtrabackup-percona-xtrabackup-2.4.20/build/storage/innobase/xtrabackup/src/xbcloud/..  -Wno-deprecated-declarations  -fPIC -Wall -Wextra -Wformat-security -Wvla -Wimplicit-fallthrough=2 -Woverloaded-virtual -Wno-unused-parameter -Wimplicit-fallthrough=2 -O3 -g -fabi-version=2 -fno-omit-frame-pointer -fno-strict-aliasing -std=gnu++03 -DDBUG_OFF   -DUNIV_LINUX -D_GNU_SOURCE=1 -std=c++11 -o CMakeFiles/xbcloud.dir/s3.cc.o -c /tmp/B.M3c9ho/BUILD/percona-xtrabackup-percona-xtrabackup-2.4.20/storage/innobase/xtrabackup/src/xbcloud/s3.cc
In file included from /usr/include/c++/10.3.0/memory:83,
                 from /tmp/B.M3c9ho/BUILD/percona-xtrabackup-percona-xtrabackup-2.4.20/storage/innobase/xtrabackup/src/xbcloud/http.h:28,
                 from /tmp/B.M3c9ho/BUILD/percona-xtrabackup-percona-xtrabackup-2.4.20/storage/innobase/xtrabackup/src/xbcloud/object_store.h:28,
                 from /tmp/B.M3c9ho/BUILD/percona-xtrabackup-percona-xtrabackup-2.4.20/storage/innobase/xtrabackup/src/xbcloud/s3.h:24,
                 from /tmp/B.M3c9ho/BUILD/percona-xtrabackup-percona-xtrabackup-2.4.20/storage/innobase/xtrabackup/src/xbcloud/s3.cc:21:
/usr/include/c++/10.3.0/bits/unique_ptr.h: In instantiation of 'constexpr std::unique_ptr<_Tp, _Dp>::unique_ptr() [with _Del = std::default_delete<xbcloud::S3_signer>; <template-parameter-2-2> = void; _Tp = xbcloud::S3_signer; _Dp = std::default_delete<xbcloud::S3_signer>]':
/tmp/B.M3c9ho/BUILD/percona-xtrabackup-percona-xtrabackup-2.4.20/storage/innobase/xtrabackup/src/xbcloud/s3.h:164:30:   required from here
/usr/include/c++/10.3.0/bits/unique_ptr.h:270:9: error: no matching function for call to 'std::__uniq_ptr_data<xbcloud::S3_signer, std::default_delete<xbcloud::S3_signer>, true, true>::__uniq_ptr_data()'
  270 |  : _M_t()
      |         ^
/usr/include/c++/10.3.0/bits/unique_ptr.h:210:40: note: candidate: 'std::__uniq_ptr_data<xbcloud::S3_signer, std::default_delete<xbcloud::S3_signer>, true, true>::__uniq_ptr_data(std::__uniq_ptr_impl<xbcloud::S3_signer, std::default_delete<xbcloud::S3_signer> >::pointer) [inherited from std::__uniq_ptr_impl<xbcloud::S3_signer, std::default_delete<xbcloud::S3_signer> >]'
  210 |       using __uniq_ptr_impl<_Tp, _Dp>::__uniq_ptr_impl;
      |                                        ^~~~~~~~~~~~~~~
/usr/include/c++/10.3.0/bits/unique_ptr.h:210:40: note:   candidate expects 1 argument, 0 provided
/usr/include/c++/10.3.0/bits/unique_ptr.h:210:40: note: candidate: 'template<class _Del> std::__uniq_ptr_data<xbcloud::S3_signer, std::default_delete<xbcloud::S3_signer>, true, true>::__uniq_ptr_data(std::__uniq_ptr_impl<xbcloud::S3_signer, std::default_delete<xbcloud::S3_signer> >::pointer, _Del&&) [inherited from std::__uniq_ptr_impl<xbcloud::S3_signer, std::default_delete<xbcloud::S3_signer> >]'
/usr/include/c++/10.3.0/bits/unique_ptr.h:210:40: note:   template argument deduction/substitution failed:
/usr/include/c++/10.3.0/bits/unique_ptr.h:270:9: note:   candidate expects 2 arguments, 0 provided
  270 |  : _M_t()
      |         ^
/usr/include/c++/10.3.0/bits/unique_ptr.h:211:7: note: candidate: 'std::__uniq_ptr_data<_Tp, _Dp, <anonymous>, <anonymous> >::__uniq_ptr_data(std::__uniq_ptr_data<_Tp, _Dp, <anonymous>, <anonymous> >&&) [with _Tp = xbcloud::S3_signer; _Dp = std::default_delete<xbcloud::S3_signer>; bool <anonymous> = true; bool <anonymous> = true]'
  211 |       __uniq_ptr_data(__uniq_ptr_data&&) = default;
      |       ^~~~~~~~~~~~~~~
/usr/include/c++/10.3.0/bits/unique_ptr.h:211:7: note:   candidate expects 1 argument, 0 provided
make[2]: *** [storage/innobase/xtrabackup/src/xbcloud/CMakeFiles/xbcloud.dir/build.make:125: storage/innobase/xtrabackup/src/xbcloud/CMakeFiles/xbcloud.dir/s3.cc.o] Error 1
make[2]: Leaving directory '/tmp/B.M3c9ho/BUILD/percona-xtrabackup-percona-xtrabackup-2.4.20/build'
make[2]: Entering directory '/tmp/B.M3c9ho/BUILD/percona-xtrabackup-percona-xtrabackup-2.4.20/build'
[ 30%] Building CXX object libbinlogevents/src/CMakeFiles/binlogevents_static.dir/binary_log_funcs.cpp.o
cd /tmp/B.M3c9ho/BUILD/percona-xtrabackup-percona-xtrabackup-2.4.20/build/libbinlogevents/src && /usr/bin/x86_64-pld-linux-gnux32-g++  -DBOOST_GEOMETRY_SQRT_CHECK_FINITENESS -DHAVE_CONFIG_H -DHAVE_LIBEVENT2 -DXTRABACKUP -D_FILE_OFFSET_BITS=64 -D_GNU_SOURCE -I/tmp/B.M3c9ho/BUILD/percona-xtrabackup-percona-xtrabackup-2.4.20/build/include -I/tmp/B.M3c9ho/BUILD/percona-xtrabackup-percona-xtrabackup-2.4.20/extra/rapidjson/include -I/tmp/B.M3c9ho/BUILD/percona-xtrabackup-percona-xtrabackup-2.4.20/build/libbinlogevents/include -I/tmp/B.M3c9ho/BUILD/percona-xtrabackup-percona-xtrabackup-2.4.20/libbinlogevents/export -I/tmp/B.M3c9ho/BUILD/percona-xtrabackup-percona-xtrabackup-2.4.20/include -I/tmp/B.M3c9ho/BUILD/percona-xtrabackup-percona-xtrabackup-2.4.20/libbinlogevents/include  -fPIC -Wall -Wextra -Wformat-security -Wvla -Wimplicit-fallthrough=2 -Woverloaded-virtual -Wno-unused-parameter -Wimplicit-fallthrough=2 -O3 -g -fabi-version=2 -fno-omit-frame-pointer -fno-strict-aliasing -std=gnu++03 -DDBUG_OFF   -o CMakeFiles/binlogevents_static.dir/binary_log_funcs.cpp.o -c /tmp/B.M3c9ho/BUILD/percona-xtrabackup-percona-xtrabackup-2.4.20/libbinlogevents/src/binary_log_funcs.cpp
make[2]: Leaving directory '/tmp/B.M3c9ho/BUILD/percona-xtrabackup-percona-xtrabackup-2.4.20/build'
make[2]: Entering directory '/tmp/B.M3c9ho/BUILD/percona-xtrabackup-percona-xtrabackup-2.4.20/build'
[ 30%] Building CXX object libbinlogevents/src/CMakeFiles/binlogevents_static.dir/binlog_event.cpp.o
cd /tmp/B.M3c9ho/BUILD/percona-xtrabackup-percona-xtrabackup-2.4.20/build/libbinlogevents/src && /usr/bin/x86_64-pld-linux-gnux32-g++  -DBOOST_GEOMETRY_SQRT_CHECK_FINITENESS -DHAVE_CONFIG_H -DHAVE_LIBEVENT2 -DXTRABACKUP -D_FILE_OFFSET_BITS=64 -D_GNU_SOURCE -I/tmp/B.M3c9ho/BUILD/percona-xtrabackup-percona-xtrabackup-2.4.20/build/include -I/tmp/B.M3c9ho/BUILD/percona-xtrabackup-percona-xtrabackup-2.4.20/extra/rapidjson/include -I/tmp/B.M3c9ho/BUILD/percona-xtrabackup-percona-xtrabackup-2.4.20/build/libbinlogevents/include -I/tmp/B.M3c9ho/BUILD/percona-xtrabackup-percona-xtrabackup-2.4.20/libbinlogevents/export -I/tmp/B.M3c9ho/BUILD/percona-xtrabackup-percona-xtrabackup-2.4.20/include -I/tmp/B.M3c9ho/BUILD/percona-xtrabackup-percona-xtrabackup-2.4.20/libbinlogevents/include  -fPIC -Wall -Wextra -Wformat-security -Wvla -Wimplicit-fallthrough=2 -Woverloaded-virtual -Wno-unused-parameter -Wimplicit-fallthrough=2 -O3 -g -fabi-version=2 -fno-omit-frame-pointer -fno-strict-aliasing -std=gnu++03 -DDBUG_OFF   -o CMakeFiles/binlogevents_static.dir/binlog_event.cpp.o -c /tmp/B.M3c9ho/BUILD/percona-xtrabackup-percona-xtrabackup-2.4.20/libbinlogevents/src/binlog_event.cpp
make[2]: Leaving directory '/tmp/B.M3c9ho/BUILD/percona-xtrabackup-percona-xtrabackup-2.4.20/build'
make[2]: Entering directory '/tmp/B.M3c9ho/BUILD/percona-xtrabackup-percona-xtrabackup-2.4.20/build'
[ 30%] Building CXX object libbinlogevents/src/CMakeFiles/binlogevents_static.dir/load_data_events.cpp.o
cd /tmp/B.M3c9ho/BUILD/percona-xtrabackup-percona-xtrabackup-2.4.20/build/libbinlogevents/src && /usr/bin/x86_64-pld-linux-gnux32-g++  -DBOOST_GEOMETRY_SQRT_CHECK_FINITENESS -DHAVE_CONFIG_H -DHAVE_LIBEVENT2 -DXTRABACKUP -D_FILE_OFFSET_BITS=64 -D_GNU_SOURCE -I/tmp/B.M3c9ho/BUILD/percona-xtrabackup-percona-xtrabackup-2.4.20/build/include -I/tmp/B.M3c9ho/BUILD/percona-xtrabackup-percona-xtrabackup-2.4.20/extra/rapidjson/include -I/tmp/B.M3c9ho/BUILD/percona-xtrabackup-percona-xtrabackup-2.4.20/build/libbinlogevents/include -I/tmp/B.M3c9ho/BUILD/percona-xtrabackup-percona-xtrabackup-2.4.20/libbinlogevents/export -I/tmp/B.M3c9ho/BUILD/percona-xtrabackup-percona-xtrabackup-2.4.20/include -I/tmp/B.M3c9ho/BUILD/percona-xtrabackup-percona-xtrabackup-2.4.20/libbinlogevents/include  -fPIC -Wall -Wextra -Wformat-security -Wvla -Wimplicit-fallthrough=2 -Woverloaded-virtual -Wno-unused-parameter -Wimplicit-fallthrough=2 -O3 -g -fabi-version=2 -fno-omit-frame-pointer -fno-strict-aliasing -std=gnu++03 -DDBUG_OFF   -o CMakeFiles/binlogevents_static.dir/load_data_events.cpp.o -c /tmp/B.M3c9ho/BUILD/percona-xtrabackup-percona-xtrabackup-2.4.20/libbinlogevents/src/load_data_events.cpp
make[2]: Leaving directory '/tmp/B.M3c9ho/BUILD/percona-xtrabackup-percona-xtrabackup-2.4.20/build'
make[2]: Entering directory '/tmp/B.M3c9ho/BUILD/percona-xtrabackup-percona-xtrabackup-2.4.20/build'
[ 29%] Building C object libmysql/CMakeFiles/clientlib.dir/libmysql.c.o
cd /tmp/B.M3c9ho/BUILD/percona-xtrabackup-percona-xtrabackup-2.4.20/build/libmysql && /usr/bin/x86_64-pld-linux-gnux32-gcc -DBOOST_GEOMETRY_SQRT_CHECK_FINITENESS -DHAVE_CONFIG_H -DHAVE_LIBEVENT2 -DHAVE_OPENSSL -DXTRABACKUP -D_FILE_OFFSET_BITS=64 -D_GNU_SOURCE -I/tmp/B.M3c9ho/BUILD/percona-xtrabackup-percona-xtrabackup-2.4.20/build/include -I/tmp/B.M3c9ho/BUILD/percona-xtrabackup-percona-xtrabackup-2.4.20/extra/rapidjson/include -I/tmp/B.M3c9ho/BUILD/percona-xtrabackup-percona-xtrabackup-2.4.20/build/libbinlogevents/include -I/tmp/B.M3c9ho/BUILD/percona-xtrabackup-percona-xtrabackup-2.4.20/libbinlogevents/export -I/tmp/B.M3c9ho/BUILD/percona-xtrabackup-percona-xtrabackup-2.4.20/include -I/tmp/B.M3c9ho/BUILD/percona-xtrabackup-percona-xtrabackup-2.4.20/libmysql -I/tmp/B.M3c9ho/BUILD/percona-xtrabackup-percona-xtrabackup-2.4.20/regex -I/tmp/B.M3c9ho/BUILD/percona-xtrabackup-percona-xtrabackup-2.4.20/sql -I/tmp/B.M3c9ho/BUILD/percona-xtrabackup-percona-xtrabackup-2.4.20/strings  -fPIC -Wall -Wextra -Wformat-security -Wvla -Wimplicit-fallthrough=2 -Wwrite-strings -Wdeclaration-after-statement -O3 -g -fabi-version=2 -fno-omit-frame-pointer -fno-strict-aliasing -DDBUG_OFF   -D CLIENT_PROTOCOL_TRACING -o CMakeFiles/clientlib.dir/libmysql.c.o   -c /tmp/B.M3c9ho/BUILD/percona-xtrabackup-percona-xtrabackup-2.4.20/libmysql/libmysql.c
make[2]: Leaving directory '/tmp/B.M3c9ho/BUILD/percona-xtrabackup-percona-xtrabackup-2.4.20/build'
make[2]: Entering directory '/tmp/B.M3c9ho/BUILD/percona-xtrabackup-percona-xtrabackup-2.4.20/build'
[ 30%] Building C object libmysql/CMakeFiles/clientlib.dir/errmsg.c.o
cd /tmp/B.M3c9ho/BUILD/percona-xtrabackup-percona-xtrabackup-2.4.20/build/libmysql && /usr/bin/x86_64-pld-linux-gnux32-gcc -DBOOST_GEOMETRY_SQRT_CHECK_FINITENESS -DHAVE_CONFIG_H -DHAVE_LIBEVENT2 -DHAVE_OPENSSL -DXTRABACKUP -D_FILE_OFFSET_BITS=64 -D_GNU_SOURCE -I/tmp/B.M3c9ho/BUILD/percona-xtrabackup-percona-xtrabackup-2.4.20/build/include -I/tmp/B.M3c9ho/BUILD/percona-xtrabackup-percona-xtrabackup-2.4.20/extra/rapidjson/include -I/tmp/B.M3c9ho/BUILD/percona-xtrabackup-percona-xtrabackup-2.4.20/build/libbinlogevents/include -I/tmp/B.M3c9ho/BUILD/percona-xtrabackup-percona-xtrabackup-2.4.20/libbinlogevents/export -I/tmp/B.M3c9ho/BUILD/percona-xtrabackup-percona-xtrabackup-2.4.20/include -I/tmp/B.M3c9ho/BUILD/percona-xtrabackup-percona-xtrabackup-2.4.20/libmysql -I/tmp/B.M3c9ho/BUILD/percona-xtrabackup-percona-xtrabackup-2.4.20/regex -I/tmp/B.M3c9ho/BUILD/percona-xtrabackup-percona-xtrabackup-2.4.20/sql -I/tmp/B.M3c9ho/BUILD/percona-xtrabackup-percona-xtrabackup-2.4.20/strings  -fPIC -Wall -Wextra -Wformat-security -Wvla -Wimplicit-fallthrough=2 -Wwrite-strings -Wdeclaration-after-statement -O3 -g -fabi-version=2 -fno-omit-frame-pointer -fno-strict-aliasing -DDBUG_OFF   -D CLIENT_PROTOCOL_TRACING -o CMakeFiles/clientlib.dir/errmsg.c.o   -c /tmp/B.M3c9ho/BUILD/percona-xtrabackup-percona-xtrabackup-2.4.20/libmysql/errmsg.c
make[2]: Leaving directory '/tmp/B.M3c9ho/BUILD/percona-xtrabackup-percona-xtrabackup-2.4.20/build'
make[2]: Entering directory '/tmp/B.M3c9ho/BUILD/percona-xtrabackup-percona-xtrabackup-2.4.20/build'
[ 30%] Building CXX object libbinlogevents/src/CMakeFiles/binlogevents_static.dir/rows_event.cpp.o
cd /tmp/B.M3c9ho/BUILD/percona-xtrabackup-percona-xtrabackup-2.4.20/build/libbinlogevents/src && /usr/bin/x86_64-pld-linux-gnux32-g++  -DBOOST_GEOMETRY_SQRT_CHECK_FINITENESS -DHAVE_CONFIG_H -DHAVE_LIBEVENT2 -DXTRABACKUP -D_FILE_OFFSET_BITS=64 -D_GNU_SOURCE -I/tmp/B.M3c9ho/BUILD/percona-xtrabackup-percona-xtrabackup-2.4.20/build/include -I/tmp/B.M3c9ho/BUILD/percona-xtrabackup-percona-xtrabackup-2.4.20/extra/rapidjson/include -I/tmp/B.M3c9ho/BUILD/percona-xtrabackup-percona-xtrabackup-2.4.20/build/libbinlogevents/include -I/tmp/B.M3c9ho/BUILD/percona-xtrabackup-percona-xtrabackup-2.4.20/libbinlogevents/export -I/tmp/B.M3c9ho/BUILD/percona-xtrabackup-percona-xtrabackup-2.4.20/include -I/tmp/B.M3c9ho/BUILD/percona-xtrabackup-percona-xtrabackup-2.4.20/libbinlogevents/include  -fPIC -Wall -Wextra -Wformat-security -Wvla -Wimplicit-fallthrough=2 -Woverloaded-virtual -Wno-unused-parameter -Wimplicit-fallthrough=2 -O3 -g -fabi-version=2 -fno-omit-frame-pointer -fno-strict-aliasing -std=gnu++03 -DDBUG_OFF   -o CMakeFiles/binlogevents_static.dir/rows_event.cpp.o -c /tmp/B.M3c9ho/BUILD/percona-xtrabackup-percona-xtrabackup-2.4.20/libbinlogevents/src/rows_event.cpp
make[2]: Leaving directory '/tmp/B.M3c9ho/BUILD/percona-xtrabackup-percona-xtrabackup-2.4.20/build'
make[2]: Entering directory '/tmp/B.M3c9ho/BUILD/percona-xtrabackup-percona-xtrabackup-2.4.20/build'
[ 31%] Building C object libmysql/CMakeFiles/clientlib.dir/__/sql-common/client_plugin.c.o
cd /tmp/B.M3c9ho/BUILD/percona-xtrabackup-percona-xtrabackup-2.4.20/build/libmysql && /usr/bin/x86_64-pld-linux-gnux32-gcc -DBOOST_GEOMETRY_SQRT_CHECK_FINITENESS -DHAVE_CONFIG_H -DHAVE_LIBEVENT2 -DHAVE_OPENSSL -DXTRABACKUP -D_FILE_OFFSET_BITS=64 -D_GNU_SOURCE -I/tmp/B.M3c9ho/BUILD/percona-xtrabackup-percona-xtrabackup-2.4.20/build/include -I/tmp/B.M3c9ho/BUILD/percona-xtrabackup-percona-xtrabackup-2.4.20/extra/rapidjson/include -I/tmp/B.M3c9ho/BUILD/percona-xtrabackup-percona-xtrabackup-2.4.20/build/libbinlogevents/include -I/tmp/B.M3c9ho/BUILD/percona-xtrabackup-percona-xtrabackup-2.4.20/libbinlogevents/export -I/tmp/B.M3c9ho/BUILD/percona-xtrabackup-percona-xtrabackup-2.4.20/include -I/tmp/B.M3c9ho/BUILD/percona-xtrabackup-percona-xtrabackup-2.4.20/libmysql -I/tmp/B.M3c9ho/BUILD/percona-xtrabackup-percona-xtrabackup-2.4.20/regex -I/tmp/B.M3c9ho/BUILD/percona-xtrabackup-percona-xtrabackup-2.4.20/sql -I/tmp/B.M3c9ho/BUILD/percona-xtrabackup-percona-xtrabackup-2.4.20/strings  -fPIC -Wall -Wextra -Wformat-security -Wvla -Wimplicit-fallthrough=2 -Wwrite-strings -Wdeclaration-after-statement -O3 -g -fabi-version=2 -fno-omit-frame-pointer -fno-strict-aliasing -DDBUG_OFF   -D CLIENT_PROTOCOL_TRACING -o CMakeFiles/clientlib.dir/__/sql-common/client_plugin.c.o   -c /tmp/B.M3c9ho/BUILD/percona-xtrabackup-percona-xtrabackup-2.4.20/sql-common/client_plugin.c
make[2]: Leaving directory '/tmp/B.M3c9ho/BUILD/percona-xtrabackup-percona-xtrabackup-2.4.20/build'
make[2]: Entering directory '/tmp/B.M3c9ho/BUILD/percona-xtrabackup-percona-xtrabackup-2.4.20/build'
[ 29%] Building CXX object libbinlogevents/src/CMakeFiles/binlogevents_static.dir/control_events.cpp.o
cd /tmp/B.M3c9ho/BUILD/percona-xtrabackup-percona-xtrabackup-2.4.20/build/libbinlogevents/src && /usr/bin/x86_64-pld-linux-gnux32-g++  -DBOOST_GEOMETRY_SQRT_CHECK_FINITENESS -DHAVE_CONFIG_H -DHAVE_LIBEVENT2 -DXTRABACKUP -D_FILE_OFFSET_BITS=64 -D_GNU_SOURCE -I/tmp/B.M3c9ho/BUILD/percona-xtrabackup-percona-xtrabackup-2.4.20/build/include -I/tmp/B.M3c9ho/BUILD/percona-xtrabackup-percona-xtrabackup-2.4.20/extra/rapidjson/include -I/tmp/B.M3c9ho/BUILD/percona-xtrabackup-percona-xtrabackup-2.4.20/build/libbinlogevents/include -I/tmp/B.M3c9ho/BUILD/percona-xtrabackup-percona-xtrabackup-2.4.20/libbinlogevents/export -I/tmp/B.M3c9ho/BUILD/percona-xtrabackup-percona-xtrabackup-2.4.20/include -I/tmp/B.M3c9ho/BUILD/percona-xtrabackup-percona-xtrabackup-2.4.20/libbinlogevents/include  -fPIC -Wall -Wextra -Wformat-security -Wvla -Wimplicit-fallthrough=2 -Woverloaded-virtual -Wno-unused-parameter -Wimplicit-fallthrough=2 -O3 -g -fabi-version=2 -fno-omit-frame-pointer -fno-strict-aliasing -std=gnu++03 -DDBUG_OFF   -o CMakeFiles/binlogevents_static.dir/control_events.cpp.o -c /tmp/B.M3c9ho/BUILD/percona-xtrabackup-percona-xtrabackup-2.4.20/libbinlogevents/src/control_events.cpp
make[2]: Leaving directory '/tmp/B.M3c9ho/BUILD/percona-xtrabackup-percona-xtrabackup-2.4.20/build'
make[2]: Entering directory '/tmp/B.M3c9ho/BUILD/percona-xtrabackup-percona-xtrabackup-2.4.20/build'
[ 30%] Building CXX object libbinlogevents/src/CMakeFiles/binlogevents_static.dir/uuid.cpp.o
cd /tmp/B.M3c9ho/BUILD/percona-xtrabackup-percona-xtrabackup-2.4.20/build/libbinlogevents/src && /usr/bin/x86_64-pld-linux-gnux32-g++  -DBOOST_GEOMETRY_SQRT_CHECK_FINITENESS -DHAVE_CONFIG_H -DHAVE_LIBEVENT2 -DXTRABACKUP -D_FILE_OFFSET_BITS=64 -D_GNU_SOURCE -I/tmp/B.M3c9ho/BUILD/percona-xtrabackup-percona-xtrabackup-2.4.20/build/include -I/tmp/B.M3c9ho/BUILD/percona-xtrabackup-percona-xtrabackup-2.4.20/extra/rapidjson/include -I/tmp/B.M3c9ho/BUILD/percona-xtrabackup-percona-xtrabackup-2.4.20/build/libbinlogevents/include -I/tmp/B.M3c9ho/BUILD/percona-xtrabackup-percona-xtrabackup-2.4.20/libbinlogevents/export -I/tmp/B.M3c9ho/BUILD/percona-xtrabackup-percona-xtrabackup-2.4.20/include -I/tmp/B.M3c9ho/BUILD/percona-xtrabackup-percona-xtrabackup-2.4.20/libbinlogevents/include  -fPIC -Wall -Wextra -Wformat-security -Wvla -Wimplicit-fallthrough=2 -Woverloaded-virtual -Wno-unused-parameter -Wimplicit-fallthrough=2 -O3 -g -fabi-version=2 -fno-omit-frame-pointer -fno-strict-aliasing -std=gnu++03 -DDBUG_OFF   -o CMakeFiles/binlogevents_static.dir/uuid.cpp.o -c /tmp/B.M3c9ho/BUILD/percona-xtrabackup-percona-xtrabackup-2.4.20/libbinlogevents/src/uuid.cpp
make[2]: Leaving directory '/tmp/B.M3c9ho/BUILD/percona-xtrabackup-percona-xtrabackup-2.4.20/build'
make[2]: Entering directory '/tmp/B.M3c9ho/BUILD/percona-xtrabackup-percona-xtrabackup-2.4.20/build'
[ 31%] Building C object libmysql/CMakeFiles/clientlib.dir/__/sql-common/get_password.c.o
cd /tmp/B.M3c9ho/BUILD/percona-xtrabackup-percona-xtrabackup-2.4.20/build/libmysql && /usr/bin/x86_64-pld-linux-gnux32-gcc -DBOOST_GEOMETRY_SQRT_CHECK_FINITENESS -DHAVE_CONFIG_H -DHAVE_LIBEVENT2 -DHAVE_OPENSSL -DXTRABACKUP -D_FILE_OFFSET_BITS=64 -D_GNU_SOURCE -I/tmp/B.M3c9ho/BUILD/percona-xtrabackup-percona-xtrabackup-2.4.20/build/include -I/tmp/B.M3c9ho/BUILD/percona-xtrabackup-percona-xtrabackup-2.4.20/extra/rapidjson/include -I/tmp/B.M3c9ho/BUILD/percona-xtrabackup-percona-xtrabackup-2.4.20/build/libbinlogevents/include -I/tmp/B.M3c9ho/BUILD/percona-xtrabackup-percona-xtrabackup-2.4.20/libbinlogevents/export -I/tmp/B.M3c9ho/BUILD/percona-xtrabackup-percona-xtrabackup-2.4.20/include -I/tmp/B.M3c9ho/BUILD/percona-xtrabackup-percona-xtrabackup-2.4.20/libmysql -I/tmp/B.M3c9ho/BUILD/percona-xtrabackup-percona-xtrabackup-2.4.20/regex -I/tmp/B.M3c9ho/BUILD/percona-xtrabackup-percona-xtrabackup-2.4.20/sql -I/tmp/B.M3c9ho/BUILD/percona-xtrabackup-percona-xtrabackup-2.4.20/strings  -fPIC -Wall -Wextra -Wformat-security -Wvla -Wimplicit-fallthrough=2 -Wwrite-strings -Wdeclaration-after-statement -O3 -g -fabi-version=2 -fno-omit-frame-pointer -fno-strict-aliasing -DDBUG_OFF   -D CLIENT_PROTOCOL_TRACING -o CMakeFiles/clientlib.dir/__/sql-common/get_password.c.o   -c /tmp/B.M3c9ho/BUILD/percona-xtrabackup-percona-xtrabackup-2.4.20/sql-common/get_password.c
make[2]: Leaving directory '/tmp/B.M3c9ho/BUILD/percona-xtrabackup-percona-xtrabackup-2.4.20/build'
make[2]: Entering directory '/tmp/B.M3c9ho/BUILD/percona-xtrabackup-percona-xtrabackup-2.4.20/build'
[ 31%] Linking CXX static library ../lib/libbinlogevents.a
cd /tmp/B.M3c9ho/BUILD/percona-xtrabackup-percona-xtrabackup-2.4.20/build/libbinlogevents/src && /usr/bin/cmake -P CMakeFiles/binlogevents_static.dir/cmake_clean_target.cmake
cd /tmp/B.M3c9ho/BUILD/percona-xtrabackup-percona-xtrabackup-2.4.20/build/libbinlogevents/src && /usr/bin/cmake -E cmake_link_script CMakeFiles/binlogevents_static.dir/link.txt --verbose=1
/usr/bin/ar qc ../lib/libbinlogevents.a  CMakeFiles/binlogevents_static.dir/statement_events.cpp.o CMakeFiles/binlogevents_static.dir/control_events.cpp.o CMakeFiles/binlogevents_static.dir/load_data_events.cpp.o CMakeFiles/binlogevents_static.dir/rows_event.cpp.o CMakeFiles/binlogevents_static.dir/binlog_event.cpp.o CMakeFiles/binlogevents_static.dir/binary_log_funcs.cpp.o CMakeFiles/binlogevents_static.dir/uuid.cpp.o
/usr/bin/ranlib ../lib/libbinlogevents.a
make[2]: Leaving directory '/tmp/B.M3c9ho/BUILD/percona-xtrabackup-percona-xtrabackup-2.4.20/build'
make[1]: Entering directory '/tmp/B.M3c9ho/BUILD/percona-xtrabackup-percona-xtrabackup-2.4.20/build'
[ 31%] Built target binlogevents_static
make[1]: Leaving directory '/tmp/B.M3c9ho/BUILD/percona-xtrabackup-percona-xtrabackup-2.4.20/build'
make[2]: Entering directory '/tmp/B.M3c9ho/BUILD/percona-xtrabackup-percona-xtrabackup-2.4.20/build'
[ 29%] Building CXX object storage/archive/CMakeFiles/archive_embedded.dir/ha_archive.cc.o
cd /tmp/B.M3c9ho/BUILD/percona-xtrabackup-percona-xtrabackup-2.4.20/build/storage/archive && /usr/bin/x86_64-pld-linux-gnux32-g++  -DBOOST_GEOMETRY_SQRT_CHECK_FINITENESS -DEMBEDDED_LIBRARY -DHAVE_CONFIG_H -DHAVE_LIBEVENT2 -DMYSQL_SERVER -DXTRABACKUP -D_FILE_OFFSET_BITS=64 -D_GNU_SOURCE -I/tmp/B.M3c9ho/BUILD/percona-xtrabackup-percona-xtrabackup-2.4.20/build/include -I/tmp/B.M3c9ho/BUILD/percona-xtrabackup-percona-xtrabackup-2.4.20/extra/rapidjson/include -I/tmp/B.M3c9ho/BUILD/percona-xtrabackup-percona-xtrabackup-2.4.20/build/libbinlogevents/include -I/tmp/B.M3c9ho/BUILD/percona-xtrabackup-percona-xtrabackup-2.4.20/libbinlogevents/export -I/tmp/B.M3c9ho/BUILD/percona-xtrabackup-percona-xtrabackup-2.4.20/include -I/tmp/B.M3c9ho/BUILD/percona-xtrabackup-percona-xtrabackup-2.4.20/sql -I/tmp/B.M3c9ho/BUILD/percona-xtrabackup-percona-xtrabackup-2.4.20/libbinlogevents/include -I/tmp/B.M3c9ho/BUILD/percona-xtrabackup-percona-xtrabackup-2.4.20/sql/auth -I/tmp/B.M3c9ho/BUILD/percona-xtrabackup-percona-xtrabackup-2.4.20/regex  -fPIC -Wall -Wextra -Wformat-security -Wvla -Wimplicit-fallthrough=2 -Woverloaded-virtual -Wno-unused-parameter -Wimplicit-fallthrough=2 -O3 -g -fabi-version=2 -fno-omit-frame-pointer -fno-strict-aliasing -std=gnu++03 -DDBUG_OFF   -o CMakeFiles/archive_embedded.dir/ha_archive.cc.o -c /tmp/B.M3c9ho/BUILD/percona-xtrabackup-percona-xtrabackup-2.4.20/storage/archive/ha_archive.cc
In file included from /tmp/B.M3c9ho/BUILD/percona-xtrabackup-percona-xtrabackup-2.4.20/sql/sql_class.h:30,
                 from /tmp/B.M3c9ho/BUILD/percona-xtrabackup-percona-xtrabackup-2.4.20/storage/archive/ha_archive.cc:20:
/tmp/B.M3c9ho/BUILD/percona-xtrabackup-percona-xtrabackup-2.4.20/sql/handler.h: In constructor 'st_ha_create_information::st_ha_create_information()':
/tmp/B.M3c9ho/BUILD/percona-xtrabackup-percona-xtrabackup-2.4.20/sql/handler.h:1074:61: warning: 'void* memset(void*, int, size_t)' clearing an object of non-trivial type 'struct st_ha_create_information'; use assignment or value-initialization instead [-Wclass-memaccess]
 1074 |   st_ha_create_information() { memset(this, 0, sizeof(*this)); }
      |                                                             ^
/tmp/B.M3c9ho/BUILD/percona-xtrabackup-percona-xtrabackup-2.4.20/sql/handler.h:1072:16: note: 'struct st_ha_create_information' declared here
 1072 | typedef struct st_ha_create_information
      |                ^~~~~~~~~~~~~~~~~~~~~~~~
In file included from /tmp/B.M3c9ho/BUILD/percona-xtrabackup-percona-xtrabackup-2.4.20/sql/table.h:29,
                 from /tmp/B.M3c9ho/BUILD/percona-xtrabackup-percona-xtrabackup-2.4.20/sql/field.h:30,
                 from /tmp/B.M3c9ho/BUILD/percona-xtrabackup-percona-xtrabackup-2.4.20/sql/protocol_classic.h:20,
                 from /tmp/B.M3c9ho/BUILD/percona-xtrabackup-percona-xtrabackup-2.4.20/sql/sql_class.h:33,
                 from /tmp/B.M3c9ho/BUILD/percona-xtrabackup-percona-xtrabackup-2.4.20/storage/archive/ha_archive.cc:20:
/tmp/B.M3c9ho/BUILD/percona-xtrabackup-percona-xtrabackup-2.4.20/sql/sql_sort.h: In constructor 'Sort_param::Sort_param()':
/tmp/B.M3c9ho/BUILD/percona-xtrabackup-percona-xtrabackup-2.4.20/sql/sql_sort.h:322:34: warning: 'void* memset(void*, int, size_t)' clearing an object of type 'class Sort_param' with no trivial copy-assignment; use assignment or value-initialization instead [-Wclass-memaccess]
  322 |     memset(this, 0, sizeof(*this));
      |                                  ^
/tmp/B.M3c9ho/BUILD/percona-xtrabackup-percona-xtrabackup-2.4.20/sql/sql_sort.h:289:7: note: 'class Sort_param' declared here
  289 | class Sort_param {
      |       ^~~~~~~~~~
In file included from /tmp/B.M3c9ho/BUILD/percona-xtrabackup-percona-xtrabackup-2.4.20/sql/field.h:30,
                 from /tmp/B.M3c9ho/BUILD/percona-xtrabackup-percona-xtrabackup-2.4.20/sql/protocol_classic.h:20,
                 from /tmp/B.M3c9ho/BUILD/percona-xtrabackup-percona-xtrabackup-2.4.20/sql/sql_class.h:33,
                 from /tmp/B.M3c9ho/BUILD/percona-xtrabackup-percona-xtrabackup-2.4.20/storage/archive/ha_archive.cc:20:
/tmp/B.M3c9ho/BUILD/percona-xtrabackup-percona-xtrabackup-2.4.20/sql/table.h: In constructor 'TABLE_SHARE::TABLE_SHARE()':
/tmp/B.M3c9ho/BUILD/percona-xtrabackup-percona-xtrabackup-2.4.20/sql/table.h:564:48: warning: 'void* memset(void*, int, size_t)' clearing an object of type 'struct TABLE_SHARE' with no trivial copy-assignment; use assignment or value-initialization instead [-Wclass-memaccess]
  564 |   TABLE_SHARE() { memset(this, 0, sizeof(*this)); }
      |                                                ^
/tmp/B.M3c9ho/BUILD/percona-xtrabackup-percona-xtrabackup-2.4.20/sql/table.h:562:8: note: 'struct TABLE_SHARE' declared here
  562 | struct TABLE_SHARE
      |        ^~~~~~~~~~~
/tmp/B.M3c9ho/BUILD/percona-xtrabackup-percona-xtrabackup-2.4.20/sql/table.h: In constructor 'TABLE::TABLE()':
/tmp/B.M3c9ho/BUILD/percona-xtrabackup-percona-xtrabackup-2.4.20/sql/table.h:990:42: warning: 'void* memset(void*, int, size_t)' clearing an object of type 'struct TABLE' with no trivial copy-assignment; use assignment or value-initialization instead [-Wclass-memaccess]
  990 |   TABLE() { memset(this, 0, sizeof(*this)); }
      |                                          ^
/tmp/B.M3c9ho/BUILD/percona-xtrabackup-percona-xtrabackup-2.4.20/sql/table.h:988:8: note: 'struct TABLE' declared here
  988 | struct TABLE
      |        ^~~~~
/tmp/B.M3c9ho/BUILD/percona-xtrabackup-percona-xtrabackup-2.4.20/sql/table.h: In constructor 'TABLE_LIST::TABLE_LIST()':
/tmp/B.M3c9ho/BUILD/percona-xtrabackup-percona-xtrabackup-2.4.20/sql/table.h:1775:47: warning: 'void* memset(void*, int, size_t)' clearing an object of type 'struct TABLE_LIST' with no trivial copy-assignment; use assignment or value-initialization instead [-Wclass-memaccess]
 1775 |   TABLE_LIST() { memset(this, 0, sizeof(*this)); }
      |                                               ^
/tmp/B.M3c9ho/BUILD/percona-xtrabackup-percona-xtrabackup-2.4.20/sql/table.h:1773:8: note: 'struct TABLE_LIST' declared here
 1773 | struct TABLE_LIST
      |        ^~~~~~~~~~
/tmp/B.M3c9ho/BUILD/percona-xtrabackup-percona-xtrabackup-2.4.20/sql/table.h: In constructor 'st_nested_join::st_nested_join()':
/tmp/B.M3c9ho/BUILD/percona-xtrabackup-percona-xtrabackup-2.4.20/sql/table.h:2791:51: warning: 'void* memset(void*, int, size_t)' clearing an object of type 'struct st_nested_join' with no trivial copy-assignment; use assignment or value-initialization instead [-Wclass-memaccess]
 2791 |   st_nested_join() { memset(this, 0, sizeof(*this)); }
      |                                                   ^
/tmp/B.M3c9ho/BUILD/percona-xtrabackup-percona-xtrabackup-2.4.20/sql/table.h:2789:16: note: 'struct st_nested_join' declared here
 2789 | typedef struct st_nested_join
      |                ^~~~~~~~~~~~~~
make[2]: Leaving directory '/tmp/B.M3c9ho/BUILD/percona-xtrabackup-percona-xtrabackup-2.4.20/build'
make[2]: Entering directory '/tmp/B.M3c9ho/BUILD/percona-xtrabackup-percona-xtrabackup-2.4.20/build'
[ 31%] Building C object libmysql/CMakeFiles/clientlib.dir/__/sql-common/pack.c.o
cd /tmp/B.M3c9ho/BUILD/percona-xtrabackup-percona-xtrabackup-2.4.20/build/libmysql && /usr/bin/x86_64-pld-linux-gnux32-gcc -DBOOST_GEOMETRY_SQRT_CHECK_FINITENESS -DHAVE_CONFIG_H -DHAVE_LIBEVENT2 -DHAVE_OPENSSL -DXTRABACKUP -D_FILE_OFFSET_BITS=64 -D_GNU_SOURCE -I/tmp/B.M3c9ho/BUILD/percona-xtrabackup-percona-xtrabackup-2.4.20/build/include -I/tmp/B.M3c9ho/BUILD/percona-xtrabackup-percona-xtrabackup-2.4.20/extra/rapidjson/include -I/tmp/B.M3c9ho/BUILD/percona-xtrabackup-percona-xtrabackup-2.4.20/build/libbinlogevents/include -I/tmp/B.M3c9ho/BUILD/percona-xtrabackup-percona-xtrabackup-2.4.20/libbinlogevents/export -I/tmp/B.M3c9ho/BUILD/percona-xtrabackup-percona-xtrabackup-2.4.20/include -I/tmp/B.M3c9ho/BUILD/percona-xtrabackup-percona-xtrabackup-2.4.20/libmysql -I/tmp/B.M3c9ho/BUILD/percona-xtrabackup-percona-xtrabackup-2.4.20/regex -I/tmp/B.M3c9ho/BUILD/percona-xtrabackup-percona-xtrabackup-2.4.20/sql -I/tmp/B.M3c9ho/BUILD/percona-xtrabackup-percona-xtrabackup-2.4.20/strings  -fPIC -Wall -Wextra -Wformat-security -Wvla -Wimplicit-fallthrough=2 -Wwrite-strings -Wdeclaration-after-statement -O3 -g -fabi-version=2 -fno-omit-frame-pointer -fno-strict-aliasing -DDBUG_OFF   -D CLIENT_PROTOCOL_TRACING -o CMakeFiles/clientlib.dir/__/sql-common/pack.c.o   -c /tmp/B.M3c9ho/BUILD/percona-xtrabackup-percona-xtrabackup-2.4.20/sql-common/pack.c
make[2]: Leaving directory '/tmp/B.M3c9ho/BUILD/percona-xtrabackup-percona-xtrabackup-2.4.20/build'
make[2]: Entering directory '/tmp/B.M3c9ho/BUILD/percona-xtrabackup-percona-xtrabackup-2.4.20/build'
[ 31%] Linking CXX static library ../../archive_output_directory/libarchive_embedded.a
cd /tmp/B.M3c9ho/BUILD/percona-xtrabackup-percona-xtrabackup-2.4.20/build/storage/archive && /usr/bin/cmake -P CMakeFiles/archive_embedded.dir/cmake_clean_target.cmake
cd /tmp/B.M3c9ho/BUILD/percona-xtrabackup-percona-xtrabackup-2.4.20/build/storage/archive && /usr/bin/cmake -E cmake_link_script CMakeFiles/archive_embedded.dir/link.txt --verbose=1
/usr/bin/ar qc ../../archive_output_directory/libarchive_embedded.a  CMakeFiles/archive_embedded.dir/azio.c.o CMakeFiles/archive_embedded.dir/ha_archive.cc.o
/usr/bin/ranlib ../../archive_output_directory/libarchive_embedded.a
cd /tmp/B.M3c9ho/BUILD/percona-xtrabackup-percona-xtrabackup-2.4.20/build/storage/archive && /usr/bin/cmake -DTARGET_NAME=archive_embedded -DTARGET_LOC=/tmp/B.M3c9ho/BUILD/percona-xtrabackup-percona-xtrabackup-2.4.20/build/archive_output_directory/libarchive_embedded.a -DCFG_INTDIR=. -P /tmp/B.M3c9ho/BUILD/percona-xtrabackup-percona-xtrabackup-2.4.20/build/archive_output_directory/lib_location_archive_embedded.cmake
make[2]: Leaving directory '/tmp/B.M3c9ho/BUILD/percona-xtrabackup-percona-xtrabackup-2.4.20/build'
make[1]: Entering directory '/tmp/B.M3c9ho/BUILD/percona-xtrabackup-percona-xtrabackup-2.4.20/build'
[ 31%] Built target archive_embedded
make[1]: Leaving directory '/tmp/B.M3c9ho/BUILD/percona-xtrabackup-percona-xtrabackup-2.4.20/build'
make[2]: Entering directory '/tmp/B.M3c9ho/BUILD/percona-xtrabackup-percona-xtrabackup-2.4.20/build'
[ 31%] Building C object libmysql/CMakeFiles/clientlib.dir/__/sql-common/my_time.c.o
cd /tmp/B.M3c9ho/BUILD/percona-xtrabackup-percona-xtrabackup-2.4.20/build/libmysql && /usr/bin/x86_64-pld-linux-gnux32-gcc -DBOOST_GEOMETRY_SQRT_CHECK_FINITENESS -DHAVE_CONFIG_H -DHAVE_LIBEVENT2 -DHAVE_OPENSSL -DXTRABACKUP -D_FILE_OFFSET_BITS=64 -D_GNU_SOURCE -I/tmp/B.M3c9ho/BUILD/percona-xtrabackup-percona-xtrabackup-2.4.20/build/include -I/tmp/B.M3c9ho/BUILD/percona-xtrabackup-percona-xtrabackup-2.4.20/extra/rapidjson/include -I/tmp/B.M3c9ho/BUILD/percona-xtrabackup-percona-xtrabackup-2.4.20/build/libbinlogevents/include -I/tmp/B.M3c9ho/BUILD/percona-xtrabackup-percona-xtrabackup-2.4.20/libbinlogevents/export -I/tmp/B.M3c9ho/BUILD/percona-xtrabackup-percona-xtrabackup-2.4.20/include -I/tmp/B.M3c9ho/BUILD/percona-xtrabackup-percona-xtrabackup-2.4.20/libmysql -I/tmp/B.M3c9ho/BUILD/percona-xtrabackup-percona-xtrabackup-2.4.20/regex -I/tmp/B.M3c9ho/BUILD/percona-xtrabackup-percona-xtrabackup-2.4.20/sql -I/tmp/B.M3c9ho/BUILD/percona-xtrabackup-percona-xtrabackup-2.4.20/strings  -fPIC -Wall -Wextra -Wformat-security -Wvla -Wimplicit-fallthrough=2 -Wwrite-strings -Wdeclaration-after-statement -O3 -g -fabi-version=2 -fno-omit-frame-pointer -fno-strict-aliasing -DDBUG_OFF   -D CLIENT_PROTOCOL_TRACING -o CMakeFiles/clientlib.dir/__/sql-common/my_time.c.o   -c /tmp/B.M3c9ho/BUILD/percona-xtrabackup-percona-xtrabackup-2.4.20/sql-common/my_time.c
make[2]: Leaving directory '/tmp/B.M3c9ho/BUILD/percona-xtrabackup-percona-xtrabackup-2.4.20/build'
make[2]: Entering directory '/tmp/B.M3c9ho/BUILD/percona-xtrabackup-percona-xtrabackup-2.4.20/build'
[ 31%] Building C object libmysql/CMakeFiles/clientlib.dir/__/sql/auth/password.c.o
cd /tmp/B.M3c9ho/BUILD/percona-xtrabackup-percona-xtrabackup-2.4.20/build/libmysql && /usr/bin/x86_64-pld-linux-gnux32-gcc -DBOOST_GEOMETRY_SQRT_CHECK_FINITENESS -DHAVE_CONFIG_H -DHAVE_LIBEVENT2 -DHAVE_OPENSSL -DXTRABACKUP -D_FILE_OFFSET_BITS=64 -D_GNU_SOURCE -I/tmp/B.M3c9ho/BUILD/percona-xtrabackup-percona-xtrabackup-2.4.20/build/include -I/tmp/B.M3c9ho/BUILD/percona-xtrabackup-percona-xtrabackup-2.4.20/extra/rapidjson/include -I/tmp/B.M3c9ho/BUILD/percona-xtrabackup-percona-xtrabackup-2.4.20/build/libbinlogevents/include -I/tmp/B.M3c9ho/BUILD/percona-xtrabackup-percona-xtrabackup-2.4.20/libbinlogevents/export -I/tmp/B.M3c9ho/BUILD/percona-xtrabackup-percona-xtrabackup-2.4.20/include -I/tmp/B.M3c9ho/BUILD/percona-xtrabackup-percona-xtrabackup-2.4.20/libmysql -I/tmp/B.M3c9ho/BUILD/percona-xtrabackup-percona-xtrabackup-2.4.20/regex -I/tmp/B.M3c9ho/BUILD/percona-xtrabackup-percona-xtrabackup-2.4.20/sql -I/tmp/B.M3c9ho/BUILD/percona-xtrabackup-percona-xtrabackup-2.4.20/strings  -fPIC -Wall -Wextra -Wformat-security -Wvla -Wimplicit-fallthrough=2 -Wwrite-strings -Wdeclaration-after-statement -O3 -g -fabi-version=2 -fno-omit-frame-pointer -fno-strict-aliasing -DDBUG_OFF   -D CLIENT_PROTOCOL_TRACING -o CMakeFiles/clientlib.dir/__/sql/auth/password.c.o   -c /tmp/B.M3c9ho/BUILD/percona-xtrabackup-percona-xtrabackup-2.4.20/sql/auth/password.c
make[2]: Leaving directory '/tmp/B.M3c9ho/BUILD/percona-xtrabackup-percona-xtrabackup-2.4.20/build'
make[2]: Entering directory '/tmp/B.M3c9ho/BUILD/percona-xtrabackup-percona-xtrabackup-2.4.20/build'
[ 31%] Building CXX object libmysql/CMakeFiles/clientlib.dir/__/sql-common/client_authentication.cc.o
cd /tmp/B.M3c9ho/BUILD/percona-xtrabackup-percona-xtrabackup-2.4.20/build/libmysql && /usr/bin/x86_64-pld-linux-gnux32-g++  -DBOOST_GEOMETRY_SQRT_CHECK_FINITENESS -DHAVE_CONFIG_H -DHAVE_LIBEVENT2 -DHAVE_OPENSSL -DXTRABACKUP -D_FILE_OFFSET_BITS=64 -D_GNU_SOURCE -I/tmp/B.M3c9ho/BUILD/percona-xtrabackup-percona-xtrabackup-2.4.20/build/include -I/tmp/B.M3c9ho/BUILD/percona-xtrabackup-percona-xtrabackup-2.4.20/extra/rapidjson/include -I/tmp/B.M3c9ho/BUILD/percona-xtrabackup-percona-xtrabackup-2.4.20/build/libbinlogevents/include -I/tmp/B.M3c9ho/BUILD/percona-xtrabackup-percona-xtrabackup-2.4.20/libbinlogevents/export -I/tmp/B.M3c9ho/BUILD/percona-xtrabackup-percona-xtrabackup-2.4.20/include -I/tmp/B.M3c9ho/BUILD/percona-xtrabackup-percona-xtrabackup-2.4.20/libmysql -I/tmp/B.M3c9ho/BUILD/percona-xtrabackup-percona-xtrabackup-2.4.20/regex -I/tmp/B.M3c9ho/BUILD/percona-xtrabackup-percona-xtrabackup-2.4.20/sql -I/tmp/B.M3c9ho/BUILD/percona-xtrabackup-percona-xtrabackup-2.4.20/strings  -fPIC -Wall -Wextra -Wformat-security -Wvla -Wimplicit-fallthrough=2 -Woverloaded-virtual -Wno-unused-parameter -Wimplicit-fallthrough=2 -O3 -g -fabi-version=2 -fno-omit-frame-pointer -fno-strict-aliasing -std=gnu++03 -DDBUG_OFF   -D CLIENT_PROTOCOL_TRACING -o CMakeFiles/clientlib.dir/__/sql-common/client_authentication.cc.o -c /tmp/B.M3c9ho/BUILD/percona-xtrabackup-percona-xtrabackup-2.4.20/sql-common/client_authentication.cc
make[2]: Leaving directory '/tmp/B.M3c9ho/BUILD/percona-xtrabackup-percona-xtrabackup-2.4.20/build'
make[2]: Entering directory '/tmp/B.M3c9ho/BUILD/percona-xtrabackup-percona-xtrabackup-2.4.20/build'
[ 27%] Building CXX object storage/innobase/xtrabackup/src/xbcloud/CMakeFiles/xbcloud.dir/http.cc.o
cd /tmp/B.M3c9ho/BUILD/percona-xtrabackup-percona-xtrabackup-2.4.20/build/storage/innobase/xtrabackup/src/xbcloud && /usr/bin/x86_64-pld-linux-gnux32-g++  -DBOOST_GEOMETRY_SQRT_CHECK_FINITENESS -DCOMPILER_HINTS -DHAVE_CONFIG_H -DHAVE_FALLOC_PUNCH_HOLE_AND_KEEP_SIZE=1 -DHAVE_IB_ATOMIC_PTHREAD_T_GCC=1 -DHAVE_IB_GCC_ATOMIC_COMPARE_EXCHANGE=1 -DHAVE_IB_GCC_ATOMIC_THREAD_FENCE=1 -DHAVE_IB_GCC_SYNC_SYNCHRONISE=1 -DHAVE_IB_LINUX_FUTEX=1 -DHAVE_LIBEVENT2 -DHAVE_LZ4=1 -DHAVE_NANOSLEEP=1 -DHAVE_SCHED_GETCPU=1 -DLINUX_NATIVE_AIO=1 -DMUTEX_EVENT -DXTRABACKUP -D_FILE_OFFSET_BITS=64 -D_GNU_SOURCE -I/tmp/B.M3c9ho/BUILD/percona-xtrabackup-percona-xtrabackup-2.4.20/build/include -I/tmp/B.M3c9ho/BUILD/percona-xtrabackup-percona-xtrabackup-2.4.20/extra/rapidjson/include -I/tmp/B.M3c9ho/BUILD/percona-xtrabackup-percona-xtrabackup-2.4.20/build/libbinlogevents/include -I/tmp/B.M3c9ho/BUILD/percona-xtrabackup-percona-xtrabackup-2.4.20/libbinlogevents/export -I/tmp/B.M3c9ho/BUILD/percona-xtrabackup-percona-xtrabackup-2.4.20/storage/innobase/include -I/tmp/B.M3c9ho/BUILD/percona-xtrabackup-percona-xtrabackup-2.4.20/storage/innobase/handler -I/tmp/B.M3c9ho/BUILD/percona-xtrabackup-percona-xtrabackup-2.4.20/libbinlogevents/include -I/tmp/B.M3c9ho/BUILD/percona-xtrabackup-percona-xtrabackup-2.4.20/include -I/tmp/B.M3c9ho/BUILD/percona-xtrabackup-percona-xtrabackup-2.4.20/sql -I/tmp/B.M3c9ho/BUILD/percona-xtrabackup-percona-xtrabackup-2.4.20/sql/auth -I/tmp/B.M3c9ho/BUILD/percona-xtrabackup-percona-xtrabackup-2.4.20/regex -I/tmp/B.M3c9ho/BUILD/percona-xtrabackup-percona-xtrabackup-2.4.20/storage/innobase/xtrabackup/src -I/tmp/B.M3c9ho/BUILD/percona-xtrabackup-percona-xtrabackup-2.4.20/storage/innobase/xtrabackup/src/crc -I/tmp/B.M3c9ho/BUILD/percona-xtrabackup-percona-xtrabackup-2.4.20/build/storage/innobase/xtrabackup/src/xbcloud/..  -Wno-deprecated-declarations  -fPIC -Wall -Wextra -Wformat-security -Wvla -Wimplicit-fallthrough=2 -Woverloaded-virtual -Wno-unused-parameter -Wimplicit-fallthrough=2 -O3 -g -fabi-version=2 -fno-omit-frame-pointer -fno-strict-aliasing -std=gnu++03 -DDBUG_OFF   -DUNIV_LINUX -D_GNU_SOURCE=1 -std=c++11 -o CMakeFiles/xbcloud.dir/http.cc.o -c /tmp/B.M3c9ho/BUILD/percona-xtrabackup-percona-xtrabackup-2.4.20/storage/innobase/xtrabackup/src/xbcloud/http.cc
make[2]: Leaving directory '/tmp/B.M3c9ho/BUILD/percona-xtrabackup-percona-xtrabackup-2.4.20/build'
make[2]: Entering directory '/tmp/B.M3c9ho/BUILD/percona-xtrabackup-percona-xtrabackup-2.4.20/build'
[ 31%] Building C object libmysql/CMakeFiles/clientlib.dir/mysql_trace.c.o
cd /tmp/B.M3c9ho/BUILD/percona-xtrabackup-percona-xtrabackup-2.4.20/build/libmysql && /usr/bin/x86_64-pld-linux-gnux32-gcc -DBOOST_GEOMETRY_SQRT_CHECK_FINITENESS -DHAVE_CONFIG_H -DHAVE_LIBEVENT2 -DHAVE_OPENSSL -DXTRABACKUP -D_FILE_OFFSET_BITS=64 -D_GNU_SOURCE -I/tmp/B.M3c9ho/BUILD/percona-xtrabackup-percona-xtrabackup-2.4.20/build/include -I/tmp/B.M3c9ho/BUILD/percona-xtrabackup-percona-xtrabackup-2.4.20/extra/rapidjson/include -I/tmp/B.M3c9ho/BUILD/percona-xtrabackup-percona-xtrabackup-2.4.20/build/libbinlogevents/include -I/tmp/B.M3c9ho/BUILD/percona-xtrabackup-percona-xtrabackup-2.4.20/libbinlogevents/export -I/tmp/B.M3c9ho/BUILD/percona-xtrabackup-percona-xtrabackup-2.4.20/include -I/tmp/B.M3c9ho/BUILD/percona-xtrabackup-percona-xtrabackup-2.4.20/libmysql -I/tmp/B.M3c9ho/BUILD/percona-xtrabackup-percona-xtrabackup-2.4.20/regex -I/tmp/B.M3c9ho/BUILD/percona-xtrabackup-percona-xtrabackup-2.4.20/sql -I/tmp/B.M3c9ho/BUILD/percona-xtrabackup-percona-xtrabackup-2.4.20/strings  -fPIC -Wall -Wextra -Wformat-security -Wvla -Wimplicit-fallthrough=2 -Wwrite-strings -Wdeclaration-after-statement -O3 -g -fabi-version=2 -fno-omit-frame-pointer -fno-strict-aliasing -DDBUG_OFF   -D CLIENT_PROTOCOL_TRACING -o CMakeFiles/clientlib.dir/mysql_trace.c.o   -c /tmp/B.M3c9ho/BUILD/percona-xtrabackup-percona-xtrabackup-2.4.20/libmysql/mysql_trace.c
make[2]: Leaving directory '/tmp/B.M3c9ho/BUILD/percona-xtrabackup-percona-xtrabackup-2.4.20/build'
make[2]: Entering directory '/tmp/B.M3c9ho/BUILD/percona-xtrabackup-percona-xtrabackup-2.4.20/build'
[ 31%] Building CXX object libmysql/CMakeFiles/clientlib.dir/__/sql/net_serv.cc.o
cd /tmp/B.M3c9ho/BUILD/percona-xtrabackup-percona-xtrabackup-2.4.20/build/libmysql && /usr/bin/x86_64-pld-linux-gnux32-g++  -DBOOST_GEOMETRY_SQRT_CHECK_FINITENESS -DHAVE_CONFIG_H -DHAVE_LIBEVENT2 -DHAVE_OPENSSL -DXTRABACKUP -D_FILE_OFFSET_BITS=64 -D_GNU_SOURCE -I/tmp/B.M3c9ho/BUILD/percona-xtrabackup-percona-xtrabackup-2.4.20/build/include -I/tmp/B.M3c9ho/BUILD/percona-xtrabackup-percona-xtrabackup-2.4.20/extra/rapidjson/include -I/tmp/B.M3c9ho/BUILD/percona-xtrabackup-percona-xtrabackup-2.4.20/build/libbinlogevents/include -I/tmp/B.M3c9ho/BUILD/percona-xtrabackup-percona-xtrabackup-2.4.20/libbinlogevents/export -I/tmp/B.M3c9ho/BUILD/percona-xtrabackup-percona-xtrabackup-2.4.20/include -I/tmp/B.M3c9ho/BUILD/percona-xtrabackup-percona-xtrabackup-2.4.20/libmysql -I/tmp/B.M3c9ho/BUILD/percona-xtrabackup-percona-xtrabackup-2.4.20/regex -I/tmp/B.M3c9ho/BUILD/percona-xtrabackup-percona-xtrabackup-2.4.20/sql -I/tmp/B.M3c9ho/BUILD/percona-xtrabackup-percona-xtrabackup-2.4.20/strings  -fPIC -Wall -Wextra -Wformat-security -Wvla -Wimplicit-fallthrough=2 -Woverloaded-virtual -Wno-unused-parameter -Wimplicit-fallthrough=2 -O3 -g -fabi-version=2 -fno-omit-frame-pointer -fno-strict-aliasing -std=gnu++03 -DDBUG_OFF   -D CLIENT_PROTOCOL_TRACING -o CMakeFiles/clientlib.dir/__/sql/net_serv.cc.o -c /tmp/B.M3c9ho/BUILD/percona-xtrabackup-percona-xtrabackup-2.4.20/sql/net_serv.cc
make[2]: Leaving directory '/tmp/B.M3c9ho/BUILD/percona-xtrabackup-percona-xtrabackup-2.4.20/build'
make[2]: Entering directory '/tmp/B.M3c9ho/BUILD/percona-xtrabackup-percona-xtrabackup-2.4.20/build'
[ 31%] Building CXX object libmysql/CMakeFiles/clientlib.dir/__/sql/auth/sha2_password_common.cc.o
cd /tmp/B.M3c9ho/BUILD/percona-xtrabackup-percona-xtrabackup-2.4.20/build/libmysql && /usr/bin/x86_64-pld-linux-gnux32-g++  -DBOOST_GEOMETRY_SQRT_CHECK_FINITENESS -DHAVE_CONFIG_H -DHAVE_LIBEVENT2 -DHAVE_OPENSSL -DXTRABACKUP -D_FILE_OFFSET_BITS=64 -D_GNU_SOURCE -I/tmp/B.M3c9ho/BUILD/percona-xtrabackup-percona-xtrabackup-2.4.20/build/include -I/tmp/B.M3c9ho/BUILD/percona-xtrabackup-percona-xtrabackup-2.4.20/extra/rapidjson/include -I/tmp/B.M3c9ho/BUILD/percona-xtrabackup-percona-xtrabackup-2.4.20/build/libbinlogevents/include -I/tmp/B.M3c9ho/BUILD/percona-xtrabackup-percona-xtrabackup-2.4.20/libbinlogevents/export -I/tmp/B.M3c9ho/BUILD/percona-xtrabackup-percona-xtrabackup-2.4.20/include -I/tmp/B.M3c9ho/BUILD/percona-xtrabackup-percona-xtrabackup-2.4.20/libmysql -I/tmp/B.M3c9ho/BUILD/percona-xtrabackup-percona-xtrabackup-2.4.20/regex -I/tmp/B.M3c9ho/BUILD/percona-xtrabackup-percona-xtrabackup-2.4.20/sql -I/tmp/B.M3c9ho/BUILD/percona-xtrabackup-percona-xtrabackup-2.4.20/strings  -fPIC -Wall -Wextra -Wformat-security -Wvla -Wimplicit-fallthrough=2 -Woverloaded-virtual -Wno-unused-parameter -Wimplicit-fallthrough=2 -O3 -g -fabi-version=2 -fno-omit-frame-pointer -fno-strict-aliasing -std=gnu++03 -DDBUG_OFF   -D CLIENT_PROTOCOL_TRACING -o CMakeFiles/clientlib.dir/__/sql/auth/sha2_password_common.cc.o -c /tmp/B.M3c9ho/BUILD/percona-xtrabackup-percona-xtrabackup-2.4.20/sql/auth/sha2_password_common.cc
make[2]: Leaving directory '/tmp/B.M3c9ho/BUILD/percona-xtrabackup-percona-xtrabackup-2.4.20/build'
make[2]: Entering directory '/tmp/B.M3c9ho/BUILD/percona-xtrabackup-percona-xtrabackup-2.4.20/build'
[ 30%] Building C object libmysql/CMakeFiles/clientlib.dir/__/sql-common/client.c.o
cd /tmp/B.M3c9ho/BUILD/percona-xtrabackup-percona-xtrabackup-2.4.20/build/libmysql && /usr/bin/x86_64-pld-linux-gnux32-gcc -DBOOST_GEOMETRY_SQRT_CHECK_FINITENESS -DHAVE_CONFIG_H -DHAVE_LIBEVENT2 -DHAVE_OPENSSL -DXTRABACKUP -D_FILE_OFFSET_BITS=64 -D_GNU_SOURCE -I/tmp/B.M3c9ho/BUILD/percona-xtrabackup-percona-xtrabackup-2.4.20/build/include -I/tmp/B.M3c9ho/BUILD/percona-xtrabackup-percona-xtrabackup-2.4.20/extra/rapidjson/include -I/tmp/B.M3c9ho/BUILD/percona-xtrabackup-percona-xtrabackup-2.4.20/build/libbinlogevents/include -I/tmp/B.M3c9ho/BUILD/percona-xtrabackup-percona-xtrabackup-2.4.20/libbinlogevents/export -I/tmp/B.M3c9ho/BUILD/percona-xtrabackup-percona-xtrabackup-2.4.20/include -I/tmp/B.M3c9ho/BUILD/percona-xtrabackup-percona-xtrabackup-2.4.20/libmysql -I/tmp/B.M3c9ho/BUILD/percona-xtrabackup-percona-xtrabackup-2.4.20/regex -I/tmp/B.M3c9ho/BUILD/percona-xtrabackup-percona-xtrabackup-2.4.20/sql -I/tmp/B.M3c9ho/BUILD/percona-xtrabackup-percona-xtrabackup-2.4.20/strings  -fPIC -Wall -Wextra -Wformat-security -Wvla -Wimplicit-fallthrough=2 -Wwrite-strings -Wdeclaration-after-statement -O3 -g -fabi-version=2 -fno-omit-frame-pointer -fno-strict-aliasing -DDBUG_OFF   -D CLIENT_PROTOCOL_TRACING -o CMakeFiles/clientlib.dir/__/sql-common/client.c.o   -c /tmp/B.M3c9ho/BUILD/percona-xtrabackup-percona-xtrabackup-2.4.20/sql-common/client.c
make[2]: Leaving directory '/tmp/B.M3c9ho/BUILD/percona-xtrabackup-percona-xtrabackup-2.4.20/build'
make[2]: Entering directory '/tmp/B.M3c9ho/BUILD/percona-xtrabackup-percona-xtrabackup-2.4.20/build'
[ 31%] Linking CXX static library ../archive_output_directory/libclientlib.a
cd /tmp/B.M3c9ho/BUILD/percona-xtrabackup-percona-xtrabackup-2.4.20/build/libmysql && /usr/bin/cmake -P CMakeFiles/clientlib.dir/cmake_clean_target.cmake
cd /tmp/B.M3c9ho/BUILD/percona-xtrabackup-percona-xtrabackup-2.4.20/build/libmysql && /usr/bin/cmake -E cmake_link_script CMakeFiles/clientlib.dir/link.txt --verbose=1
/usr/bin/ar qc ../archive_output_directory/libclientlib.a  CMakeFiles/clientlib.dir/libmysql.c.o CMakeFiles/clientlib.dir/errmsg.c.o CMakeFiles/clientlib.dir/__/sql-common/client.c.o CMakeFiles/clientlib.dir/__/sql-common/my_time.c.o CMakeFiles/clientlib.dir/__/sql-common/client_plugin.c.o CMakeFiles/clientlib.dir/__/sql-common/client_authentication.cc.o CMakeFiles/clientlib.dir/__/sql-common/get_password.c.o CMakeFiles/clientlib.dir/__/sql/net_serv.cc.o CMakeFiles/clientlib.dir/__/sql-common/pack.c.o CMakeFiles/clientlib.dir/__/sql/auth/password.c.o CMakeFiles/clientlib.dir/__/sql/auth/sha2_password_common.cc.o CMakeFiles/clientlib.dir/mysql_trace.c.o
/usr/bin/ranlib ../archive_output_directory/libclientlib.a
cd /tmp/B.M3c9ho/BUILD/percona-xtrabackup-percona-xtrabackup-2.4.20/build/libmysql && /usr/bin/cmake -DTARGET_NAME=clientlib -DTARGET_LOC=/tmp/B.M3c9ho/BUILD/percona-xtrabackup-percona-xtrabackup-2.4.20/build/archive_output_directory/libclientlib.a -DCFG_INTDIR=. -P /tmp/B.M3c9ho/BUILD/percona-xtrabackup-percona-xtrabackup-2.4.20/build/archive_output_directory/lib_location_clientlib.cmake
make[2]: Leaving directory '/tmp/B.M3c9ho/BUILD/percona-xtrabackup-percona-xtrabackup-2.4.20/build'
make[1]: Entering directory '/tmp/B.M3c9ho/BUILD/percona-xtrabackup-percona-xtrabackup-2.4.20/build'
[ 31%] Built target clientlib
make[1]: Leaving directory '/tmp/B.M3c9ho/BUILD/percona-xtrabackup-percona-xtrabackup-2.4.20/build'
make[2]: Entering directory '/tmp/B.M3c9ho/BUILD/percona-xtrabackup-percona-xtrabackup-2.4.20/build'
[ 29%] Building CXX object storage/innobase/xtrabackup/src/xbcloud/CMakeFiles/xbcloud.dir/swift.cc.o
cd /tmp/B.M3c9ho/BUILD/percona-xtrabackup-percona-xtrabackup-2.4.20/build/storage/innobase/xtrabackup/src/xbcloud && /usr/bin/x86_64-pld-linux-gnux32-g++  -DBOOST_GEOMETRY_SQRT_CHECK_FINITENESS -DCOMPILER_HINTS -DHAVE_CONFIG_H -DHAVE_FALLOC_PUNCH_HOLE_AND_KEEP_SIZE=1 -DHAVE_IB_ATOMIC_PTHREAD_T_GCC=1 -DHAVE_IB_GCC_ATOMIC_COMPARE_EXCHANGE=1 -DHAVE_IB_GCC_ATOMIC_THREAD_FENCE=1 -DHAVE_IB_GCC_SYNC_SYNCHRONISE=1 -DHAVE_IB_LINUX_FUTEX=1 -DHAVE_LIBEVENT2 -DHAVE_LZ4=1 -DHAVE_NANOSLEEP=1 -DHAVE_SCHED_GETCPU=1 -DLINUX_NATIVE_AIO=1 -DMUTEX_EVENT -DXTRABACKUP -D_FILE_OFFSET_BITS=64 -D_GNU_SOURCE -I/tmp/B.M3c9ho/BUILD/percona-xtrabackup-percona-xtrabackup-2.4.20/build/include -I/tmp/B.M3c9ho/BUILD/percona-xtrabackup-percona-xtrabackup-2.4.20/extra/rapidjson/include -I/tmp/B.M3c9ho/BUILD/percona-xtrabackup-percona-xtrabackup-2.4.20/build/libbinlogevents/include -I/tmp/B.M3c9ho/BUILD/percona-xtrabackup-percona-xtrabackup-2.4.20/libbinlogevents/export -I/tmp/B.M3c9ho/BUILD/percona-xtrabackup-percona-xtrabackup-2.4.20/storage/innobase/include -I/tmp/B.M3c9ho/BUILD/percona-xtrabackup-percona-xtrabackup-2.4.20/storage/innobase/handler -I/tmp/B.M3c9ho/BUILD/percona-xtrabackup-percona-xtrabackup-2.4.20/libbinlogevents/include -I/tmp/B.M3c9ho/BUILD/percona-xtrabackup-percona-xtrabackup-2.4.20/include -I/tmp/B.M3c9ho/BUILD/percona-xtrabackup-percona-xtrabackup-2.4.20/sql -I/tmp/B.M3c9ho/BUILD/percona-xtrabackup-percona-xtrabackup-2.4.20/sql/auth -I/tmp/B.M3c9ho/BUILD/percona-xtrabackup-percona-xtrabackup-2.4.20/regex -I/tmp/B.M3c9ho/BUILD/percona-xtrabackup-percona-xtrabackup-2.4.20/storage/innobase/xtrabackup/src -I/tmp/B.M3c9ho/BUILD/percona-xtrabackup-percona-xtrabackup-2.4.20/storage/innobase/xtrabackup/src/crc -I/tmp/B.M3c9ho/BUILD/percona-xtrabackup-percona-xtrabackup-2.4.20/build/storage/innobase/xtrabackup/src/xbcloud/..  -Wno-deprecated-declarations  -fPIC -Wall -Wextra -Wformat-security -Wvla -Wimplicit-fallthrough=2 -Woverloaded-virtual -Wno-unused-parameter -Wimplicit-fallthrough=2 -O3 -g -fabi-version=2 -fno-omit-frame-pointer -fno-strict-aliasing -std=gnu++03 -DDBUG_OFF   -DUNIV_LINUX -D_GNU_SOURCE=1 -std=c++11 -o CMakeFiles/xbcloud.dir/swift.cc.o -c /tmp/B.M3c9ho/BUILD/percona-xtrabackup-percona-xtrabackup-2.4.20/storage/innobase/xtrabackup/src/xbcloud/swift.cc
In file included from /tmp/B.M3c9ho/BUILD/percona-xtrabackup-percona-xtrabackup-2.4.20/extra/rapidjson/include/rapidjson/internal/strtod.h:26,
                 from /tmp/B.M3c9ho/BUILD/percona-xtrabackup-percona-xtrabackup-2.4.20/extra/rapidjson/include/rapidjson/reader.h:30,
                 from /tmp/B.M3c9ho/BUILD/percona-xtrabackup-percona-xtrabackup-2.4.20/extra/rapidjson/include/rapidjson/document.h:26,
                 from /tmp/B.M3c9ho/BUILD/percona-xtrabackup-percona-xtrabackup-2.4.20/storage/innobase/xtrabackup/src/xbcloud/swift.cc:28:
/tmp/B.M3c9ho/BUILD/percona-xtrabackup-percona-xtrabackup-2.4.20/extra/rapidjson/include/rapidjson/internal/biginteger.h: In member function 'bool rapidjson::internal::BigInteger::Difference(const rapidjson::internal::BigInteger&, rapidjson::internal::BigInteger*) const':
/tmp/B.M3c9ho/BUILD/percona-xtrabackup-percona-xtrabackup-2.4.20/extra/rapidjson/include/rapidjson/internal/biginteger.h:185:32: warning: implicitly-declared 'rapidjson::internal::BigInteger& rapidjson::internal::BigInteger::operator=(const rapidjson::internal::BigInteger&)' is deprecated [-Wdeprecated-copy]
  185 |             *out = BigInteger(0);
      |                                ^
/tmp/B.M3c9ho/BUILD/percona-xtrabackup-percona-xtrabackup-2.4.20/extra/rapidjson/include/rapidjson/internal/biginteger.h:37:5: note: because 'rapidjson::internal::BigInteger' has user-provided 'rapidjson::internal::BigInteger::BigInteger(const rapidjson::internal::BigInteger&)'
   37 |     BigInteger(const BigInteger& rhs) : count_(rhs.count_) {
      |     ^~~~~~~~~~
In file included from /tmp/B.M3c9ho/BUILD/percona-xtrabackup-percona-xtrabackup-2.4.20/storage/innobase/xtrabackup/src/xbcloud/swift.cc:28:
/tmp/B.M3c9ho/BUILD/percona-xtrabackup-percona-xtrabackup-2.4.20/extra/rapidjson/include/rapidjson/document.h: In instantiation of 'rapidjson::GenericValue<Encoding, Allocator>::GenericValue(rapidjson::GenericValue<Encoding, Allocator>::StringRefType) [with Encoding = rapidjson::UTF8<>; Allocator = rapidjson::MemoryPoolAllocator<>; rapidjson::GenericValue<Encoding, Allocator>::StringRefType = rapidjson::GenericStringRef<char>]':
/tmp/B.M3c9ho/BUILD/percona-xtrabackup-percona-xtrabackup-2.4.20/extra/rapidjson/include/rapidjson/document.h:894:22:   required from 'rapidjson::GenericValue<Encoding, Allocator>::MemberIterator rapidjson::GenericValue<Encoding, Allocator>::FindMember(const Ch*) [with Encoding = rapidjson::UTF8<>; Allocator = rapidjson::MemoryPoolAllocator<>; rapidjson::GenericValue<Encoding, Allocator>::MemberIterator = rapidjson::GenericMemberIterator<false, rapidjson::UTF8<>, rapidjson::MemoryPoolAllocator<> >; rapidjson::GenericValue<Encoding, Allocator>::Ch = char]'
/tmp/B.M3c9ho/BUILD/percona-xtrabackup-percona-xtrabackup-2.4.20/storage/innobase/xtrabackup/src/xbcloud/swift.cc:872:43:   required from here
/tmp/B.M3c9ho/BUILD/percona-xtrabackup-percona-xtrabackup-2.4.20/extra/rapidjson/include/rapidjson/document.h:544:97: warning: implicitly-declared 'constexpr rapidjson::GenericStringRef<char>::GenericStringRef(const rapidjson::GenericStringRef<char>&)' is deprecated [-Wdeprecated-copy]
  544 |     explicit GenericValue(StringRefType s) RAPIDJSON_NOEXCEPT : data_(), flags_() { SetStringRaw(s); }
      |                                                                                     ~~~~~~~~~~~~^~~
In file included from /tmp/B.M3c9ho/BUILD/percona-xtrabackup-percona-xtrabackup-2.4.20/storage/innobase/xtrabackup/src/xbcloud/swift.cc:28:
/tmp/B.M3c9ho/BUILD/percona-xtrabackup-percona-xtrabackup-2.4.20/extra/rapidjson/include/rapidjson/document.h:329:22: note: because 'rapidjson::GenericStringRef<char>' has user-provided 'rapidjson::GenericStringRef<CharType> rapidjson::GenericStringRef<CharType>::operator=(const rapidjson::GenericStringRef<CharType>&) [with CharType = char]'
  329 |     GenericStringRef operator=(const GenericStringRef&);
      |                      ^~~~~~~~
In file included from /tmp/B.M3c9ho/BUILD/percona-xtrabackup-percona-xtrabackup-2.4.20/storage/innobase/xtrabackup/src/xbcloud/swift.cc:28:
/tmp/B.M3c9ho/BUILD/percona-xtrabackup-percona-xtrabackup-2.4.20/extra/rapidjson/include/rapidjson/document.h:1599:37: note:   initializing argument 1 of 'void rapidjson::GenericValue<Encoding, Allocator>::SetStringRaw(rapidjson::GenericValue<Encoding, Allocator>::StringRefType) [with Encoding = rapidjson::UTF8<>; Allocator = rapidjson::MemoryPoolAllocator<>; rapidjson::GenericValue<Encoding, Allocator>::StringRefType = rapidjson::GenericStringRef<char>]'
 1599 |     void SetStringRaw(StringRefType s) RAPIDJSON_NOEXCEPT {
      |                       ~~~~~~~~~~~~~~^
/tmp/B.M3c9ho/BUILD/percona-xtrabackup-percona-xtrabackup-2.4.20/extra/rapidjson/include/rapidjson/document.h: In instantiation of 'void rapidjson::GenericValue<Encoding, Allocator>::SetObjectRaw(rapidjson::GenericValue<Encoding, Allocator>::Member*, rapidjson::SizeType, Allocator&) [with Encoding = rapidjson::UTF8<>; Allocator = rapidjson::MemoryPoolAllocator<>; rapidjson::GenericValue<Encoding, Allocator>::Member = rapidjson::GenericMember<rapidjson::UTF8<>, rapidjson::MemoryPoolAllocator<> >; rapidjson::SizeType = unsigned int]':
/tmp/B.M3c9ho/BUILD/percona-xtrabackup-percona-xtrabackup-2.4.20/extra/rapidjson/include/rapidjson/document.h:1894:55:   required from 'bool rapidjson::GenericDocument<Encoding, Allocator, StackAllocator>::EndObject(rapidjson::SizeType) [with Encoding = rapidjson::UTF8<>; Allocator = rapidjson::MemoryPoolAllocator<>; StackAllocator = rapidjson::CrtAllocator; rapidjson::SizeType = unsigned int]'
/tmp/B.M3c9ho/BUILD/percona-xtrabackup-percona-xtrabackup-2.4.20/extra/rapidjson/include/rapidjson/reader.h:1341:40:   required from 'rapidjson::GenericReader<SourceEncoding, TargetEncoding, StackAllocator>::IterativeParsingState rapidjson::GenericReader<SourceEncoding, TargetEncoding, StackAllocator>::Transit(rapidjson::GenericReader<SourceEncoding, TargetEncoding, StackAllocator>::IterativeParsingState, rapidjson::GenericReader<SourceEncoding, TargetEncoding, StackAllocator>::Token, rapidjson::GenericReader<SourceEncoding, TargetEncoding, StackAllocator>::IterativeParsingState, InputStream&, Handler&) [with unsigned int parseFlags = 0; InputStream = rapidjson::GenericStringStream<rapidjson::UTF8<> >; Handler = rapidjson::GenericDocument<rapidjson::UTF8<> >; SourceEncoding = rapidjson::UTF8<>; TargetEncoding = rapidjson::UTF8<>; StackAllocator = rapidjson::MemoryPoolAllocator<>]'
/tmp/B.M3c9ho/BUILD/percona-xtrabackup-percona-xtrabackup-2.4.20/extra/rapidjson/include/rapidjson/reader.h:1421:58:   required from 'rapidjson::ParseResult rapidjson::GenericReader<SourceEncoding, TargetEncoding, StackAllocator>::IterativeParse(InputStream&, Handler&) [with unsigned int parseFlags = 0; InputStream = rapidjson::GenericStringStream<rapidjson::UTF8<> >; Handler = rapidjson::GenericDocument<rapidjson::UTF8<> >; SourceEncoding = rapidjson::UTF8<>; TargetEncoding = rapidjson::UTF8<>; StackAllocator = rapidjson::MemoryPoolAllocator<>]'
/tmp/B.M3c9ho/BUILD/percona-xtrabackup-percona-xtrabackup-2.4.20/extra/rapidjson/include/rapidjson/reader.h:401:46:   required from 'rapidjson::ParseResult rapidjson::GenericReader<SourceEncoding, TargetEncoding, StackAllocator>::Parse(InputStream&, Handler&) [with unsigned int parseFlags = 0; InputStream = rapidjson::GenericStringStream<rapidjson::UTF8<> >; Handler = rapidjson::GenericDocument<rapidjson::UTF8<> >; SourceEncoding = rapidjson::UTF8<>; TargetEncoding = rapidjson::UTF8<>; StackAllocator = rapidjson::MemoryPoolAllocator<>]'
/tmp/B.M3c9ho/BUILD/percona-xtrabackup-percona-xtrabackup-2.4.20/extra/rapidjson/include/rapidjson/document.h:1740:57:   required from 'rapidjson::GenericDocument<Encoding, Allocator, StackAllocator>& rapidjson::GenericDocument<Encoding, Allocator, StackAllocator>::ParseStream(InputStream&) [with unsigned int parseFlags = 0; SourceEncoding = rapidjson::UTF8<>; InputStream = rapidjson::GenericStringStream<rapidjson::UTF8<> >; Encoding = rapidjson::UTF8<>; Allocator = rapidjson::MemoryPoolAllocator<>; StackAllocator = rapidjson::CrtAllocator]'
/tmp/B.M3c9ho/BUILD/percona-xtrabackup-percona-xtrabackup-2.4.20/extra/rapidjson/include/rapidjson/document.h:1816:55:   required from 'rapidjson::GenericDocument<Encoding, Allocator, StackAllocator>& rapidjson::GenericDocument<Encoding, Allocator, StackAllocator>::Parse(const Ch*) [with unsigned int parseFlags = 0; SourceEncoding = rapidjson::UTF8<>; Encoding = rapidjson::UTF8<>; Allocator = rapidjson::MemoryPoolAllocator<>; StackAllocator = rapidjson::CrtAllocator; rapidjson::GenericDocument<Encoding, Allocator, StackAllocator>::Ch = char]'
/tmp/B.M3c9ho/BUILD/percona-xtrabackup-percona-xtrabackup-2.4.20/extra/rapidjson/include/rapidjson/document.h:1825:43:   required from 'rapidjson::GenericDocument<Encoding, Allocator, StackAllocator>& rapidjson::GenericDocument<Encoding, Allocator, StackAllocator>::Parse(const Ch*) [with unsigned int parseFlags = 0; Encoding = rapidjson::UTF8<>; Allocator = rapidjson::MemoryPoolAllocator<>; StackAllocator = rapidjson::CrtAllocator; rapidjson::GenericDocument<Encoding, Allocator, StackAllocator>::Ch = char]'
/tmp/B.M3c9ho/BUILD/percona-xtrabackup-percona-xtrabackup-2.4.20/extra/rapidjson/include/rapidjson/document.h:1832:41:   required from 'rapidjson::GenericDocument<Encoding, Allocator, StackAllocator>& rapidjson::GenericDocument<Encoding, Allocator, StackAllocator>::Parse(const Ch*) [with Encoding = rapidjson::UTF8<>; Allocator = rapidjson::MemoryPoolAllocator<>; StackAllocator = rapidjson::CrtAllocator; rapidjson::GenericDocument<Encoding, Allocator, StackAllocator>::Ch = char]'
/tmp/B.M3c9ho/BUILD/percona-xtrabackup-percona-xtrabackup-2.4.20/storage/innobase/xtrabackup/src/xbcloud/swift.cc:181:27:   required from here
/tmp/B.M3c9ho/BUILD/percona-xtrabackup-percona-xtrabackup-2.4.20/extra/rapidjson/include/rapidjson/document.h:1594:20: warning: 'void* memcpy(void*, const void*, size_t)' writing to an object of type 'rapidjson::GenericValue<rapidjson::UTF8<> >::Member' {aka 'struct rapidjson::GenericMember<rapidjson::UTF8<>, rapidjson::MemoryPoolAllocator<> >'} with no trivial copy-assignment; use copy-assignment instead [-Wclass-memaccess]
 1594 |         std::memcpy(data_.o.members, members, count * sizeof(Member));
      |         ~~~~~~~~~~~^~~~~~~~~~~~~~~~~~~~~~~~~~~~~~~~~~~~~~~~~~~~~~~~~~
In file included from /tmp/B.M3c9ho/BUILD/percona-xtrabackup-percona-xtrabackup-2.4.20/storage/innobase/xtrabackup/src/xbcloud/swift.cc:28:
/tmp/B.M3c9ho/BUILD/percona-xtrabackup-percona-xtrabackup-2.4.20/extra/rapidjson/include/rapidjson/document.h:82:8: note: 'rapidjson::GenericValue<rapidjson::UTF8<> >::Member' {aka 'struct rapidjson::GenericMember<rapidjson::UTF8<>, rapidjson::MemoryPoolAllocator<> >'} declared here
   82 | struct GenericMember {
      |        ^~~~~~~~~~~~~
In file included from /tmp/B.M3c9ho/BUILD/percona-xtrabackup-percona-xtrabackup-2.4.20/storage/innobase/xtrabackup/src/xbcloud/swift.cc:28:
/tmp/B.M3c9ho/BUILD/percona-xtrabackup-percona-xtrabackup-2.4.20/extra/rapidjson/include/rapidjson/document.h: In instantiation of 'void rapidjson::GenericValue<Encoding, Allocator>::SetArrayRaw(rapidjson::GenericValue<Encoding, Allocator>*, rapidjson::SizeType, Allocator&) [with Encoding = rapidjson::UTF8<>; Allocator = rapidjson::MemoryPoolAllocator<>; rapidjson::SizeType = unsigned int]':
/tmp/B.M3c9ho/BUILD/percona-xtrabackup-percona-xtrabackup-2.4.20/extra/rapidjson/include/rapidjson/document.h:1902:54:   required from 'bool rapidjson::GenericDocument<Encoding, Allocator, StackAllocator>::EndArray(rapidjson::SizeType) [with Encoding = rapidjson::UTF8<>; Allocator = rapidjson::MemoryPoolAllocator<>; StackAllocator = rapidjson::CrtAllocator; rapidjson::SizeType = unsigned int]'
/tmp/B.M3c9ho/BUILD/percona-xtrabackup-percona-xtrabackup-2.4.20/extra/rapidjson/include/rapidjson/reader.h:1366:39:   required from 'rapidjson::GenericReader<SourceEncoding, TargetEncoding, StackAllocator>::IterativeParsingState rapidjson::GenericReader<SourceEncoding, TargetEncoding, StackAllocator>::Transit(rapidjson::GenericReader<SourceEncoding, TargetEncoding, StackAllocator>::IterativeParsingState, rapidjson::GenericReader<SourceEncoding, TargetEncoding, StackAllocator>::Token, rapidjson::GenericReader<SourceEncoding, TargetEncoding, StackAllocator>::IterativeParsingState, InputStream&, Handler&) [with unsigned int parseFlags = 0; InputStream = rapidjson::GenericStringStream<rapidjson::UTF8<> >; Handler = rapidjson::GenericDocument<rapidjson::UTF8<> >; SourceEncoding = rapidjson::UTF8<>; TargetEncoding = rapidjson::UTF8<>; StackAllocator = rapidjson::MemoryPoolAllocator<>]'
/tmp/B.M3c9ho/BUILD/percona-xtrabackup-percona-xtrabackup-2.4.20/extra/rapidjson/include/rapidjson/reader.h:1421:58:   required from 'rapidjson::ParseResult rapidjson::GenericReader<SourceEncoding, TargetEncoding, StackAllocator>::IterativeParse(InputStream&, Handler&) [with unsigned int parseFlags = 0; InputStream = rapidjson::GenericStringStream<rapidjson::UTF8<> >; Handler = rapidjson::GenericDocument<rapidjson::UTF8<> >; SourceEncoding = rapidjson::UTF8<>; TargetEncoding = rapidjson::UTF8<>; StackAllocator = rapidjson::MemoryPoolAllocator<>]'
/tmp/B.M3c9ho/BUILD/percona-xtrabackup-percona-xtrabackup-2.4.20/extra/rapidjson/include/rapidjson/reader.h:401:46:   required from 'rapidjson::ParseResult rapidjson::GenericReader<SourceEncoding, TargetEncoding, StackAllocator>::Parse(InputStream&, Handler&) [with unsigned int parseFlags = 0; InputStream = rapidjson::GenericStringStream<rapidjson::UTF8<> >; Handler = rapidjson::GenericDocument<rapidjson::UTF8<> >; SourceEncoding = rapidjson::UTF8<>; TargetEncoding = rapidjson::UTF8<>; StackAllocator = rapidjson::MemoryPoolAllocator<>]'
/tmp/B.M3c9ho/BUILD/percona-xtrabackup-percona-xtrabackup-2.4.20/extra/rapidjson/include/rapidjson/document.h:1740:57:   required from 'rapidjson::GenericDocument<Encoding, Allocator, StackAllocator>& rapidjson::GenericDocument<Encoding, Allocator, StackAllocator>::ParseStream(InputStream&) [with unsigned int parseFlags = 0; SourceEncoding = rapidjson::UTF8<>; InputStream = rapidjson::GenericStringStream<rapidjson::UTF8<> >; Encoding = rapidjson::UTF8<>; Allocator = rapidjson::MemoryPoolAllocator<>; StackAllocator = rapidjson::CrtAllocator]'
/tmp/B.M3c9ho/BUILD/percona-xtrabackup-percona-xtrabackup-2.4.20/extra/rapidjson/include/rapidjson/document.h:1816:55:   required from 'rapidjson::GenericDocument<Encoding, Allocator, StackAllocator>& rapidjson::GenericDocument<Encoding, Allocator, StackAllocator>::Parse(const Ch*) [with unsigned int parseFlags = 0; SourceEncoding = rapidjson::UTF8<>; Encoding = rapidjson::UTF8<>; Allocator = rapidjson::MemoryPoolAllocator<>; StackAllocator = rapidjson::CrtAllocator; rapidjson::GenericDocument<Encoding, Allocator, StackAllocator>::Ch = char]'
/tmp/B.M3c9ho/BUILD/percona-xtrabackup-percona-xtrabackup-2.4.20/extra/rapidjson/include/rapidjson/document.h:1825:43:   required from 'rapidjson::GenericDocument<Encoding, Allocator, StackAllocator>& rapidjson::GenericDocument<Encoding, Allocator, StackAllocator>::Parse(const Ch*) [with unsigned int parseFlags = 0; Encoding = rapidjson::UTF8<>; Allocator = rapidjson::MemoryPoolAllocator<>; StackAllocator = rapidjson::CrtAllocator; rapidjson::GenericDocument<Encoding, Allocator, StackAllocator>::Ch = char]'
/tmp/B.M3c9ho/BUILD/percona-xtrabackup-percona-xtrabackup-2.4.20/extra/rapidjson/include/rapidjson/document.h:1832:41:   required from 'rapidjson::GenericDocument<Encoding, Allocator, StackAllocator>& rapidjson::GenericDocument<Encoding, Allocator, StackAllocator>::Parse(const Ch*) [with Encoding = rapidjson::UTF8<>; Allocator = rapidjson::MemoryPoolAllocator<>; StackAllocator = rapidjson::CrtAllocator; rapidjson::GenericDocument<Encoding, Allocator, StackAllocator>::Ch = char]'
/tmp/B.M3c9ho/BUILD/percona-xtrabackup-percona-xtrabackup-2.4.20/storage/innobase/xtrabackup/src/xbcloud/swift.cc:181:27:   required from here
/tmp/B.M3c9ho/BUILD/percona-xtrabackup-percona-xtrabackup-2.4.20/extra/rapidjson/include/rapidjson/document.h:1586:20: warning: 'void* memcpy(void*, const void*, size_t)' writing to an object of type 'class rapidjson::GenericValue<rapidjson::UTF8<> >' with no trivial copy-assignment; use copy-assignment or copy-initialization instead [-Wclass-memaccess]
 1586 |         std::memcpy(data_.a.elements, values, count * sizeof(GenericValue));
      |         ~~~~~~~~~~~^~~~~~~~~~~~~~~~~~~~~~~~~~~~~~~~~~~~~~~~~~~~~~~~~~~~~~~~
/tmp/B.M3c9ho/BUILD/percona-xtrabackup-percona-xtrabackup-2.4.20/extra/rapidjson/include/rapidjson/document.h:421:7: note: 'class rapidjson::GenericValue<rapidjson::UTF8<> >' declared here
  421 | class GenericValue {
      |       ^~~~~~~~~~~~
make[2]: Leaving directory '/tmp/B.M3c9ho/BUILD/percona-xtrabackup-percona-xtrabackup-2.4.20/build'
make[1]: *** [CMakeFiles/Makefile2:3171: storage/innobase/xtrabackup/src/xbcloud/CMakeFiles/xbcloud.dir/all] Error 2
make: *** [Makefile:175: all] Error 2
error: Bad exit status from /tmp/B.M3c9ho/BUILD/tmp/rpm-tmp.NFzwi7 (%build)


RPM build errors:
    Could not canonicalize hostname: naiad
    Bad exit status from /tmp/B.M3c9ho/BUILD/tmp/rpm-tmp.NFzwi7 (%build)
ended at: Tue Apr 27 17:35:21 2021, done in 0:01:54.295546
error: No files produced.
+ chmod -R u+rwX /tmp/B.M3c9ho/BUILD
+ rm -rf /tmp/B.M3c9ho/tmp /tmp/B.M3c9ho/BUILD
+ rm -rf /tmp/B.M3c9ho
Begin-PLD-Builder-Info
Build-Time: user:204.49s sys:48.23s real:132.39s (faults io:82 non-io:5530032)

End-PLD-Builder-Info
[Back to list of logs] [View rpm -qa of builder]