Powered by Dark Side of the Force. Your IP: 18.97.9.175 | yabause f219edb4-380c-41ef-a589-de43acd42e11Toc:- error 1
collect2: error: ld returned 1 exit status
- error 2
make[2]: *** [src/CMakeFiles/yabause.dir/build.make:1211: src/libyabause.so] Error 1
- error 3
make[1]: *** [CMakeFiles/Makefile2:273: src/CMakeFiles/yabause.dir/all] Error 2
- error 4
error: Bad exit status from /tmp/B.58navxlm/BUILD/tmp/rpm-tmp.SmzBOK (%build)
- error 5
RPM build errors:
- error 6
error: No files produced.
Content:make[2]: Entering directory '/tmp/B.58navxlm/BUILD/yabause-0.9.15/build'
[ 29%] Building C object src/CMakeFiles/yabause.dir/sndsdl.c.o
cd /tmp/B.58navxlm/BUILD/yabause-0.9.15/build/src && /usr/bin/x86_64-pld-linux-gnux32-gcc -DARCH_IS_LINUX=1 -DHAVE_BUILTIN_BSWAP16=1 -DHAVE_BUILTIN_BSWAP32=1 -DHAVE_C68K=1 -DHAVE_FLOORF=1 -DHAVE_GETTIMEOFDAY=1 -DHAVE_GLXGETPROCADDRESS=1 -DHAVE_LIBAL=1 -DHAVE_LIBGL=1 -DHAVE_LIBGLUT=1 -DHAVE_LIBMINI18N=1 -DHAVE_LIBSDL2=1 -DHAVE_LIBSDL=1 -DHAVE_LIBXRANDR=1 -DHAVE_MUSASHI=1 -DHAVE_STDINT_H=1 -DHAVE_STRCASECMP=1 -DHAVE_SYS_TIME_H=1 -DLINUX_CDROM_H_IS_BROKEN -DPACKAGE=\"yabause\" -DSH2_DYNAREC=1 -DUSESOCKET=1 -DUSE_SCSPMIDI=1 -DVERSION=\"0.9.15\" -DYAB_WANT_SSF=1 -DYTSDIR=\"/usr/share/yabause/yts\" -D_OGL3_ -D_USEGLEW_ -Dyabause_EXPORTS -I/usr/include/SDL2 -I/usr/include/AL -I/tmp/B.58navxlm/BUILD/yabause-0.9.15/build/src/c68k -I/tmp/B.58navxlm/BUILD/yabause-0.9.15/build/src/musashi -I/tmp/B.58navxlm/BUILD/yabause-0.9.15/src/musashi -Wdeclaration-after-statement -O2 -fwrapv -pipe -Wformat -Werror=format-security -gdwarf-4 -fno-debug-types-section -fvar-tracking-assignments -g2 -Wp,-D_FORTIFY_SOURCE=2 -fstack-protector-strong --param=ssp-buffer-size=4 -Werror=trampolines -fPIC -mtune=generic -march=x86-64 -gdwarf-4 -fno-debug-types-section -fvar-tracking-assignments -g2 -DNDEBUG -DQT_NO_DEBUG -fPIC -MD -MT src/CMakeFiles/yabause.dir/sndsdl.c.o -MF CMakeFiles/yabause.dir/sndsdl.c.o.d -o CMakeFiles/yabause.dir/sndsdl.c.o -c /tmp/B.58navxlm/BUILD/yabause-0.9.15/src/sndsdl.c
make[2]: Leaving directory '/tmp/B.58navxlm/BUILD/yabause-0.9.15/build'
make[2]: Entering directory '/tmp/B.58navxlm/BUILD/yabause-0.9.15/build'
[ 21%] Building C object src/CMakeFiles/yabause.dir/vdp2debug.c.o
cd /tmp/B.58navxlm/BUILD/yabause-0.9.15/build/src && /usr/bin/x86_64-pld-linux-gnux32-gcc -DARCH_IS_LINUX=1 -DHAVE_BUILTIN_BSWAP16=1 -DHAVE_BUILTIN_BSWAP32=1 -DHAVE_C68K=1 -DHAVE_FLOORF=1 -DHAVE_GETTIMEOFDAY=1 -DHAVE_GLXGETPROCADDRESS=1 -DHAVE_LIBAL=1 -DHAVE_LIBGL=1 -DHAVE_LIBGLUT=1 -DHAVE_LIBMINI18N=1 -DHAVE_LIBSDL2=1 -DHAVE_LIBSDL=1 -DHAVE_LIBXRANDR=1 -DHAVE_MUSASHI=1 -DHAVE_STDINT_H=1 -DHAVE_STRCASECMP=1 -DHAVE_SYS_TIME_H=1 -DLINUX_CDROM_H_IS_BROKEN -DPACKAGE=\"yabause\" -DSH2_DYNAREC=1 -DUSESOCKET=1 -DUSE_SCSPMIDI=1 -DVERSION=\"0.9.15\" -DYAB_WANT_SSF=1 -DYTSDIR=\"/usr/share/yabause/yts\" -D_OGL3_ -D_USEGLEW_ -Dyabause_EXPORTS -I/usr/include/SDL2 -I/usr/include/AL -I/tmp/B.58navxlm/BUILD/yabause-0.9.15/build/src/c68k -I/tmp/B.58navxlm/BUILD/yabause-0.9.15/build/src/musashi -I/tmp/B.58navxlm/BUILD/yabause-0.9.15/src/musashi -Wdeclaration-after-statement -O2 -fwrapv -pipe -Wformat -Werror=format-security -gdwarf-4 -fno-debug-types-section -fvar-tracking-assignments -g2 -Wp,-D_FORTIFY_SOURCE=2 -fstack-protector-strong --param=ssp-buffer-size=4 -Werror=trampolines -fPIC -mtune=generic -march=x86-64 -gdwarf-4 -fno-debug-types-section -fvar-tracking-assignments -g2 -DNDEBUG -DQT_NO_DEBUG -fPIC -MD -MT src/CMakeFiles/yabause.dir/vdp2debug.c.o -MF CMakeFiles/yabause.dir/vdp2debug.c.o.d -o CMakeFiles/yabause.dir/vdp2debug.c.o -c /tmp/B.58navxlm/BUILD/yabause-0.9.15/src/vdp2debug.c
make[2]: Leaving directory '/tmp/B.58navxlm/BUILD/yabause-0.9.15/build'
make[2]: Entering directory '/tmp/B.58navxlm/BUILD/yabause-0.9.15/build'
[ 24%] Building C object src/CMakeFiles/yabause.dir/sh7034.c.o
cd /tmp/B.58navxlm/BUILD/yabause-0.9.15/build/src && /usr/bin/x86_64-pld-linux-gnux32-gcc -DARCH_IS_LINUX=1 -DHAVE_BUILTIN_BSWAP16=1 -DHAVE_BUILTIN_BSWAP32=1 -DHAVE_C68K=1 -DHAVE_FLOORF=1 -DHAVE_GETTIMEOFDAY=1 -DHAVE_GLXGETPROCADDRESS=1 -DHAVE_LIBAL=1 -DHAVE_LIBGL=1 -DHAVE_LIBGLUT=1 -DHAVE_LIBMINI18N=1 -DHAVE_LIBSDL2=1 -DHAVE_LIBSDL=1 -DHAVE_LIBXRANDR=1 -DHAVE_MUSASHI=1 -DHAVE_STDINT_H=1 -DHAVE_STRCASECMP=1 -DHAVE_SYS_TIME_H=1 -DLINUX_CDROM_H_IS_BROKEN -DPACKAGE=\"yabause\" -DSH2_DYNAREC=1 -DUSESOCKET=1 -DUSE_SCSPMIDI=1 -DVERSION=\"0.9.15\" -DYAB_WANT_SSF=1 -DYTSDIR=\"/usr/share/yabause/yts\" -D_OGL3_ -D_USEGLEW_ -Dyabause_EXPORTS -I/usr/include/SDL2 -I/usr/include/AL -I/tmp/B.58navxlm/BUILD/yabause-0.9.15/build/src/c68k -I/tmp/B.58navxlm/BUILD/yabause-0.9.15/build/src/musashi -I/tmp/B.58navxlm/BUILD/yabause-0.9.15/src/musashi -Wdeclaration-after-statement -O2 -fwrapv -pipe -Wformat -Werror=format-security -gdwarf-4 -fno-debug-types-section -fvar-tracking-assignments -g2 -Wp,-D_FORTIFY_SOURCE=2 -fstack-protector-strong --param=ssp-buffer-size=4 -Werror=trampolines -fPIC -mtune=generic -march=x86-64 -gdwarf-4 -fno-debug-types-section -fvar-tracking-assignments -g2 -DNDEBUG -DQT_NO_DEBUG -fPIC -MD -MT src/CMakeFiles/yabause.dir/sh7034.c.o -MF CMakeFiles/yabause.dir/sh7034.c.o.d -o CMakeFiles/yabause.dir/sh7034.c.o -c /tmp/B.58navxlm/BUILD/yabause-0.9.15/src/sh7034.c
make[2]: Leaving directory '/tmp/B.58navxlm/BUILD/yabause-0.9.15/build'
make[2]: Entering directory '/tmp/B.58navxlm/BUILD/yabause-0.9.15/build'
[ 23%] Building C object src/CMakeFiles/yabause.dir/yabause.c.o
cd /tmp/B.58navxlm/BUILD/yabause-0.9.15/build/src && /usr/bin/x86_64-pld-linux-gnux32-gcc -DARCH_IS_LINUX=1 -DHAVE_BUILTIN_BSWAP16=1 -DHAVE_BUILTIN_BSWAP32=1 -DHAVE_C68K=1 -DHAVE_FLOORF=1 -DHAVE_GETTIMEOFDAY=1 -DHAVE_GLXGETPROCADDRESS=1 -DHAVE_LIBAL=1 -DHAVE_LIBGL=1 -DHAVE_LIBGLUT=1 -DHAVE_LIBMINI18N=1 -DHAVE_LIBSDL2=1 -DHAVE_LIBSDL=1 -DHAVE_LIBXRANDR=1 -DHAVE_MUSASHI=1 -DHAVE_STDINT_H=1 -DHAVE_STRCASECMP=1 -DHAVE_SYS_TIME_H=1 -DLINUX_CDROM_H_IS_BROKEN -DPACKAGE=\"yabause\" -DSH2_DYNAREC=1 -DUSESOCKET=1 -DUSE_SCSPMIDI=1 -DVERSION=\"0.9.15\" -DYAB_WANT_SSF=1 -DYTSDIR=\"/usr/share/yabause/yts\" -D_OGL3_ -D_USEGLEW_ -Dyabause_EXPORTS -I/usr/include/SDL2 -I/usr/include/AL -I/tmp/B.58navxlm/BUILD/yabause-0.9.15/build/src/c68k -I/tmp/B.58navxlm/BUILD/yabause-0.9.15/build/src/musashi -I/tmp/B.58navxlm/BUILD/yabause-0.9.15/src/musashi -Wdeclaration-after-statement -O2 -fwrapv -pipe -Wformat -Werror=format-security -gdwarf-4 -fno-debug-types-section -fvar-tracking-assignments -g2 -Wp,-D_FORTIFY_SOURCE=2 -fstack-protector-strong --param=ssp-buffer-size=4 -Werror=trampolines -fPIC -mtune=generic -march=x86-64 -gdwarf-4 -fno-debug-types-section -fvar-tracking-assignments -g2 -DNDEBUG -DQT_NO_DEBUG -fPIC -MD -MT src/CMakeFiles/yabause.dir/yabause.c.o -MF CMakeFiles/yabause.dir/yabause.c.o.d -o CMakeFiles/yabause.dir/yabause.c.o -c /tmp/B.58navxlm/BUILD/yabause-0.9.15/src/yabause.c
make[2]: Leaving directory '/tmp/B.58navxlm/BUILD/yabause-0.9.15/build'
make[2]: Entering directory '/tmp/B.58navxlm/BUILD/yabause-0.9.15/build'
[ 9%] Building C object src/CMakeFiles/yabause.dir/cs2.c.o
cd /tmp/B.58navxlm/BUILD/yabause-0.9.15/build/src && /usr/bin/x86_64-pld-linux-gnux32-gcc -DARCH_IS_LINUX=1 -DHAVE_BUILTIN_BSWAP16=1 -DHAVE_BUILTIN_BSWAP32=1 -DHAVE_C68K=1 -DHAVE_FLOORF=1 -DHAVE_GETTIMEOFDAY=1 -DHAVE_GLXGETPROCADDRESS=1 -DHAVE_LIBAL=1 -DHAVE_LIBGL=1 -DHAVE_LIBGLUT=1 -DHAVE_LIBMINI18N=1 -DHAVE_LIBSDL2=1 -DHAVE_LIBSDL=1 -DHAVE_LIBXRANDR=1 -DHAVE_MUSASHI=1 -DHAVE_STDINT_H=1 -DHAVE_STRCASECMP=1 -DHAVE_SYS_TIME_H=1 -DLINUX_CDROM_H_IS_BROKEN -DPACKAGE=\"yabause\" -DSH2_DYNAREC=1 -DUSESOCKET=1 -DUSE_SCSPMIDI=1 -DVERSION=\"0.9.15\" -DYAB_WANT_SSF=1 -DYTSDIR=\"/usr/share/yabause/yts\" -D_OGL3_ -D_USEGLEW_ -Dyabause_EXPORTS -I/usr/include/SDL2 -I/usr/include/AL -I/tmp/B.58navxlm/BUILD/yabause-0.9.15/build/src/c68k -I/tmp/B.58navxlm/BUILD/yabause-0.9.15/build/src/musashi -I/tmp/B.58navxlm/BUILD/yabause-0.9.15/src/musashi -Wdeclaration-after-statement -O2 -fwrapv -pipe -Wformat -Werror=format-security -gdwarf-4 -fno-debug-types-section -fvar-tracking-assignments -g2 -Wp,-D_FORTIFY_SOURCE=2 -fstack-protector-strong --param=ssp-buffer-size=4 -Werror=trampolines -fPIC -mtune=generic -march=x86-64 -gdwarf-4 -fno-debug-types-section -fvar-tracking-assignments -g2 -DNDEBUG -DQT_NO_DEBUG -fPIC -MD -MT src/CMakeFiles/yabause.dir/cs2.c.o -MF CMakeFiles/yabause.dir/cs2.c.o.d -o CMakeFiles/yabause.dir/cs2.c.o -c /tmp/B.58navxlm/BUILD/yabause-0.9.15/src/cs2.c
make[2]: Leaving directory '/tmp/B.58navxlm/BUILD/yabause-0.9.15/build'
make[2]: Entering directory '/tmp/B.58navxlm/BUILD/yabause-0.9.15/build'
[ 28%] Building C object src/CMakeFiles/yabause.dir/persdljoy.c.o
cd /tmp/B.58navxlm/BUILD/yabause-0.9.15/build/src && /usr/bin/x86_64-pld-linux-gnux32-gcc -DARCH_IS_LINUX=1 -DHAVE_BUILTIN_BSWAP16=1 -DHAVE_BUILTIN_BSWAP32=1 -DHAVE_C68K=1 -DHAVE_FLOORF=1 -DHAVE_GETTIMEOFDAY=1 -DHAVE_GLXGETPROCADDRESS=1 -DHAVE_LIBAL=1 -DHAVE_LIBGL=1 -DHAVE_LIBGLUT=1 -DHAVE_LIBMINI18N=1 -DHAVE_LIBSDL2=1 -DHAVE_LIBSDL=1 -DHAVE_LIBXRANDR=1 -DHAVE_MUSASHI=1 -DHAVE_STDINT_H=1 -DHAVE_STRCASECMP=1 -DHAVE_SYS_TIME_H=1 -DLINUX_CDROM_H_IS_BROKEN -DPACKAGE=\"yabause\" -DSH2_DYNAREC=1 -DUSESOCKET=1 -DUSE_SCSPMIDI=1 -DVERSION=\"0.9.15\" -DYAB_WANT_SSF=1 -DYTSDIR=\"/usr/share/yabause/yts\" -D_OGL3_ -D_USEGLEW_ -Dyabause_EXPORTS -I/usr/include/SDL2 -I/usr/include/AL -I/tmp/B.58navxlm/BUILD/yabause-0.9.15/build/src/c68k -I/tmp/B.58navxlm/BUILD/yabause-0.9.15/build/src/musashi -I/tmp/B.58navxlm/BUILD/yabause-0.9.15/src/musashi -Wdeclaration-after-statement -O2 -fwrapv -pipe -Wformat -Werror=format-security -gdwarf-4 -fno-debug-types-section -fvar-tracking-assignments -g2 -Wp,-D_FORTIFY_SOURCE=2 -fstack-protector-strong --param=ssp-buffer-size=4 -Werror=trampolines -fPIC -mtune=generic -march=x86-64 -gdwarf-4 -fno-debug-types-section -fvar-tracking-assignments -g2 -DNDEBUG -DQT_NO_DEBUG -fPIC -MD -MT src/CMakeFiles/yabause.dir/persdljoy.c.o -MF CMakeFiles/yabause.dir/persdljoy.c.o.d -o CMakeFiles/yabause.dir/persdljoy.c.o -c /tmp/B.58navxlm/BUILD/yabause-0.9.15/src/persdljoy.c
make[2]: Leaving directory '/tmp/B.58navxlm/BUILD/yabause-0.9.15/build'
make[2]: Entering directory '/tmp/B.58navxlm/BUILD/yabause-0.9.15/build'
[ 18%] Building C object src/CMakeFiles/yabause.dir/sh2int.c.o
cd /tmp/B.58navxlm/BUILD/yabause-0.9.15/build/src && /usr/bin/x86_64-pld-linux-gnux32-gcc -DARCH_IS_LINUX=1 -DHAVE_BUILTIN_BSWAP16=1 -DHAVE_BUILTIN_BSWAP32=1 -DHAVE_C68K=1 -DHAVE_FLOORF=1 -DHAVE_GETTIMEOFDAY=1 -DHAVE_GLXGETPROCADDRESS=1 -DHAVE_LIBAL=1 -DHAVE_LIBGL=1 -DHAVE_LIBGLUT=1 -DHAVE_LIBMINI18N=1 -DHAVE_LIBSDL2=1 -DHAVE_LIBSDL=1 -DHAVE_LIBXRANDR=1 -DHAVE_MUSASHI=1 -DHAVE_STDINT_H=1 -DHAVE_STRCASECMP=1 -DHAVE_SYS_TIME_H=1 -DLINUX_CDROM_H_IS_BROKEN -DPACKAGE=\"yabause\" -DSH2_DYNAREC=1 -DUSESOCKET=1 -DUSE_SCSPMIDI=1 -DVERSION=\"0.9.15\" -DYAB_WANT_SSF=1 -DYTSDIR=\"/usr/share/yabause/yts\" -D_OGL3_ -D_USEGLEW_ -Dyabause_EXPORTS -I/usr/include/SDL2 -I/usr/include/AL -I/tmp/B.58navxlm/BUILD/yabause-0.9.15/build/src/c68k -I/tmp/B.58navxlm/BUILD/yabause-0.9.15/build/src/musashi -I/tmp/B.58navxlm/BUILD/yabause-0.9.15/src/musashi -Wdeclaration-after-statement -O2 -fwrapv -pipe -Wformat -Werror=format-security -gdwarf-4 -fno-debug-types-section -fvar-tracking-assignments -g2 -Wp,-D_FORTIFY_SOURCE=2 -fstack-protector-strong --param=ssp-buffer-size=4 -Werror=trampolines -fPIC -mtune=generic -march=x86-64 -gdwarf-4 -fno-debug-types-section -fvar-tracking-assignments -g2 -DNDEBUG -DQT_NO_DEBUG -fPIC -MD -MT src/CMakeFiles/yabause.dir/sh2int.c.o -MF CMakeFiles/yabause.dir/sh2int.c.o.d -o CMakeFiles/yabause.dir/sh2int.c.o -c /tmp/B.58navxlm/BUILD/yabause-0.9.15/src/sh2int.c
make[2]: Leaving directory '/tmp/B.58navxlm/BUILD/yabause-0.9.15/build'
make[2]: Entering directory '/tmp/B.58navxlm/BUILD/yabause-0.9.15/build'
[ 14%] Building C object src/CMakeFiles/yabause.dir/scu.c.o
cd /tmp/B.58navxlm/BUILD/yabause-0.9.15/build/src && /usr/bin/x86_64-pld-linux-gnux32-gcc -DARCH_IS_LINUX=1 -DHAVE_BUILTIN_BSWAP16=1 -DHAVE_BUILTIN_BSWAP32=1 -DHAVE_C68K=1 -DHAVE_FLOORF=1 -DHAVE_GETTIMEOFDAY=1 -DHAVE_GLXGETPROCADDRESS=1 -DHAVE_LIBAL=1 -DHAVE_LIBGL=1 -DHAVE_LIBGLUT=1 -DHAVE_LIBMINI18N=1 -DHAVE_LIBSDL2=1 -DHAVE_LIBSDL=1 -DHAVE_LIBXRANDR=1 -DHAVE_MUSASHI=1 -DHAVE_STDINT_H=1 -DHAVE_STRCASECMP=1 -DHAVE_SYS_TIME_H=1 -DLINUX_CDROM_H_IS_BROKEN -DPACKAGE=\"yabause\" -DSH2_DYNAREC=1 -DUSESOCKET=1 -DUSE_SCSPMIDI=1 -DVERSION=\"0.9.15\" -DYAB_WANT_SSF=1 -DYTSDIR=\"/usr/share/yabause/yts\" -D_OGL3_ -D_USEGLEW_ -Dyabause_EXPORTS -I/usr/include/SDL2 -I/usr/include/AL -I/tmp/B.58navxlm/BUILD/yabause-0.9.15/build/src/c68k -I/tmp/B.58navxlm/BUILD/yabause-0.9.15/build/src/musashi -I/tmp/B.58navxlm/BUILD/yabause-0.9.15/src/musashi -Wdeclaration-after-statement -O2 -fwrapv -pipe -Wformat -Werror=format-security -gdwarf-4 -fno-debug-types-section -fvar-tracking-assignments -g2 -Wp,-D_FORTIFY_SOURCE=2 -fstack-protector-strong --param=ssp-buffer-size=4 -Werror=trampolines -fPIC -mtune=generic -march=x86-64 -gdwarf-4 -fno-debug-types-section -fvar-tracking-assignments -g2 -DNDEBUG -DQT_NO_DEBUG -fPIC -MD -MT src/CMakeFiles/yabause.dir/scu.c.o -MF CMakeFiles/yabause.dir/scu.c.o.d -o CMakeFiles/yabause.dir/scu.c.o -c /tmp/B.58navxlm/BUILD/yabause-0.9.15/src/scu.c
make[2]: Leaving directory '/tmp/B.58navxlm/BUILD/yabause-0.9.15/build'
make[2]: Entering directory '/tmp/B.58navxlm/BUILD/yabause-0.9.15/build'
[ 34%] Building C object src/CMakeFiles/yabause.dir/musashi/m68kdasm.c.o
cd /tmp/B.58navxlm/BUILD/yabause-0.9.15/build/src && /usr/bin/x86_64-pld-linux-gnux32-gcc -DARCH_IS_LINUX=1 -DHAVE_BUILTIN_BSWAP16=1 -DHAVE_BUILTIN_BSWAP32=1 -DHAVE_C68K=1 -DHAVE_FLOORF=1 -DHAVE_GETTIMEOFDAY=1 -DHAVE_GLXGETPROCADDRESS=1 -DHAVE_LIBAL=1 -DHAVE_LIBGL=1 -DHAVE_LIBGLUT=1 -DHAVE_LIBMINI18N=1 -DHAVE_LIBSDL2=1 -DHAVE_LIBSDL=1 -DHAVE_LIBXRANDR=1 -DHAVE_MUSASHI=1 -DHAVE_STDINT_H=1 -DHAVE_STRCASECMP=1 -DHAVE_SYS_TIME_H=1 -DLINUX_CDROM_H_IS_BROKEN -DPACKAGE=\"yabause\" -DSH2_DYNAREC=1 -DUSESOCKET=1 -DUSE_SCSPMIDI=1 -DVERSION=\"0.9.15\" -DYAB_WANT_SSF=1 -DYTSDIR=\"/usr/share/yabause/yts\" -D_OGL3_ -D_USEGLEW_ -Dyabause_EXPORTS -I/usr/include/SDL2 -I/usr/include/AL -I/tmp/B.58navxlm/BUILD/yabause-0.9.15/build/src/c68k -I/tmp/B.58navxlm/BUILD/yabause-0.9.15/build/src/musashi -I/tmp/B.58navxlm/BUILD/yabause-0.9.15/src/musashi -Wdeclaration-after-statement -O2 -fwrapv -pipe -Wformat -Werror=format-security -gdwarf-4 -fno-debug-types-section -fvar-tracking-assignments -g2 -Wp,-D_FORTIFY_SOURCE=2 -fstack-protector-strong --param=ssp-buffer-size=4 -Werror=trampolines -fPIC -mtune=generic -march=x86-64 -gdwarf-4 -fno-debug-types-section -fvar-tracking-assignments -g2 -DNDEBUG -DQT_NO_DEBUG -fPIC -MD -MT src/CMakeFiles/yabause.dir/musashi/m68kdasm.c.o -MF CMakeFiles/yabause.dir/musashi/m68kdasm.c.o.d -o CMakeFiles/yabause.dir/musashi/m68kdasm.c.o -c /tmp/B.58navxlm/BUILD/yabause-0.9.15/src/musashi/m68kdasm.c
/tmp/B.58navxlm/BUILD/yabause-0.9.15/src/musashi/m68kdasm.c: In function 'get_imm_str_s.part.0':
/tmp/B.58navxlm/BUILD/yabause-0.9.15/src/musashi/m68kdasm.c:340:32: warning: '%s' directive writing up to 19 bytes into a region of size 14 [-Wformat-overflow=]
327 | return str;
| ~~~
......
340 | sprintf(str, "#%s", make_signed_hex_str_32(read_imm_32()));
| ^~
In file included from /usr/include/stdio.h:970,
from /tmp/B.58navxlm/BUILD/yabause-0.9.15/src/musashi/m68kdasm.c:37:
In function 'sprintf',
inlined from 'get_imm_str_s.part.0' at /tmp/B.58navxlm/BUILD/yabause-0.9.15/src/musashi/m68kdasm.c:340:3:
/usr/include/bits/stdio2.h:30:10: note: '__builtin___sprintf_chk' output between 2 and 21 bytes into a destination of size 15
30 | return __builtin___sprintf_chk (__s, __USE_FORTIFY_LEVEL - 1,
| ^~~~~~~~~~~~~~~~~~~~~~~~~~~~~~~~~~~~~~~~~~~~~~~~~~~~~~
31 | __glibc_objsize (__s), __fmt,
| ~~~~~~~~~~~~~~~~~~~~~~~~~~~~~
32 | __va_arg_pack ());
| ~~~~~~~~~~~~~~~~~
make[2]: Leaving directory '/tmp/B.58navxlm/BUILD/yabause-0.9.15/build'
make[2]: Entering directory '/tmp/B.58navxlm/BUILD/yabause-0.9.15/build'
[ 27%] Building C object src/CMakeFiles/yabause.dir/scsp.c.o
cd /tmp/B.58navxlm/BUILD/yabause-0.9.15/build/src && /usr/bin/x86_64-pld-linux-gnux32-gcc -DARCH_IS_LINUX=1 -DHAVE_BUILTIN_BSWAP16=1 -DHAVE_BUILTIN_BSWAP32=1 -DHAVE_C68K=1 -DHAVE_FLOORF=1 -DHAVE_GETTIMEOFDAY=1 -DHAVE_GLXGETPROCADDRESS=1 -DHAVE_LIBAL=1 -DHAVE_LIBGL=1 -DHAVE_LIBGLUT=1 -DHAVE_LIBMINI18N=1 -DHAVE_LIBSDL2=1 -DHAVE_LIBSDL=1 -DHAVE_LIBXRANDR=1 -DHAVE_MUSASHI=1 -DHAVE_STDINT_H=1 -DHAVE_STRCASECMP=1 -DHAVE_SYS_TIME_H=1 -DLINUX_CDROM_H_IS_BROKEN -DPACKAGE=\"yabause\" -DSH2_DYNAREC=1 -DUSESOCKET=1 -DUSE_SCSPMIDI=1 -DVERSION=\"0.9.15\" -DYAB_WANT_SSF=1 -DYTSDIR=\"/usr/share/yabause/yts\" -D_OGL3_ -D_USEGLEW_ -Dyabause_EXPORTS -I/usr/include/SDL2 -I/usr/include/AL -I/tmp/B.58navxlm/BUILD/yabause-0.9.15/build/src/c68k -I/tmp/B.58navxlm/BUILD/yabause-0.9.15/build/src/musashi -I/tmp/B.58navxlm/BUILD/yabause-0.9.15/src/musashi -Wdeclaration-after-statement -O2 -fwrapv -pipe -Wformat -Werror=format-security -gdwarf-4 -fno-debug-types-section -fvar-tracking-assignments -g2 -Wp,-D_FORTIFY_SOURCE=2 -fstack-protector-strong --param=ssp-buffer-size=4 -Werror=trampolines -fPIC -mtune=generic -march=x86-64 -gdwarf-4 -fno-debug-types-section -fvar-tracking-assignments -g2 -DNDEBUG -DQT_NO_DEBUG -fPIC -MD -MT src/CMakeFiles/yabause.dir/scsp.c.o -MF CMakeFiles/yabause.dir/scsp.c.o.d -o CMakeFiles/yabause.dir/scsp.c.o -c /tmp/B.58navxlm/BUILD/yabause-0.9.15/src/scsp.c
make[2]: Leaving directory '/tmp/B.58navxlm/BUILD/yabause-0.9.15/build'
make[2]: Entering directory '/tmp/B.58navxlm/BUILD/yabause-0.9.15/build'
[ 21%] Building C object src/CMakeFiles/yabause.dir/vidogl.c.o
cd /tmp/B.58navxlm/BUILD/yabause-0.9.15/build/src && /usr/bin/x86_64-pld-linux-gnux32-gcc -DARCH_IS_LINUX=1 -DHAVE_BUILTIN_BSWAP16=1 -DHAVE_BUILTIN_BSWAP32=1 -DHAVE_C68K=1 -DHAVE_FLOORF=1 -DHAVE_GETTIMEOFDAY=1 -DHAVE_GLXGETPROCADDRESS=1 -DHAVE_LIBAL=1 -DHAVE_LIBGL=1 -DHAVE_LIBGLUT=1 -DHAVE_LIBMINI18N=1 -DHAVE_LIBSDL2=1 -DHAVE_LIBSDL=1 -DHAVE_LIBXRANDR=1 -DHAVE_MUSASHI=1 -DHAVE_STDINT_H=1 -DHAVE_STRCASECMP=1 -DHAVE_SYS_TIME_H=1 -DLINUX_CDROM_H_IS_BROKEN -DPACKAGE=\"yabause\" -DSH2_DYNAREC=1 -DUSESOCKET=1 -DUSE_SCSPMIDI=1 -DVERSION=\"0.9.15\" -DYAB_WANT_SSF=1 -DYTSDIR=\"/usr/share/yabause/yts\" -D_OGL3_ -D_USEGLEW_ -Dyabause_EXPORTS -I/usr/include/SDL2 -I/usr/include/AL -I/tmp/B.58navxlm/BUILD/yabause-0.9.15/build/src/c68k -I/tmp/B.58navxlm/BUILD/yabause-0.9.15/build/src/musashi -I/tmp/B.58navxlm/BUILD/yabause-0.9.15/src/musashi -Wdeclaration-after-statement -O2 -fwrapv -pipe -Wformat -Werror=format-security -gdwarf-4 -fno-debug-types-section -fvar-tracking-assignments -g2 -Wp,-D_FORTIFY_SOURCE=2 -fstack-protector-strong --param=ssp-buffer-size=4 -Werror=trampolines -fPIC -mtune=generic -march=x86-64 -gdwarf-4 -fno-debug-types-section -fvar-tracking-assignments -g2 -DNDEBUG -DQT_NO_DEBUG -fPIC -MD -MT src/CMakeFiles/yabause.dir/vidogl.c.o -MF CMakeFiles/yabause.dir/vidogl.c.o.d -o CMakeFiles/yabause.dir/vidogl.c.o -c /tmp/B.58navxlm/BUILD/yabause-0.9.15/src/vidogl.c
make[2]: Leaving directory '/tmp/B.58navxlm/BUILD/yabause-0.9.15/build'
make[2]: Entering directory '/tmp/B.58navxlm/BUILD/yabause-0.9.15/build'
[ 22%] Building C object src/CMakeFiles/yabause.dir/vidsoft.c.o
cd /tmp/B.58navxlm/BUILD/yabause-0.9.15/build/src && /usr/bin/x86_64-pld-linux-gnux32-gcc -DARCH_IS_LINUX=1 -DHAVE_BUILTIN_BSWAP16=1 -DHAVE_BUILTIN_BSWAP32=1 -DHAVE_C68K=1 -DHAVE_FLOORF=1 -DHAVE_GETTIMEOFDAY=1 -DHAVE_GLXGETPROCADDRESS=1 -DHAVE_LIBAL=1 -DHAVE_LIBGL=1 -DHAVE_LIBGLUT=1 -DHAVE_LIBMINI18N=1 -DHAVE_LIBSDL2=1 -DHAVE_LIBSDL=1 -DHAVE_LIBXRANDR=1 -DHAVE_MUSASHI=1 -DHAVE_STDINT_H=1 -DHAVE_STRCASECMP=1 -DHAVE_SYS_TIME_H=1 -DLINUX_CDROM_H_IS_BROKEN -DPACKAGE=\"yabause\" -DSH2_DYNAREC=1 -DUSESOCKET=1 -DUSE_SCSPMIDI=1 -DVERSION=\"0.9.15\" -DYAB_WANT_SSF=1 -DYTSDIR=\"/usr/share/yabause/yts\" -D_OGL3_ -D_USEGLEW_ -Dyabause_EXPORTS -I/usr/include/SDL2 -I/usr/include/AL -I/tmp/B.58navxlm/BUILD/yabause-0.9.15/build/src/c68k -I/tmp/B.58navxlm/BUILD/yabause-0.9.15/build/src/musashi -I/tmp/B.58navxlm/BUILD/yabause-0.9.15/src/musashi -Wdeclaration-after-statement -O2 -fwrapv -pipe -Wformat -Werror=format-security -gdwarf-4 -fno-debug-types-section -fvar-tracking-assignments -g2 -Wp,-D_FORTIFY_SOURCE=2 -fstack-protector-strong --param=ssp-buffer-size=4 -Werror=trampolines -fPIC -mtune=generic -march=x86-64 -gdwarf-4 -fno-debug-types-section -fvar-tracking-assignments -g2 -DNDEBUG -DQT_NO_DEBUG -fPIC -MD -MT src/CMakeFiles/yabause.dir/vidsoft.c.o -MF CMakeFiles/yabause.dir/vidsoft.c.o.d -o CMakeFiles/yabause.dir/vidsoft.c.o -c /tmp/B.58navxlm/BUILD/yabause-0.9.15/src/vidsoft.c
make[2]: Leaving directory '/tmp/B.58navxlm/BUILD/yabause-0.9.15/build'
make[2]: Entering directory '/tmp/B.58navxlm/BUILD/yabause-0.9.15/build'
[ 33%] Building C object src/CMakeFiles/yabause.dir/musashi/m68kopdm.c.o
cd /tmp/B.58navxlm/BUILD/yabause-0.9.15/build/src && /usr/bin/x86_64-pld-linux-gnux32-gcc -DARCH_IS_LINUX=1 -DHAVE_BUILTIN_BSWAP16=1 -DHAVE_BUILTIN_BSWAP32=1 -DHAVE_C68K=1 -DHAVE_FLOORF=1 -DHAVE_GETTIMEOFDAY=1 -DHAVE_GLXGETPROCADDRESS=1 -DHAVE_LIBAL=1 -DHAVE_LIBGL=1 -DHAVE_LIBGLUT=1 -DHAVE_LIBMINI18N=1 -DHAVE_LIBSDL2=1 -DHAVE_LIBSDL=1 -DHAVE_LIBXRANDR=1 -DHAVE_MUSASHI=1 -DHAVE_STDINT_H=1 -DHAVE_STRCASECMP=1 -DHAVE_SYS_TIME_H=1 -DLINUX_CDROM_H_IS_BROKEN -DPACKAGE=\"yabause\" -DSH2_DYNAREC=1 -DUSESOCKET=1 -DUSE_SCSPMIDI=1 -DVERSION=\"0.9.15\" -DYAB_WANT_SSF=1 -DYTSDIR=\"/usr/share/yabause/yts\" -D_OGL3_ -D_USEGLEW_ -Dyabause_EXPORTS -I/usr/include/SDL2 -I/usr/include/AL -I/tmp/B.58navxlm/BUILD/yabause-0.9.15/build/src/c68k -I/tmp/B.58navxlm/BUILD/yabause-0.9.15/build/src/musashi -I/tmp/B.58navxlm/BUILD/yabause-0.9.15/src/musashi -Wdeclaration-after-statement -O2 -fwrapv -pipe -Wformat -Werror=format-security -gdwarf-4 -fno-debug-types-section -fvar-tracking-assignments -g2 -Wp,-D_FORTIFY_SOURCE=2 -fstack-protector-strong --param=ssp-buffer-size=4 -Werror=trampolines -fPIC -mtune=generic -march=x86-64 -gdwarf-4 -fno-debug-types-section -fvar-tracking-assignments -g2 -DNDEBUG -DQT_NO_DEBUG -fPIC -MD -MT src/CMakeFiles/yabause.dir/musashi/m68kopdm.c.o -MF CMakeFiles/yabause.dir/musashi/m68kopdm.c.o.d -o CMakeFiles/yabause.dir/musashi/m68kopdm.c.o -c /tmp/B.58navxlm/BUILD/yabause-0.9.15/build/src/musashi/m68kopdm.c
make[2]: Leaving directory '/tmp/B.58navxlm/BUILD/yabause-0.9.15/build'
make[2]: Entering directory '/tmp/B.58navxlm/BUILD/yabause-0.9.15/build'
[ 32%] Building C object src/CMakeFiles/yabause.dir/musashi/m68kopac.c.o
cd /tmp/B.58navxlm/BUILD/yabause-0.9.15/build/src && /usr/bin/x86_64-pld-linux-gnux32-gcc -DARCH_IS_LINUX=1 -DHAVE_BUILTIN_BSWAP16=1 -DHAVE_BUILTIN_BSWAP32=1 -DHAVE_C68K=1 -DHAVE_FLOORF=1 -DHAVE_GETTIMEOFDAY=1 -DHAVE_GLXGETPROCADDRESS=1 -DHAVE_LIBAL=1 -DHAVE_LIBGL=1 -DHAVE_LIBGLUT=1 -DHAVE_LIBMINI18N=1 -DHAVE_LIBSDL2=1 -DHAVE_LIBSDL=1 -DHAVE_LIBXRANDR=1 -DHAVE_MUSASHI=1 -DHAVE_STDINT_H=1 -DHAVE_STRCASECMP=1 -DHAVE_SYS_TIME_H=1 -DLINUX_CDROM_H_IS_BROKEN -DPACKAGE=\"yabause\" -DSH2_DYNAREC=1 -DUSESOCKET=1 -DUSE_SCSPMIDI=1 -DVERSION=\"0.9.15\" -DYAB_WANT_SSF=1 -DYTSDIR=\"/usr/share/yabause/yts\" -D_OGL3_ -D_USEGLEW_ -Dyabause_EXPORTS -I/usr/include/SDL2 -I/usr/include/AL -I/tmp/B.58navxlm/BUILD/yabause-0.9.15/build/src/c68k -I/tmp/B.58navxlm/BUILD/yabause-0.9.15/build/src/musashi -I/tmp/B.58navxlm/BUILD/yabause-0.9.15/src/musashi -Wdeclaration-after-statement -O2 -fwrapv -pipe -Wformat -Werror=format-security -gdwarf-4 -fno-debug-types-section -fvar-tracking-assignments -g2 -Wp,-D_FORTIFY_SOURCE=2 -fstack-protector-strong --param=ssp-buffer-size=4 -Werror=trampolines -fPIC -mtune=generic -march=x86-64 -gdwarf-4 -fno-debug-types-section -fvar-tracking-assignments -g2 -DNDEBUG -DQT_NO_DEBUG -fPIC -MD -MT src/CMakeFiles/yabause.dir/musashi/m68kopac.c.o -MF CMakeFiles/yabause.dir/musashi/m68kopac.c.o.d -o CMakeFiles/yabause.dir/musashi/m68kopac.c.o -c /tmp/B.58navxlm/BUILD/yabause-0.9.15/build/src/musashi/m68kopac.c
make[2]: Leaving directory '/tmp/B.58navxlm/BUILD/yabause-0.9.15/build'
make[2]: Entering directory '/tmp/B.58navxlm/BUILD/yabause-0.9.15/build'
[ 33%] Building C object src/CMakeFiles/yabause.dir/musashi/m68kopnz.c.o
cd /tmp/B.58navxlm/BUILD/yabause-0.9.15/build/src && /usr/bin/x86_64-pld-linux-gnux32-gcc -DARCH_IS_LINUX=1 -DHAVE_BUILTIN_BSWAP16=1 -DHAVE_BUILTIN_BSWAP32=1 -DHAVE_C68K=1 -DHAVE_FLOORF=1 -DHAVE_GETTIMEOFDAY=1 -DHAVE_GLXGETPROCADDRESS=1 -DHAVE_LIBAL=1 -DHAVE_LIBGL=1 -DHAVE_LIBGLUT=1 -DHAVE_LIBMINI18N=1 -DHAVE_LIBSDL2=1 -DHAVE_LIBSDL=1 -DHAVE_LIBXRANDR=1 -DHAVE_MUSASHI=1 -DHAVE_STDINT_H=1 -DHAVE_STRCASECMP=1 -DHAVE_SYS_TIME_H=1 -DLINUX_CDROM_H_IS_BROKEN -DPACKAGE=\"yabause\" -DSH2_DYNAREC=1 -DUSESOCKET=1 -DUSE_SCSPMIDI=1 -DVERSION=\"0.9.15\" -DYAB_WANT_SSF=1 -DYTSDIR=\"/usr/share/yabause/yts\" -D_OGL3_ -D_USEGLEW_ -Dyabause_EXPORTS -I/usr/include/SDL2 -I/usr/include/AL -I/tmp/B.58navxlm/BUILD/yabause-0.9.15/build/src/c68k -I/tmp/B.58navxlm/BUILD/yabause-0.9.15/build/src/musashi -I/tmp/B.58navxlm/BUILD/yabause-0.9.15/src/musashi -Wdeclaration-after-statement -O2 -fwrapv -pipe -Wformat -Werror=format-security -gdwarf-4 -fno-debug-types-section -fvar-tracking-assignments -g2 -Wp,-D_FORTIFY_SOURCE=2 -fstack-protector-strong --param=ssp-buffer-size=4 -Werror=trampolines -fPIC -mtune=generic -march=x86-64 -gdwarf-4 -fno-debug-types-section -fvar-tracking-assignments -g2 -DNDEBUG -DQT_NO_DEBUG -fPIC -MD -MT src/CMakeFiles/yabause.dir/musashi/m68kopnz.c.o -MF CMakeFiles/yabause.dir/musashi/m68kopnz.c.o.d -o CMakeFiles/yabause.dir/musashi/m68kopnz.c.o -c /tmp/B.58navxlm/BUILD/yabause-0.9.15/build/src/musashi/m68kopnz.c
make[2]: Leaving directory '/tmp/B.58navxlm/BUILD/yabause-0.9.15/build'
make[2]: Entering directory '/tmp/B.58navxlm/BUILD/yabause-0.9.15/build'
[ 31%] Building C object src/CMakeFiles/yabause.dir/c68k/c68kexec.c.o
cd /tmp/B.58navxlm/BUILD/yabause-0.9.15/build/src && /usr/bin/x86_64-pld-linux-gnux32-gcc -DARCH_IS_LINUX=1 -DHAVE_BUILTIN_BSWAP16=1 -DHAVE_BUILTIN_BSWAP32=1 -DHAVE_C68K=1 -DHAVE_FLOORF=1 -DHAVE_GETTIMEOFDAY=1 -DHAVE_GLXGETPROCADDRESS=1 -DHAVE_LIBAL=1 -DHAVE_LIBGL=1 -DHAVE_LIBGLUT=1 -DHAVE_LIBMINI18N=1 -DHAVE_LIBSDL2=1 -DHAVE_LIBSDL=1 -DHAVE_LIBXRANDR=1 -DHAVE_MUSASHI=1 -DHAVE_STDINT_H=1 -DHAVE_STRCASECMP=1 -DHAVE_SYS_TIME_H=1 -DLINUX_CDROM_H_IS_BROKEN -DPACKAGE=\"yabause\" -DSH2_DYNAREC=1 -DUSESOCKET=1 -DUSE_SCSPMIDI=1 -DVERSION=\"0.9.15\" -DYAB_WANT_SSF=1 -DYTSDIR=\"/usr/share/yabause/yts\" -D_OGL3_ -D_USEGLEW_ -Dyabause_EXPORTS -I/usr/include/SDL2 -I/usr/include/AL -I/tmp/B.58navxlm/BUILD/yabause-0.9.15/build/src/c68k -I/tmp/B.58navxlm/BUILD/yabause-0.9.15/build/src/musashi -I/tmp/B.58navxlm/BUILD/yabause-0.9.15/src/musashi -Wdeclaration-after-statement -O2 -fwrapv -pipe -Wformat -Werror=format-security -gdwarf-4 -fno-debug-types-section -fvar-tracking-assignments -g2 -Wp,-D_FORTIFY_SOURCE=2 -fstack-protector-strong --param=ssp-buffer-size=4 -Werror=trampolines -fPIC -mtune=generic -march=x86-64 -gdwarf-4 -fno-debug-types-section -fvar-tracking-assignments -g2 -DNDEBUG -DQT_NO_DEBUG -fPIC -O0 -MD -MT src/CMakeFiles/yabause.dir/c68k/c68kexec.c.o -MF CMakeFiles/yabause.dir/c68k/c68kexec.c.o.d -o CMakeFiles/yabause.dir/c68k/c68kexec.c.o -c /tmp/B.58navxlm/BUILD/yabause-0.9.15/src/c68k/c68kexec.c
In file included from /usr/include/bits/libc-header-start.h:33,
from /usr/include/stdio.h:28,
from /tmp/B.58navxlm/BUILD/yabause-0.9.15/src/c68k/../core.h:24,
from /tmp/B.58navxlm/BUILD/yabause-0.9.15/src/c68k/c68kexec.c:24:
/usr/include/features.h:422:4: warning: #warning _FORTIFY_SOURCE requires compiling with optimization (-O) [-Wcpp]
422 | # warning _FORTIFY_SOURCE requires compiling with optimization (-O)
| ^~~~~~~
make[2]: Leaving directory '/tmp/B.58navxlm/BUILD/yabause-0.9.15/build'
make[2]: Entering directory '/tmp/B.58navxlm/BUILD/yabause-0.9.15/build'
[ 30%] Building C object src/CMakeFiles/yabause.dir/sh2_dynarec/sh2_dynarec.c.o
cd /tmp/B.58navxlm/BUILD/yabause-0.9.15/build/src && /usr/bin/x86_64-pld-linux-gnux32-gcc -DARCH_IS_LINUX=1 -DHAVE_BUILTIN_BSWAP16=1 -DHAVE_BUILTIN_BSWAP32=1 -DHAVE_C68K=1 -DHAVE_FLOORF=1 -DHAVE_GETTIMEOFDAY=1 -DHAVE_GLXGETPROCADDRESS=1 -DHAVE_LIBAL=1 -DHAVE_LIBGL=1 -DHAVE_LIBGLUT=1 -DHAVE_LIBMINI18N=1 -DHAVE_LIBSDL2=1 -DHAVE_LIBSDL=1 -DHAVE_LIBXRANDR=1 -DHAVE_MUSASHI=1 -DHAVE_STDINT_H=1 -DHAVE_STRCASECMP=1 -DHAVE_SYS_TIME_H=1 -DLINUX_CDROM_H_IS_BROKEN -DPACKAGE=\"yabause\" -DSH2_DYNAREC=1 -DUSESOCKET=1 -DUSE_SCSPMIDI=1 -DVERSION=\"0.9.15\" -DYAB_WANT_SSF=1 -DYTSDIR=\"/usr/share/yabause/yts\" -D_OGL3_ -D_USEGLEW_ -Dyabause_EXPORTS -I/usr/include/SDL2 -I/usr/include/AL -I/tmp/B.58navxlm/BUILD/yabause-0.9.15/build/src/c68k -I/tmp/B.58navxlm/BUILD/yabause-0.9.15/build/src/musashi -I/tmp/B.58navxlm/BUILD/yabause-0.9.15/src/musashi -Wdeclaration-after-statement -O2 -fwrapv -pipe -Wformat -Werror=format-security -gdwarf-4 -fno-debug-types-section -fvar-tracking-assignments -g2 -Wp,-D_FORTIFY_SOURCE=2 -fstack-protector-strong --param=ssp-buffer-size=4 -Werror=trampolines -fPIC -mtune=generic -march=x86-64 -gdwarf-4 -fno-debug-types-section -fvar-tracking-assignments -g2 -DNDEBUG -DQT_NO_DEBUG -fPIC -Wno-pointer-to-int-cast -Wno-int-to-pointer-cast -MD -MT src/CMakeFiles/yabause.dir/sh2_dynarec/sh2_dynarec.c.o -MF CMakeFiles/yabause.dir/sh2_dynarec/sh2_dynarec.c.o.d -o CMakeFiles/yabause.dir/sh2_dynarec/sh2_dynarec.c.o -c /tmp/B.58navxlm/BUILD/yabause-0.9.15/src/sh2_dynarec/sh2_dynarec.c
make[2]: Leaving directory '/tmp/B.58navxlm/BUILD/yabause-0.9.15/build'
make[2]: Entering directory '/tmp/B.58navxlm/BUILD/yabause-0.9.15/build'
[ 37%] Linking C shared library libyabause.so
cd /tmp/B.58navxlm/BUILD/yabause-0.9.15/build/src && /usr/bin/cmake -E cmake_link_script CMakeFiles/yabause.dir/link.txt --verbose=1
/usr/bin/x86_64-pld-linux-gnux32-gcc -fPIC -Wdeclaration-after-statement -O2 -fwrapv -pipe -Wformat -Werror=format-security -gdwarf-4 -fno-debug-types-section -fvar-tracking-assignments -g2 -Wp,-D_FORTIFY_SOURCE=2 -fstack-protector-strong --param=ssp-buffer-size=4 -Werror=trampolines -fPIC -mtune=generic -march=x86-64 -gdwarf-4 -fno-debug-types-section -fvar-tracking-assignments -g2 -DNDEBUG -DQT_NO_DEBUG -Wl,--as-needed -Wl,--no-copy-dt-needed-entries -Wl,-z,relro -Wl,-z,combreloc -shared -Wl,-soname,libyabause.so -o libyabause.so CMakeFiles/yabause.dir/bios.c.o CMakeFiles/yabause.dir/cdbase.c.o CMakeFiles/yabause.dir/cheat.c.o CMakeFiles/yabause.dir/coffelf.c.o CMakeFiles/yabause.dir/cs0.c.o CMakeFiles/yabause.dir/cs1.c.o CMakeFiles/yabause.dir/cs2.c.o CMakeFiles/yabause.dir/debug.c.o CMakeFiles/yabause.dir/error.c.o CMakeFiles/yabause.dir/gameinfo.c.o CMakeFiles/yabause.dir/japmodem.c.o CMakeFiles/yabause.dir/m68kcore.c.o CMakeFiles/yabause.dir/m68kd.c.o CMakeFiles/yabause.dir/memory.c.o CMakeFiles/yabause.dir/movie.c.o CMakeFiles/yabause.dir/netlink.c.o CMakeFiles/yabause.dir/osdcore.c.o CMakeFiles/yabause.dir/peripheral.c.o CMakeFiles/yabause.dir/profile.c.o CMakeFiles/yabause.dir/scspdsp.c.o CMakeFiles/yabause.dir/scu.c.o CMakeFiles/yabause.dir/sh2core.c.o CMakeFiles/yabause.dir/sh2d.c.o CMakeFiles/yabause.dir/sh2iasm.c.o CMakeFiles/yabause.dir/sh2idle.c.o CMakeFiles/yabause.dir/sh2int.c.o CMakeFiles/yabause.dir/sh2trace.c.o CMakeFiles/yabause.dir/smpc.c.o CMakeFiles/yabause.dir/snddummy.c.o CMakeFiles/yabause.dir/titan/titan.c.o CMakeFiles/yabause.dir/vdp1.c.o CMakeFiles/yabause.dir/vdp2.c.o CMakeFiles/yabause.dir/vdp2debug.c.o CMakeFiles/yabause.dir/vidogl.c.o CMakeFiles/yabause.dir/vidshared.c.o CMakeFiles/yabause.dir/vidsoft.c.o CMakeFiles/yabause.dir/yabause.c.o CMakeFiles/yabause.dir/ygles.c.o CMakeFiles/yabause.dir/yglshaderes.c.o CMakeFiles/yabause.dir/sh2cache.c.o CMakeFiles/yabause.dir/sh7034.c.o CMakeFiles/yabause.dir/ygr.c.o CMakeFiles/yabause.dir/cd_drive.c.o CMakeFiles/yabause.dir/tsunami/yab_tsunami.c.o CMakeFiles/yabause.dir/tsunami/Tsunami.c.o CMakeFiles/yabause.dir/mpeg_card.c.o CMakeFiles/yabause.dir/yglcache.c.o CMakeFiles/yabause.dir/aosdk/corlett.c.o CMakeFiles/yabause.dir/aosdk/eng_ssf.c.o CMakeFiles/yabause.dir/aosdk/ssf.c.o CMakeFiles/yabause.dir/scsp.c.o CMakeFiles/yabause.dir/persdljoy.c.o CMakeFiles/yabause.dir/sndsdl.c.o CMakeFiles/yabause.dir/sndal.c.o "CMakeFiles/yabause.dir/scr-x.c.o" CMakeFiles/yabause.dir/sh2_dynarec/sh2_dynarec.c.o CMakeFiles/yabause.dir/sh2_dynarec/linkage_x64.s.o CMakeFiles/yabause.dir/c68k/c68kexec.c.o CMakeFiles/yabause.dir/c68k/c68k.c.o CMakeFiles/yabause.dir/m68kc68k.c.o CMakeFiles/yabause.dir/musashi/m68kopac.c.o CMakeFiles/yabause.dir/musashi/m68kopdm.c.o CMakeFiles/yabause.dir/musashi/m68kopnz.c.o CMakeFiles/yabause.dir/musashi/m68kops.c.o CMakeFiles/yabause.dir/musashi/m68kdasm.c.o CMakeFiles/yabause.dir/musashi/m68kcpu.c.o CMakeFiles/yabause.dir/m68kmusashi.c.o "CMakeFiles/yabause.dir/sock-linux.c.o" "CMakeFiles/yabause.dir/thr-linux.c.o" "CMakeFiles/yabause.dir/cd-linux.c.o" CMakeFiles/yabause.dir/perlinuxjoy.c.o
/usr/bin/ld: CMakeFiles/yabause.dir/sh2_dynarec/linkage_x64.s.o: relocation R_X86_64_32S against symbol `master_ip' can not be used when making a shared object; recompile with -fPIC
/usr/bin/ld: failed to set dynamic section sizes: bad value
collect2: error: ld returned 1 exit status
make[2]: *** [src/CMakeFiles/yabause.dir/build.make:1211: src/libyabause.so] Error 1
make[2]: Leaving directory '/tmp/B.58navxlm/BUILD/yabause-0.9.15/build'
make[1]: *** [CMakeFiles/Makefile2:273: src/CMakeFiles/yabause.dir/all] Error 2
make: *** [Makefile:159: all] Error 2
error: Bad exit status from /tmp/B.58navxlm/BUILD/tmp/rpm-tmp.SmzBOK (%build)
RPM build warnings:
%patchN is deprecated (5 usages found), use %patch N (or %patch -P N)
RPM build errors:
Bad exit status from /tmp/B.58navxlm/BUILD/tmp/rpm-tmp.SmzBOK (%build)
ended at: Sat Jan 11 15:37:31 2025, done in 0:00:13.823211
error: No files produced.
+ chmod -R u+rwX /tmp/B.58navxlm/BUILD
+ rm -rf /tmp/B.58navxlm/tmp /tmp/B.58navxlm/BUILD
+ rm -rf /tmp/B.58navxlm
Begin-PLD-Builder-Info
Build-Time: user:71.72s sys:9.05s real:16.33s (faults io:6 non-io:1073586)
End-PLD-Builder-Info
|
|