FailedOk

th/SRPMS[OK]
th/x32[OK]
th/i686[OK]
th/x86_64[OK]

ac/SRPMS[OK]
ac/i386[OK]
ac/i586[OK]
ac/i686[OK]
ac/alpha[OK]
ac/amd64[OK]
ac/athlon[OK]
ac/ppc[OK]
ac/sparc[OK]
ac/sparc64[OK]

Advanced Search
main()
Powered by PLD Linux
(c) 2002-2021 PLD Team
$Revision: 1.37 $
Powered by X.
Your IP: 44.192.22.242

elektra 02e2ebda-fe3b-4fcb-87d3-3cc394e730ec

Status:Failed
Source URL:https://buildlogs.pld-linux.org/pld/th/x32/FAIL/elektra,02e2ebda-fe3b-4fcb-87d3-3cc394e730ec.bz2
text/plain URL:View!
rpm -qa of builder:View!
Date:2021/05/27 17:41:11
Runtime:0:00:32.779736

Toc:

  • prep
  • Executing(%prep): /bin/sh -e /tmp/B.crNwZC/BUILD/tmp/rpm-tmp.buV79W
  • build
  • Executing(%build): /bin/sh -e /tmp/B.crNwZC/BUILD/tmp/rpm-tmp.Q1IEZo
  • error 1
  • /tmp/B.crNwZC/BUILD/elektra-0.8.23/src/tools/kdb/cmdline.cpp:39:99: error: 'numeric_limits' was not declared in this scope
  • error 2
  • /tmp/B.crNwZC/BUILD/elektra-0.8.23/src/tools/kdb/cmdline.cpp:39:114: error: expected primary-expression before 'int'
  • error 3
  • /tmp/B.crNwZC/BUILD/elektra-0.8.23/src/tools/kdb/cmdline.cpp:418:59: error: expected primary-expression before 'int'
  • error 4
  • make[2]: *** [src/tools/kdb/CMakeFiles/kdb-objects.dir/build.make:112: src/tools/kdb/CMakeFiles/kdb-objects.dir/cmdline.cpp.o] Error 1
  • error 5
  • make[1]: *** [CMakeFiles/Makefile2:15884: src/tools/kdb/CMakeFiles/kdb-objects.dir/all] Error 2
  • error 6
  • error: Bad exit status from /tmp/B.crNwZC/BUILD/tmp/rpm-tmp.Q1IEZo (%build)
  • error 7
  • RPM build errors:
  • error 8
  • error: No files produced.

Content:

request from: atler
checking if we should skip the build
started at: Thu May 27 17:40:36 2021
killing old processes on a builder
sending signal 9 to pid -1
cleaning up /tmp
fetching https://srcbuilder.pld-linux.org/th//srpms/02e2ebda-fe3b-4fcb-87d3-3cc394e730ec/elektra-0.8.23-13.src.rpm
fetched 5875575 bytes, 9932.3 K/s
installing srpm: elektra-0.8.23-13.src.rpm
+ install -d /tmp/B.crNwZC/BUILD /tmp/B.crNwZC/RPMS
+ LC_ALL=en_US.UTF-8
+ rpm -qp --changelog elektra-0.8.23-13.src.rpm
* Thu May 27 2021 PLD Linux Team <feedback@pld-linux.org>
- For complete changelog see: http://git.pld-linux.org/?p=packages/elektra.git;a=log;h=master
* Sat Mar 06 2021 Jan Rękorajski <baggins@pld-linux.org> b45a7b8
- remove inconsistent man page (doesn't get created randomly) - rel 13 * Fri Mar 05 2021 Jan Rękorajski <baggins@pld-linux.org> d79c762
- fix bad macro and duplicate description * Thu Mar 04 2021 Jan Rękorajski <baggins@pld-linux.org> ac08456
- remove broken tests - rel 12 * Sun Feb 28 2021 Jan Rękorajski <baggins@pld-linux.org> 523cbb5
- unconditional noarch subpackages * Sun May 17 2020 Jan Rękorajski <baggins@pld-linux.org> 2876e52
- release 11 (by relup.sh) * Sun Mar 22 2020 Jan Rękorajski <baggins@pld-linux.org> 2b93130
- release 10 (by relup.sh) * Fri Nov 01 2019 Jan Rękorajski <baggins@pld-linux.org> 419e983
- release 9 (by relup.sh) * Mon Oct 28 2019 Jan Rękorajski <baggins@pld-linux.org> bc485b5
- rebuild with python 3.8 - release 8 (by relup.sh) * Thu Jul 25 2019 Jan Palus <atler@pld-linux.org> 51ac08f
- release 7 (by relup.sh) * Tue Sep 25 2018 Arkadiusz Miśkiewicz <arekm@maven.pl> 72495e5
- release 6 (by relup.sh) * Sat Sep 15 2018 Arkadiusz Miśkiewicz <arekm@maven.pl> 82bf058
- release 5 (by relup.sh) * Mon Jul 09 2018 Jan Rękorajski <baggins@pld-linux.org> 05a479d
- release 4 (by relup.sh) * Sun Jul 01 2018 Arkadiusz Miśkiewicz <arekm@maven.pl> 3bb36d4
- release 3 (by relup.sh) * Fri Jun 29 2018 Jakub Bogusz <qboosh@pld-linux.org> 41b65be
- enable jni plugin by default - missing dir in -gen - release 2 * Thu Jun 28 2018 Jakub Bogusz <qboosh@pld-linux.org> 2411052
- disable java by default (how to convince maven to use local packages?) * Thu Jun 28 2018 Jakub Bogusz <qboosh@pld-linux.org> 851b5f6
- updated to 0.8.23 - updated zsh,no-markdown patches - removed obsolete cmake,no-deb patches - build gsettings,ruby,io-glib,io-uv bindings and gen tool * Thu Nov 23 2017 Jan Rękorajski <baggins@pld-linux.org> e1a4df3
- fix typo in cmake config - rel 6 * Wed Oct 25 2017 Jan Rękorajski <baggins@pld-linux.org> 014c004
- rebuild with ruby 2.3 - release 5 (by relup.sh) * Tue Mar 28 2017 Jan Rękorajski <baggins@pld-linux.org> 7a2bda7
- release 4 (by relup.sh) * Wed Mar 01 2017 Jakub Bogusz <qboosh@pld-linux.org> 129619a
- updated dependencies, added ruby binding + rpm -Uhv --nodeps --define '_topdir /tmp/B.crNwZC' --define '_specdir %{_topdir}' --define '_sourcedir %{_specdir}' --define '_rpmdir %{_topdir}/RPMS' --define '_builddir %{_topdir}/BUILD' elektra-0.8.23-13.src.rpm Updating / installing... elektra-0.8.23-13 ######################################## + rm -f elektra-0.8.23-13.src.rpm + install -m 700 -d /tmp/B.crNwZC/BUILD/tmp + TMPDIR=/tmp/B.crNwZC/BUILD/tmp + exec nice -n 0 rpmbuild -bp --short-circuit --nodeps --define '_topdir /tmp/B.crNwZC' --define '_specdir %{_topdir}' --define '_sourcedir %{_specdir}' --define '_rpmdir %{_topdir}/RPMS' --define '_builddir %{_topdir}/BUILD' --target x32-pld-linux --define 'prep exit 0' /tmp/B.crNwZC/elektra.spec warning: line 103: It's not recommended to have unversioned Obsoletes: Obsoletes: registry warning: Macro expanded in comment on line 626: %{_libdir}/elektra/libelektra-crypto_botan.so warning: Could not canonicalize hostname: naiad Building target platforms: x32-pld-linux Building for target x32-pld-linux checking BuildConflict-ing packages no BuildConflicts found checking BR rpm: warning: line 103: It's not recommended to have unversioned Obsoletes: Obsoletes: registry rpm: warning: Macro expanded in comment on line 626: %{_libdir}/elektra/libelektra-crypto_botan.so rpm: rpm: warning: Could not canonicalize hostname: naiad rpm: Building target platforms: x32-pld-linux rpm: Building for target x32-pld-linux no BR needed building RPM using: set -ex; : build-id: 02e2ebda-fe3b-4fcb-87d3-3cc394e730ec; TMPDIR=/tmp/B.crNwZC/BUILD/tmp exec nice -n 0 rpmbuild -bb --define '_smp_mflags -j9' --define '_make_opts -Otarget' --define '_pld_builder 1' --define '_topdir /tmp/B.crNwZC' --define '_specdir %{_topdir}' --define '_sourcedir %{_specdir}' --define '_rpmdir %{_topdir}/RPMS' --define '_builddir %{_topdir}/BUILD' --target x32-pld-linux /tmp/B.crNwZC/elektra.spec + : build-id: 02e2ebda-fe3b-4fcb-87d3-3cc394e730ec + TMPDIR=/tmp/B.crNwZC/BUILD/tmp + exec nice -n 0 rpmbuild -bb --define '_smp_mflags -j9' --define '_make_opts -Otarget' --define '_pld_builder 1' --define '_topdir /tmp/B.crNwZC' --define '_specdir %{_topdir}' --define '_sourcedir %{_specdir}' --define '_rpmdir %{_topdir}/RPMS' --define '_builddir %{_topdir}/BUILD' --target x32-pld-linux /tmp/B.crNwZC/elektra.spec warning: line 103: It's not recommended to have unversioned Obsoletes: Obsoletes: registry warning: Macro expanded in comment on line 626: %{_libdir}/elektra/libelektra-crypto_botan.so warning: Could not canonicalize hostname: naiad Building target platforms: x32-pld-linux Building for target x32-pld-linux Executing(%prep): /bin/sh -e /tmp/B.crNwZC/BUILD/tmp/rpm-tmp.buV79W + umask 022 + cd /tmp/B.crNwZC/BUILD + cd /tmp/B.crNwZC/BUILD + rm -rf elektra-0.8.23 + /bin/gzip -dc /tmp/B.crNwZC/elektra-0.8.23.tar.gz + /bin/tar -xof - + STATUS=0 + '[' 0 -ne 0 ']' + cd elektra-0.8.23 + /bin/chmod -Rf a+rX,u+w,g-w,o-w . + echo 'Patch #0 (elektra-zsh.patch):' Patch #0 (elektra-zsh.patch): + </tmp/B.crNwZC/elektra-zsh.patch + /usr/bin/patch -s -p1 '--fuzz=0' + echo 'Patch #1 (elektra-no-markdown.patch):' Patch #1 (elektra-no-markdown.patch): + </tmp/B.crNwZC/elektra-no-markdown.patch + /usr/bin/patch -s -p1 '--fuzz=0' + echo 'Patch #2 (disable-broken-tests.patch):' Patch #2 (disable-broken-tests.patch): + </tmp/B.crNwZC/disable-broken-tests.patch + /usr/bin/patch -s -p1 '--fuzz=0' + grep -l '/usr/bin/env bash' -r scripts + /bin/sed -i -e '1s,/usr/bin/env bash,/bin/bash,' scripts/benchmark-createtree scripts/benchmark_augeas_hosts.sh scripts/benchmark_libsplit.sh scripts/build-homepage scripts/check-env-dep scripts/configure-firefox.in scripts/convert-hosts scripts/copy-template scripts/docker/buildelektra.sh scripts/elektra-merge scripts/elektra-mount scripts/elektra-umount scripts/ffconfig/setupConfig scripts/ffconfig/setupHomepage scripts/ffconfig/setupProxy scripts/fix-spelling scripts/generate-seeds scripts/install-sh-completion.in scripts/kdb-bash-completion scripts/metaini-to-c scripts/vagrant/buildelektra.sh + /bin/sed -i -e '1s,/usr/bin/env python,/usr/bin/python2,' scripts/find-tools scripts/update-infos-status + /bin/rm '--interactive=never' -r src/bindings/io/test + /bin/rm '--interactive=never' src/bindings/io/uv/testio_uv.c + /bin/rm '--interactive=never' src/bindings/io/glib/testio_glib.c + RPM_EC=0 + jobs -p + exit 0 Executing(%build): /bin/sh -e /tmp/B.crNwZC/BUILD/tmp/rpm-tmp.Q1IEZo HOME=/home/users/builder PATH=/home/users/builder/GNUstep/Tools:/bin:/usr/bin:/usr/local/bin TMPDIR=/tmp/B.crNwZC/BUILD/tmp + umask 022 + cd /tmp/B.crNwZC/BUILD + cd elektra-0.8.23 + install -d build + cd build + CC=x86_64-pld-linux-gnux32-gcc CXX=x86_64-pld-linux-gnux32-g++ CPPFLAGS='' /usr/bin/cmake -Wno-dev '-DCMAKE_VERBOSE_MAKEFILE:BOOL=ON' '-DCMAKE_BUILD_TYPE=PLD' '-DCMAKE_INSTALL_BINDIR:PATH=/usr/bin' '-DCMAKE_INSTALL_SBINDIR:PATH=/usr/sbin' '-DCMAKE_INSTALL_LIBEXECDIR:PATH=/usr/libexec' '-DCMAKE_INSTALL_SYSCONFDIR:PATH=/etc' '-DCMAKE_INSTALL_SHAREDSTATEDIRPATH:PATH=/var/lib' '-DCMAKE_INSTALL_LOCALSTATEDIRPATH:PATH=/var' '-DCMAKE_INSTALL_LIBDIR:PATH=/usr/libx32' '-DCMAKE_INSTALL_INCLUDEDIR:PATH=/usr/include' '-DCMAKE_INSTALL_OLDINCLUDEDIR:PATH=/usr/include' '-DCMAKE_INSTALL_DATAROOTDIR:PATH=/usr/share' '-DCMAKE_INSTALL_DATADIR:PATH=/usr/share' '-DCMAKE_INSTALL_INFODIR:PATH=/usr/share/info' '-DCMAKE_INSTALL_LOCALEDIR:PATH=/usr/share/locale' '-DCMAKE_INSTALL_MANDIR:PATH=/usr/share/man' '-DCMAKE_INSTALL_DOCDIR:PATH=/usr/share/doc' '-DCMAKE_INSTALL_PREFIX:PATH=/usr' '-DSYSCONF_INSTALL_DIR:PATH=/etc' '-DCMAKE_CXX_FLAGS_PLD=-O2 -fwrapv -pipe -Wformat -Werror=format-security -gdwarf-4 -fno-debug-types-section -fvar-tracking-assignments -g2 -Wp,-D_FORTIFY_SOURCE=2 -fstack-protector-strong --param=ssp-buffer-size=4 -Werror=trampolines -fPIC -mtune=generic -march=x86-64 -gdwarf-4 -fno-debug-types-section -fvar-tracking-assignments -g2 -DNDEBUG -DQT_NO_DEBUG' '-DCMAKE_C_FLAGS_PLD=-O2 -fwrapv -pipe -Wformat -Werror=format-security -gdwarf-4 -fno-debug-types-section -fvar-tracking-assignments -g2 -Wp,-D_FORTIFY_SOURCE=2 -fstack-protector-strong --param=ssp-buffer-size=4 -Werror=trampolines -fPIC -mtune=generic -march=x86-64 -gdwarf-4 -fno-debug-types-section -fvar-tracking-assignments -g2 -DNDEBUG -DQT_NO_DEBUG' '-DCMAKE_Fortran_FLAGS_PLD=-O2 -fwrapv -pipe -Wformat -Werror=format-security -gdwarf-4 -fno-debug-types-section -fvar-tracking-assignments -g2 -Wp,-D_FORTIFY_SOURCE=2 -fstack-protector-strong --param=ssp-buffer-size=4 -Werror=trampolines -fPIC -mtune=generic -march=x86-64 -gdwarf-4 -fno-debug-types-section -fvar-tracking-assignments -g2 -DNDEBUG -DQT_NO_DEBUG' '-DCMAKE_EXE_LINKER_FLAGS_PLD=-Wl,--as-needed -Wl,--no-copy-dt-needed-entries -Wl,-z,relro -Wl,-z,combreloc ' '-DCMAKE_SHARED_LINKER_FLAGS_PLD=-Wl,--as-needed -Wl,--no-copy-dt-needed-entries -Wl,-z,relro -Wl,-z,combreloc ' '-DCMAKE_MODULE_LINKER_FLAGS_PLD=-Wl,--as-needed -Wl,--no-copy-dt-needed-entries -Wl,-z,relro -Wl,-z,combreloc ' '-DLIB_SUFFIX=x32' '-DBUILD_SHARED_LIBS:BOOL=ON' .. '-DBINDINGS=INTERCEPT;cpp;io_uv;glib;io_glib;gsettings;gi_lua;gi_python;swig_lua;swig_python2;swig_python;swig_ruby' '-DBUILD_FULL=OFF' '-DINSTALL_TESTING=FALSE' '-DPLUGINS=ALL' '-DTARGET_CMAKE_FOLDER=/usr/share/cmake/Modules' '-DTOOLS=kdb;race;gen;qt-gui' '-DBUILD_STATIC=ON' -- The C compiler identification is GNU 11.1.0 -- The CXX compiler identification is GNU 11.1.0 -- Check for working C compiler: /usr/bin/x86_64-pld-linux-gnux32-gcc -- Check for working C compiler: /usr/bin/x86_64-pld-linux-gnux32-gcc - works -- Detecting C compiler ABI info -- Detecting C compiler ABI info - done -- Detecting C compile features -- Detecting C compile features - done -- Check for working CXX compiler: /usr/bin/x86_64-pld-linux-gnux32-g++ -- Check for working CXX compiler: /usr/bin/x86_64-pld-linux-gnux32-g++ - works -- Detecting CXX compiler ABI info -- Detecting CXX compiler ABI info - done -- Detecting CXX compile features -- Detecting CXX compile features - done -- Performing Test HAS_CXX_STD -- Performing Test HAS_CXX_STD - Success -- Performing Test LD_ACCEPTS_VERSION_SCRIPT -- Performing Test LD_ACCEPTS_VERSION_SCRIPT - Success -- GCC detected -- Performing Test HAS_CFLAG_MAYBE_UNINITIALIZED -- Performing Test HAS_CFLAG_MAYBE_UNINITIALIZED - Success -- C flags are -std=gnu99 -Wno-deprecated-declarations -Wstrict-prototypes -Wno-long-long -pedantic -Wno-variadic-macros -Wall -Wextra -Wno-overlength-strings -Wsign-compare -Wfloat-equal -Wformat -Wformat-security -Wshadow -Wcomments -Wtrigraphs -Wundef -Wuninitialized -Winit-self -Wmaybe-uninitialized -Wsign-compare -Wfloat-equal -- CXX flags are -std=c++11 -Wno-deprecated-declarations -Wold-style-cast -Wstrict-null-sentinel -D_GLIBCXX_USE_NANOSLEEP -Wno-missing-field-initializers -Woverloaded-virtual -Wsign-promo -Wno-long-long -pedantic -Wno-variadic-macros -Wall -Wextra -Wno-overlength-strings -Wsign-compare -Wfloat-equal -Wformat -Wformat-security -Wshadow -Wcomments -Wtrigraphs -Wundef -Wuninitialized -Winit-self -Wmaybe-uninitialized -- You are building Elektra 0.8.23 -- Detected PLD3.0-x86_64. Use make package to build packages (TBZ2). -- Found Doxygen: /usr/bin/doxygen (found version "1.8.10") found components: doxygen dot -- Found Perl: /usr/bin/perl (found version "5.32.1") -- Found PkgConfig: /usr/bin/pkg-config (found version "0.29.2") -- Looking for pthread.h -- Looking for pthread.h - found -- Performing Test CMAKE_HAVE_LIBC_PTHREAD -- Performing Test CMAKE_HAVE_LIBC_PTHREAD - Failed -- Looking for pthread_create in pthreads -- Looking for pthread_create in pthreads - not found -- Looking for pthread_create in pthread -- Looking for pthread_create in pthread - found -- Found Threads: TRUE -- Looking for __GNU_LIBRARY__ -- Looking for __GNU_LIBRARY__ - found -- Found augeas: /usr/libx32/libaugeas.so -- Include Plugin augeas -- Include Plugin base64 -- Include Plugin blockresolver -- Include Plugin boolean -- Include Plugin c -- Include Plugin cachefilter -- Include Plugin camel -- Include Plugin ccode -- Include Plugin conditionals -- Include Plugin constants -- Include Plugin counter -- Exclude Plugin crypto_botan because botan development files not found -- Include Plugin crypto_gcrypt -- Include Plugin crypto_openssl -- Include Plugin csvstorage -- Found CURL: /usr/libx32/libcurl.so (found version "7.77.0") -- Include Plugin curlget -- Include Plugin date -- Found D-Bus: /usr/libx32/libdbus-1.so -- Include Plugin dbus -- Include Plugin dbusrecv -- Include Plugin desktop -- Include Plugin dini -- Include Plugin directoryvalue -- Include Plugin doc -- Include Plugin dpkg -- Include Plugin dump -- Include Plugin enum -- Include Plugin error -- Include Plugin fcrypt -- Include Plugin file -- Looking for iconv -- Looking for iconv - found -- Found iconv library: -- Include Plugin filecheck -- Include Plugin fstab -- Found LibGit2: /usr/libx32/libgit2.so -- Include Plugin gitresolver -- Include Plugin glob -- Looking for mkfifo -- Looking for mkfifo - found -- Looking for fork -- Looking for fork - found -- Exclude Plugin haskell because cabal not found, please refer to the readme in src/bindings/haskell/README.md -- Include Plugin hexcode -- Include Plugin hidden -- Include Plugin hosts -- Include Plugin iconv -- Include Plugin ini -- Include Plugin internalnotification -- Include Plugin ipaddr -- Include Plugin iterate -- Could NOT find JNI (missing: JAVA_AWT_LIBRARY) -- Exclude Plugin jni because jni not found -- Found systemd-journal: /libx32/libsystemd.so -- Include Plugin journald -- Include Plugin keytometa -- Include Plugin line -- Include Plugin lineendings -- Include Plugin list -- Include Plugin logchange -- Found SWIG: /usr/bin/swig (found suitable version "4.0.1", minimum required is "3") -- Include Plugin lua -- Include Plugin mathcheck -- Include Plugin mini -- Include Plugin mozprefs -- Looking for fts.h -- Looking for fts.h - found -- Include Plugin multifile -- Include Plugin network -- Include Plugin ni -- Include Plugin noresolver -- Include Plugin null -- Include Plugin passwd -- Include Plugin path -- Include Plugin profile -- Include Plugin python -- Include Plugin python2 -- Include Plugin range -- Include Plugin regexstore -- Include Plugin rename -- Include Plugin required -- Include Plugin resolver_fm_hpu_b -- Include Plugin resolver_fm_b_b -- Include Plugin resolver_fm_pb_b -- Include Plugin resolver_fm_hb_b -- Include Plugin resolver_fm_hp_b -- Include Plugin resolver_fm_ub_x -- Include Plugin resolver_fm_xb_x -- Include Plugin resolver_fm_xp_x -- Include Plugin resolver_fm_xhp_x -- Include Plugin resolver_fm_uhb_xb -- Found Ruby: /usr/bin/ruby (found version "2.6.6") -- Include Plugin ruby -- Include Plugin semlock -- Include Plugin shell -- Include Plugin simpleini -- Include Plugin simplespeclang -- Include Plugin spec -- Include Plugin struct -- Include Plugin sync -- Include Plugin syslog -- Include Plugin tcl -- Include Plugin template -- Include Plugin timeofday -- Include Plugin tracer -- Include Plugin type -- Include Plugin uname -- Include Plugin validation -- Include Plugin wresolver -- Include Plugin xerces -- Found LibXml2: /usr/libx32/libxml2.so (found version "2.9.12") -- Include Plugin xmltool -- Include Plugin yajl -- Include Plugin yamlcpp -- Include Binding cpp -- Found Python2Interp: /usr/bin/python2.7 (found suitable version "2.7.18", minimum required is "2.7") -- Found Python2Libs: /usr/libx32/libpython2.7.so (found suitable version "2.7.18", minimum required is "2.7") -- Include Binding swig_python2 -- Found PythonInterp: /usr/bin/python3 (found suitable version "3.9.5", minimum required is "3") -- Found PythonLibs: /usr/libx32/libpython3.9.so (found suitable version "3.9.5", minimum required is "3") -- Include Binding swig_python -- Found Lua: /usr/libx32/liblua5.3.so;/usr/libx32/libm.so (found suitable version "5.3.5", minimum required is "5.1") -- Include Binding swig_lua -- Include Binding swig_ruby -- Checking for module 'gobject-2.0>=2.36' -- Found gobject-2.0, version 2.68.2 -- Include Binding glib -- Include Binding gsettings -- Checking for module 'gobject-introspection-1.0>=1.38' -- Found gobject-introspection-1.0, version 1.68.0 -- Include Binding gi_python -- Include Binding gi_lua -- Include Binding intercept_fs -- Include Binding intercept_env -- Include Binding io_uv -- Include Binding io_glib -- Include Tool kdb -- Include Tool race -- Found LibRt: /usr/libx32/librt.so -- Include Tool gen -- Include Tool qt-gui -- Looking for clearenv -- Looking for clearenv - found -- Looking for setenv -- Looking for setenv - found -- Looking for futimens -- Looking for futimens - found -- Looking for hsearch_r -- Looking for hsearch_r - found -- Looking for futimes -- Looking for futimes - found -- Looking for glob -- Looking for glob - found -- Looking for clock_gettime -- Looking for clock_gettime - found -- Looking for ctype.h -- Looking for ctype.h - found -- Looking for errno.h -- Looking for errno.h - found -- Looking for locale.h -- Looking for locale.h - found -- Looking for stdio.h -- Looking for stdio.h - found -- Looking for stdlib.h -- Looking for stdlib.h - found -- Looking for string.h -- Looking for string.h - found -- Looking for time.h -- Looking for time.h - found -- Looking for unistd.h -- Looking for unistd.h - found -- Looking for sys/types.h -- Looking for sys/types.h - found -- Looking for stdint.h -- Looking for stdint.h - found -- Looking for stddef.h -- Looking for stddef.h - found -- Check size of int -- Check size of int - done -- Check size of long -- Check size of long - done -- Check size of size_t -- Check size of size_t - done -- Check size of long long -- Check size of long long - done -- Check size of long double -- Check size of long double - done -- Check size of mode_t -- Check size of mode_t - done -- Check size of ((struct timeval*)0)->tv_usec -- Check size of ((struct timeval*)0)->tv_usec - done -- Check if the system is big endian -- Searching 16 bit integer -- Check size of unsigned short -- Check size of unsigned short - done -- Searching 16 bit integer - Using unsigned short -- Check if the system is big endian - little endian -- Configuring done -- Generating done CMake Warning: Manually-specified variables were not used by the project: CMAKE_Fortran_FLAGS_PLD CMAKE_INSTALL_BINDIR CMAKE_INSTALL_DATADIR CMAKE_INSTALL_DATAROOTDIR CMAKE_INSTALL_DOCDIR CMAKE_INSTALL_INCLUDEDIR CMAKE_INSTALL_INFODIR CMAKE_INSTALL_LIBDIR CMAKE_INSTALL_LIBEXECDIR CMAKE_INSTALL_LOCALEDIR CMAKE_INSTALL_LOCALSTATEDIRPATH CMAKE_INSTALL_MANDIR CMAKE_INSTALL_OLDINCLUDEDIR CMAKE_INSTALL_SBINDIR CMAKE_INSTALL_SHAREDSTATEDIRPATH CMAKE_INSTALL_SYSCONFDIR SYSCONF_INSTALL_DIR -- Build files have been written to: /tmp/B.crNwZC/BUILD/elektra-0.8.23/build + /usr/bin/make -Otarget -j9 /usr/bin/cmake -S/tmp/B.crNwZC/BUILD/elektra-0.8.23 -B/tmp/B.crNwZC/BUILD/elektra-0.8.23/build --check-build-system CMakeFiles/Makefile.cmake 0 /usr/bin/cmake -E cmake_progress_start /tmp/B.crNwZC/BUILD/elektra-0.8.23/build/CMakeFiles /tmp/B.crNwZC/BUILD/elektra-0.8.23/build/CMakeFiles/progress.marks /usr/bin/make -f CMakeFiles/Makefile2 all /usr/bin/make -f doc/CMakeFiles/markdownlinkconverter.dir/build.make doc/CMakeFiles/markdownlinkconverter.dir/depend /usr/bin/make -f doc/help/CMakeFiles/man-elektra-values.dir/build.make doc/help/CMakeFiles/man-elektra-values.dir/depend /usr/bin/make -f doc/help/CMakeFiles/man-elektra-sync-flag.dir/build.make doc/help/CMakeFiles/man-elektra-sync-flag.dir/depend /usr/bin/make -f doc/help/CMakeFiles/man-elektra-spec.dir/build.make doc/help/CMakeFiles/man-elektra-spec.dir/depend /usr/bin/make -f doc/help/CMakeFiles/man-elektra-related.dir/build.make doc/help/CMakeFiles/man-elektra-related.dir/depend /usr/bin/make -f doc/help/CMakeFiles/man-kdb-lsmeta.dir/build.make doc/help/CMakeFiles/man-kdb-lsmeta.dir/depend /usr/bin/make -f doc/help/CMakeFiles/man-kdb-mount-list-all-files.dir/build.make doc/help/CMakeFiles/man-kdb-mount-list-all-files.dir/depend /usr/bin/make -f doc/help/CMakeFiles/man-kdb-spec-mount.dir/build.make doc/help/CMakeFiles/man-kdb-spec-mount.dir/depend /usr/bin/make -f doc/help/CMakeFiles/man-kdb-info.dir/build.make doc/help/CMakeFiles/man-kdb-info.dir/depend make[2]: Entering directory '/tmp/B.crNwZC/BUILD/elektra-0.8.23/build' cd /tmp/B.crNwZC/BUILD/elektra-0.8.23/build && /usr/bin/cmake -E cmake_depends "Unix Makefiles" /tmp/B.crNwZC/BUILD/elektra-0.8.23 /tmp/B.crNwZC/BUILD/elektra-0.8.23/doc /tmp/B.crNwZC/BUILD/elektra-0.8.23/build /tmp/B.crNwZC/BUILD/elektra-0.8.23/build/doc /tmp/B.crNwZC/BUILD/elektra-0.8.23/build/doc/CMakeFiles/markdownlinkconverter.dir/DependInfo.cmake --color= Scanning dependencies of target markdownlinkconverter make[2]: Leaving directory '/tmp/B.crNwZC/BUILD/elektra-0.8.23/build' make[2]: Entering directory '/tmp/B.crNwZC/BUILD/elektra-0.8.23/build' cd /tmp/B.crNwZC/BUILD/elektra-0.8.23/build && /usr/bin/cmake -E cmake_depends "Unix Makefiles" /tmp/B.crNwZC/BUILD/elektra-0.8.23 /tmp/B.crNwZC/BUILD/elektra-0.8.23/doc/help /tmp/B.crNwZC/BUILD/elektra-0.8.23/build /tmp/B.crNwZC/BUILD/elektra-0.8.23/build/doc/help /tmp/B.crNwZC/BUILD/elektra-0.8.23/build/doc/help/CMakeFiles/man-elektra-related.dir/DependInfo.cmake --color= Scanning dependencies of target man-elektra-related make[2]: Leaving directory '/tmp/B.crNwZC/BUILD/elektra-0.8.23/build' make[2]: Entering directory '/tmp/B.crNwZC/BUILD/elektra-0.8.23/build' cd /tmp/B.crNwZC/BUILD/elektra-0.8.23/build && /usr/bin/cmake -E cmake_depends "Unix Makefiles" /tmp/B.crNwZC/BUILD/elektra-0.8.23 /tmp/B.crNwZC/BUILD/elektra-0.8.23/doc/help /tmp/B.crNwZC/BUILD/elektra-0.8.23/build /tmp/B.crNwZC/BUILD/elektra-0.8.23/build/doc/help /tmp/B.crNwZC/BUILD/elektra-0.8.23/build/doc/help/CMakeFiles/man-kdb-lsmeta.dir/DependInfo.cmake --color= Scanning dependencies of target man-kdb-lsmeta make[2]: Leaving directory '/tmp/B.crNwZC/BUILD/elektra-0.8.23/build' make[2]: Entering directory '/tmp/B.crNwZC/BUILD/elektra-0.8.23/build' cd /tmp/B.crNwZC/BUILD/elektra-0.8.23/build && /usr/bin/cmake -E cmake_depends "Unix Makefiles" /tmp/B.crNwZC/BUILD/elektra-0.8.23 /tmp/B.crNwZC/BUILD/elektra-0.8.23/doc/help /tmp/B.crNwZC/BUILD/elektra-0.8.23/build /tmp/B.crNwZC/BUILD/elektra-0.8.23/build/doc/help /tmp/B.crNwZC/BUILD/elektra-0.8.23/build/doc/help/CMakeFiles/man-kdb-info.dir/DependInfo.cmake --color= Scanning dependencies of target man-kdb-info make[2]: Leaving directory '/tmp/B.crNwZC/BUILD/elektra-0.8.23/build' make[2]: Entering directory '/tmp/B.crNwZC/BUILD/elektra-0.8.23/build' cd /tmp/B.crNwZC/BUILD/elektra-0.8.23/build && /usr/bin/cmake -E cmake_depends "Unix Makefiles" /tmp/B.crNwZC/BUILD/elektra-0.8.23 /tmp/B.crNwZC/BUILD/elektra-0.8.23/doc/help /tmp/B.crNwZC/BUILD/elektra-0.8.23/build /tmp/B.crNwZC/BUILD/elektra-0.8.23/build/doc/help /tmp/B.crNwZC/BUILD/elektra-0.8.23/build/doc/help/CMakeFiles/man-kdb-mount-list-all-files.dir/DependInfo.cmake --color= Scanning dependencies of target man-kdb-mount-list-all-files make[2]: Leaving directory '/tmp/B.crNwZC/BUILD/elektra-0.8.23/build' make[2]: Entering directory '/tmp/B.crNwZC/BUILD/elektra-0.8.23/build' cd /tmp/B.crNwZC/BUILD/elektra-0.8.23/build && /usr/bin/cmake -E cmake_depends "Unix Makefiles" /tmp/B.crNwZC/BUILD/elektra-0.8.23 /tmp/B.crNwZC/BUILD/elektra-0.8.23/doc/help /tmp/B.crNwZC/BUILD/elektra-0.8.23/build /tmp/B.crNwZC/BUILD/elektra-0.8.23/build/doc/help /tmp/B.crNwZC/BUILD/elektra-0.8.23/build/doc/help/CMakeFiles/man-kdb-spec-mount.dir/DependInfo.cmake --color= Scanning dependencies of target man-kdb-spec-mount make[2]: Leaving directory '/tmp/B.crNwZC/BUILD/elektra-0.8.23/build' make[2]: Entering directory '/tmp/B.crNwZC/BUILD/elektra-0.8.23/build' cd /tmp/B.crNwZC/BUILD/elektra-0.8.23/build && /usr/bin/cmake -E cmake_depends "Unix Makefiles" /tmp/B.crNwZC/BUILD/elektra-0.8.23 /tmp/B.crNwZC/BUILD/elektra-0.8.23/doc/help /tmp/B.crNwZC/BUILD/elektra-0.8.23/build /tmp/B.crNwZC/BUILD/elektra-0.8.23/build/doc/help /tmp/B.crNwZC/BUILD/elektra-0.8.23/build/doc/help/CMakeFiles/man-elektra-spec.dir/DependInfo.cmake --color= Scanning dependencies of target man-elektra-spec make[2]: Leaving directory '/tmp/B.crNwZC/BUILD/elektra-0.8.23/build' make[2]: Entering directory '/tmp/B.crNwZC/BUILD/elektra-0.8.23/build' cd /tmp/B.crNwZC/BUILD/elektra-0.8.23/build && /usr/bin/cmake -E cmake_depends "Unix Makefiles" /tmp/B.crNwZC/BUILD/elektra-0.8.23 /tmp/B.crNwZC/BUILD/elektra-0.8.23/doc/help /tmp/B.crNwZC/BUILD/elektra-0.8.23/build /tmp/B.crNwZC/BUILD/elektra-0.8.23/build/doc/help /tmp/B.crNwZC/BUILD/elektra-0.8.23/build/doc/help/CMakeFiles/man-elektra-values.dir/DependInfo.cmake --color= Scanning dependencies of target man-elektra-values make[2]: Leaving directory '/tmp/B.crNwZC/BUILD/elektra-0.8.23/build' make[2]: Entering directory '/tmp/B.crNwZC/BUILD/elektra-0.8.23/build' cd /tmp/B.crNwZC/BUILD/elektra-0.8.23/build && /usr/bin/cmake -E cmake_depends "Unix Makefiles" /tmp/B.crNwZC/BUILD/elektra-0.8.23 /tmp/B.crNwZC/BUILD/elektra-0.8.23/doc/help /tmp/B.crNwZC/BUILD/elektra-0.8.23/build /tmp/B.crNwZC/BUILD/elektra-0.8.23/build/doc/help /tmp/B.crNwZC/BUILD/elektra-0.8.23/build/doc/help/CMakeFiles/man-elektra-sync-flag.dir/DependInfo.cmake --color= Scanning dependencies of target man-elektra-sync-flag make[2]: Leaving directory '/tmp/B.crNwZC/BUILD/elektra-0.8.23/build' /usr/bin/make -f doc/CMakeFiles/markdownlinkconverter.dir/build.make doc/CMakeFiles/markdownlinkconverter.dir/build /usr/bin/make -f doc/help/CMakeFiles/man-elektra-values.dir/build.make doc/help/CMakeFiles/man-elektra-values.dir/build /usr/bin/make -f doc/help/CMakeFiles/man-elektra-sync-flag.dir/build.make doc/help/CMakeFiles/man-elektra-sync-flag.dir/build /usr/bin/make -f doc/help/CMakeFiles/man-elektra-spec.dir/build.make doc/help/CMakeFiles/man-elektra-spec.dir/build /usr/bin/make -f doc/help/CMakeFiles/man-elektra-related.dir/build.make doc/help/CMakeFiles/man-elektra-related.dir/build /usr/bin/make -f doc/help/CMakeFiles/man-kdb-lsmeta.dir/build.make doc/help/CMakeFiles/man-kdb-lsmeta.dir/build /usr/bin/make -f doc/help/CMakeFiles/man-kdb-mount-list-all-files.dir/build.make doc/help/CMakeFiles/man-kdb-mount-list-all-files.dir/build /usr/bin/make -f doc/help/CMakeFiles/man-kdb-spec-mount.dir/build.make doc/help/CMakeFiles/man-kdb-spec-mount.dir/build /usr/bin/make -f doc/help/CMakeFiles/man-kdb-info.dir/build.make doc/help/CMakeFiles/man-kdb-info.dir/build make[2]: Nothing to be done for 'doc/help/CMakeFiles/man-elektra-values.dir/build'. make[2]: Nothing to be done for 'doc/help/CMakeFiles/man-elektra-spec.dir/build'. make[2]: Nothing to be done for 'doc/help/CMakeFiles/man-elektra-sync-flag.dir/build'. make[2]: Nothing to be done for 'doc/help/CMakeFiles/man-elektra-related.dir/build'. make[2]: Nothing to be done for 'doc/help/CMakeFiles/man-kdb-lsmeta.dir/build'. make[2]: Nothing to be done for 'doc/help/CMakeFiles/man-kdb-spec-mount.dir/build'. make[2]: Nothing to be done for 'doc/help/CMakeFiles/man-kdb-mount-list-all-files.dir/build'. make[2]: Nothing to be done for 'doc/help/CMakeFiles/man-kdb-info.dir/build'. make[1]: Entering directory '/tmp/B.crNwZC/BUILD/elektra-0.8.23/build' [ 0%] Built target man-elektra-spec make[1]: Leaving directory '/tmp/B.crNwZC/BUILD/elektra-0.8.23/build' make[1]: Entering directory '/tmp/B.crNwZC/BUILD/elektra-0.8.23/build' [ 0%] Built target man-elektra-values make[1]: Leaving directory '/tmp/B.crNwZC/BUILD/elektra-0.8.23/build' make[1]: Entering directory '/tmp/B.crNwZC/BUILD/elektra-0.8.23/build' [ 0%] Built target man-elektra-sync-flag make[1]: Leaving directory '/tmp/B.crNwZC/BUILD/elektra-0.8.23/build' make[1]: Entering directory '/tmp/B.crNwZC/BUILD/elektra-0.8.23/build' [ 0%] Built target man-elektra-related make[1]: Leaving directory '/tmp/B.crNwZC/BUILD/elektra-0.8.23/build' make[1]: Entering directory '/tmp/B.crNwZC/BUILD/elektra-0.8.23/build' [ 0%] Built target man-kdb-lsmeta make[1]: Leaving directory '/tmp/B.crNwZC/BUILD/elektra-0.8.23/build' make[1]: Entering directory '/tmp/B.crNwZC/BUILD/elektra-0.8.23/build' [ 0%] Built target man-kdb-mount-list-all-files make[1]: Leaving directory '/tmp/B.crNwZC/BUILD/elektra-0.8.23/build' make[1]: Entering directory '/tmp/B.crNwZC/BUILD/elektra-0.8.23/build' [ 0%] Built target man-kdb-info make[1]: Leaving directory '/tmp/B.crNwZC/BUILD/elektra-0.8.23/build' /usr/bin/make -f doc/help/CMakeFiles/man-kdb-list-tools.dir/build.make doc/help/CMakeFiles/man-kdb-list-tools.dir/depend /usr/bin/make -f doc/help/CMakeFiles/man-kdb-import.dir/build.make doc/help/CMakeFiles/man-kdb-import.dir/depend /usr/bin/make -f doc/help/CMakeFiles/man-kdb-help.dir/build.make doc/help/CMakeFiles/man-kdb-help.dir/depend /usr/bin/make -f doc/help/CMakeFiles/man-kdb-mv.dir/build.make doc/help/CMakeFiles/man-kdb-mv.dir/depend /usr/bin/make -f doc/help/CMakeFiles/man-kdb-shell.dir/build.make doc/help/CMakeFiles/man-kdb-shell.dir/depend /usr/bin/make -f doc/help/CMakeFiles/man-kdb-merge.dir/build.make doc/help/CMakeFiles/man-kdb-merge.dir/depend make[1]: Entering directory '/tmp/B.crNwZC/BUILD/elektra-0.8.23/build' [ 0%] Built target man-kdb-spec-mount make[1]: Leaving directory '/tmp/B.crNwZC/BUILD/elektra-0.8.23/build' /usr/bin/make -f doc/help/CMakeFiles/man-elektra-mounting.dir/build.make doc/help/CMakeFiles/man-elektra-mounting.dir/depend /usr/bin/make -f doc/help/CMakeFiles/man-kdb-global-mount.dir/build.make doc/help/CMakeFiles/man-kdb-global-mount.dir/depend make[2]: Entering directory '/tmp/B.crNwZC/BUILD/elektra-0.8.23/build' cd /tmp/B.crNwZC/BUILD/elektra-0.8.23/build && /usr/bin/cmake -E cmake_depends "Unix Makefiles" /tmp/B.crNwZC/BUILD/elektra-0.8.23 /tmp/B.crNwZC/BUILD/elektra-0.8.23/doc/help /tmp/B.crNwZC/BUILD/elektra-0.8.23/build /tmp/B.crNwZC/BUILD/elektra-0.8.23/build/doc/help /tmp/B.crNwZC/BUILD/elektra-0.8.23/build/doc/help/CMakeFiles/man-kdb-merge.dir/DependInfo.cmake --color= Scanning dependencies of target man-kdb-merge make[2]: Leaving directory '/tmp/B.crNwZC/BUILD/elektra-0.8.23/build' make[2]: Entering directory '/tmp/B.crNwZC/BUILD/elektra-0.8.23/build' cd /tmp/B.crNwZC/BUILD/elektra-0.8.23/build && /usr/bin/cmake -E cmake_depends "Unix Makefiles" /tmp/B.crNwZC/BUILD/elektra-0.8.23 /tmp/B.crNwZC/BUILD/elektra-0.8.23/doc/help /tmp/B.crNwZC/BUILD/elektra-0.8.23/build /tmp/B.crNwZC/BUILD/elektra-0.8.23/build/doc/help /tmp/B.crNwZC/BUILD/elektra-0.8.23/build/doc/help/CMakeFiles/man-kdb-import.dir/DependInfo.cmake --color= Scanning dependencies of target man-kdb-import make[2]: Leaving directory '/tmp/B.crNwZC/BUILD/elektra-0.8.23/build' make[2]: Entering directory '/tmp/B.crNwZC/BUILD/elektra-0.8.23/build' cd /tmp/B.crNwZC/BUILD/elektra-0.8.23/build && /usr/bin/cmake -E cmake_depends "Unix Makefiles" /tmp/B.crNwZC/BUILD/elektra-0.8.23 /tmp/B.crNwZC/BUILD/elektra-0.8.23/doc/help /tmp/B.crNwZC/BUILD/elektra-0.8.23/build /tmp/B.crNwZC/BUILD/elektra-0.8.23/build/doc/help /tmp/B.crNwZC/BUILD/elektra-0.8.23/build/doc/help/CMakeFiles/man-kdb-help.dir/DependInfo.cmake --color= Scanning dependencies of target man-kdb-help make[2]: Leaving directory '/tmp/B.crNwZC/BUILD/elektra-0.8.23/build' make[2]: Entering directory '/tmp/B.crNwZC/BUILD/elektra-0.8.23/build' cd /tmp/B.crNwZC/BUILD/elektra-0.8.23/build && /usr/bin/cmake -E cmake_depends "Unix Makefiles" /tmp/B.crNwZC/BUILD/elektra-0.8.23 /tmp/B.crNwZC/BUILD/elektra-0.8.23/doc/help /tmp/B.crNwZC/BUILD/elektra-0.8.23/build /tmp/B.crNwZC/BUILD/elektra-0.8.23/build/doc/help /tmp/B.crNwZC/BUILD/elektra-0.8.23/build/doc/help/CMakeFiles/man-elektra-mounting.dir/DependInfo.cmake --color= Scanning dependencies of target man-elektra-mounting make[2]: Leaving directory '/tmp/B.crNwZC/BUILD/elektra-0.8.23/build' make[2]: Entering directory '/tmp/B.crNwZC/BUILD/elektra-0.8.23/build' cd /tmp/B.crNwZC/BUILD/elektra-0.8.23/build && /usr/bin/cmake -E cmake_depends "Unix Makefiles" /tmp/B.crNwZC/BUILD/elektra-0.8.23 /tmp/B.crNwZC/BUILD/elektra-0.8.23/doc/help /tmp/B.crNwZC/BUILD/elektra-0.8.23/build /tmp/B.crNwZC/BUILD/elektra-0.8.23/build/doc/help /tmp/B.crNwZC/BUILD/elektra-0.8.23/build/doc/help/CMakeFiles/man-kdb-mv.dir/DependInfo.cmake --color= Scanning dependencies of target man-kdb-mv make[2]: Leaving directory '/tmp/B.crNwZC/BUILD/elektra-0.8.23/build' make[2]: Entering directory '/tmp/B.crNwZC/BUILD/elektra-0.8.23/build' cd /tmp/B.crNwZC/BUILD/elektra-0.8.23/build && /usr/bin/cmake -E cmake_depends "Unix Makefiles" /tmp/B.crNwZC/BUILD/elektra-0.8.23 /tmp/B.crNwZC/BUILD/elektra-0.8.23/doc/help /tmp/B.crNwZC/BUILD/elektra-0.8.23/build /tmp/B.crNwZC/BUILD/elektra-0.8.23/build/doc/help /tmp/B.crNwZC/BUILD/elektra-0.8.23/build/doc/help/CMakeFiles/man-kdb-list-tools.dir/DependInfo.cmake --color= Scanning dependencies of target man-kdb-list-tools make[2]: Leaving directory '/tmp/B.crNwZC/BUILD/elektra-0.8.23/build' make[2]: Entering directory '/tmp/B.crNwZC/BUILD/elektra-0.8.23/build' cd /tmp/B.crNwZC/BUILD/elektra-0.8.23/build && /usr/bin/cmake -E cmake_depends "Unix Makefiles" /tmp/B.crNwZC/BUILD/elektra-0.8.23 /tmp/B.crNwZC/BUILD/elektra-0.8.23/doc/help /tmp/B.crNwZC/BUILD/elektra-0.8.23/build /tmp/B.crNwZC/BUILD/elektra-0.8.23/build/doc/help /tmp/B.crNwZC/BUILD/elektra-0.8.23/build/doc/help/CMakeFiles/man-kdb-shell.dir/DependInfo.cmake --color= Scanning dependencies of target man-kdb-shell make[2]: Leaving directory '/tmp/B.crNwZC/BUILD/elektra-0.8.23/build' /usr/bin/make -f doc/help/CMakeFiles/man-kdb-import.dir/build.make doc/help/CMakeFiles/man-kdb-import.dir/build /usr/bin/make -f doc/help/CMakeFiles/man-kdb-help.dir/build.make doc/help/CMakeFiles/man-kdb-help.dir/build /usr/bin/make -f doc/help/CMakeFiles/man-kdb-shell.dir/build.make doc/help/CMakeFiles/man-kdb-shell.dir/build /usr/bin/make -f doc/help/CMakeFiles/man-kdb-list-tools.dir/build.make doc/help/CMakeFiles/man-kdb-list-tools.dir/build /usr/bin/make -f doc/help/CMakeFiles/man-kdb-mv.dir/build.make doc/help/CMakeFiles/man-kdb-mv.dir/build /usr/bin/make -f doc/help/CMakeFiles/man-kdb-merge.dir/build.make doc/help/CMakeFiles/man-kdb-merge.dir/build /usr/bin/make -f doc/help/CMakeFiles/man-elektra-mounting.dir/build.make doc/help/CMakeFiles/man-elektra-mounting.dir/build make[2]: Nothing to be done for 'doc/help/CMakeFiles/man-kdb-help.dir/build'. make[2]: Nothing to be done for 'doc/help/CMakeFiles/man-kdb-import.dir/build'. make[2]: Nothing to be done for 'doc/help/CMakeFiles/man-kdb-shell.dir/build'. make[2]: Nothing to be done for 'doc/help/CMakeFiles/man-kdb-list-tools.dir/build'. make[2]: Nothing to be done for 'doc/help/CMakeFiles/man-kdb-merge.dir/build'. make[2]: Nothing to be done for 'doc/help/CMakeFiles/man-kdb-mv.dir/build'. make[2]: Nothing to be done for 'doc/help/CMakeFiles/man-elektra-mounting.dir/build'. make[2]: Entering directory '/tmp/B.crNwZC/BUILD/elektra-0.8.23/build' cd /tmp/B.crNwZC/BUILD/elektra-0.8.23/build && /usr/bin/cmake -E cmake_depends "Unix Makefiles" /tmp/B.crNwZC/BUILD/elektra-0.8.23 /tmp/B.crNwZC/BUILD/elektra-0.8.23/doc/help /tmp/B.crNwZC/BUILD/elektra-0.8.23/build /tmp/B.crNwZC/BUILD/elektra-0.8.23/build/doc/help /tmp/B.crNwZC/BUILD/elektra-0.8.23/build/doc/help/CMakeFiles/man-kdb-global-mount.dir/DependInfo.cmake --color= Scanning dependencies of target man-kdb-global-mount make[2]: Leaving directory '/tmp/B.crNwZC/BUILD/elektra-0.8.23/build' /usr/bin/make -f doc/help/CMakeFiles/man-kdb-global-mount.dir/build.make doc/help/CMakeFiles/man-kdb-global-mount.dir/build make[1]: Entering directory '/tmp/B.crNwZC/BUILD/elektra-0.8.23/build' [ 0%] Built target man-kdb-help make[1]: Leaving directory '/tmp/B.crNwZC/BUILD/elektra-0.8.23/build' make[1]: Entering directory '/tmp/B.crNwZC/BUILD/elektra-0.8.23/build' [ 0%] Built target man-kdb-import make[1]: Leaving directory '/tmp/B.crNwZC/BUILD/elektra-0.8.23/build' make[1]: Entering directory '/tmp/B.crNwZC/BUILD/elektra-0.8.23/build' [ 0%] Built target man-kdb-list-tools make[1]: Leaving directory '/tmp/B.crNwZC/BUILD/elektra-0.8.23/build' make[1]: Entering directory '/tmp/B.crNwZC/BUILD/elektra-0.8.23/build' [ 0%] Built target man-kdb-shell make[1]: Leaving directory '/tmp/B.crNwZC/BUILD/elektra-0.8.23/build' make[1]: Entering directory '/tmp/B.crNwZC/BUILD/elektra-0.8.23/build' [ 0%] Built target man-kdb-mv make[1]: Leaving directory '/tmp/B.crNwZC/BUILD/elektra-0.8.23/build' make[1]: Entering directory '/tmp/B.crNwZC/BUILD/elektra-0.8.23/build' [ 0%] Built target man-kdb-merge make[1]: Leaving directory '/tmp/B.crNwZC/BUILD/elektra-0.8.23/build' /usr/bin/make -f doc/help/CMakeFiles/man-kdb-rm.dir/build.make doc/help/CMakeFiles/man-kdb-rm.dir/depend /usr/bin/make -f doc/help/CMakeFiles/man-kdb-introduction.dir/build.make doc/help/CMakeFiles/man-kdb-introduction.dir/depend /usr/bin/make -f doc/help/CMakeFiles/man-kdb-mount.dir/build.make doc/help/CMakeFiles/man-kdb-mount.dir/depend make[1]: Entering directory '/tmp/B.crNwZC/BUILD/elektra-0.8.23/build' [ 0%] Built target man-elektra-mounting make[1]: Leaving directory '/tmp/B.crNwZC/BUILD/elektra-0.8.23/build' /usr/bin/make -f doc/help/CMakeFiles/man-kdb-stash.dir/build.make doc/help/CMakeFiles/man-kdb-stash.dir/depend /usr/bin/make -f doc/help/CMakeFiles/man-kdb-vset.dir/build.make doc/help/CMakeFiles/man-kdb-vset.dir/depend /usr/bin/make -f doc/help/CMakeFiles/man-elektra-granularity.dir/build.make doc/help/CMakeFiles/man-elektra-granularity.dir/depend /usr/bin/make -f doc/help/CMakeFiles/man-kdb-list-commands.dir/build.make doc/help/CMakeFiles/man-kdb-list-commands.dir/depend make[2]: Nothing to be done for 'doc/help/CMakeFiles/man-kdb-global-mount.dir/build'. make[2]: Entering directory '/tmp/B.crNwZC/BUILD/elektra-0.8.23/build' cd /tmp/B.crNwZC/BUILD/elektra-0.8.23/build && /usr/bin/cmake -E cmake_depends "Unix Makefiles" /tmp/B.crNwZC/BUILD/elektra-0.8.23 /tmp/B.crNwZC/BUILD/elektra-0.8.23/doc/help /tmp/B.crNwZC/BUILD/elektra-0.8.23/build /tmp/B.crNwZC/BUILD/elektra-0.8.23/build/doc/help /tmp/B.crNwZC/BUILD/elektra-0.8.23/build/doc/help/CMakeFiles/man-kdb-stash.dir/DependInfo.cmake --color= Scanning dependencies of target man-kdb-stash make[2]: Leaving directory '/tmp/B.crNwZC/BUILD/elektra-0.8.23/build' make[2]: Entering directory '/tmp/B.crNwZC/BUILD/elektra-0.8.23/build' cd /tmp/B.crNwZC/BUILD/elektra-0.8.23/build && /usr/bin/cmake -E cmake_depends "Unix Makefiles" /tmp/B.crNwZC/BUILD/elektra-0.8.23 /tmp/B.crNwZC/BUILD/elektra-0.8.23/doc/help /tmp/B.crNwZC/BUILD/elektra-0.8.23/build /tmp/B.crNwZC/BUILD/elektra-0.8.23/build/doc/help /tmp/B.crNwZC/BUILD/elektra-0.8.23/build/doc/help/CMakeFiles/man-kdb-introduction.dir/DependInfo.cmake --color= Scanning dependencies of target man-kdb-introduction make[2]: Leaving directory '/tmp/B.crNwZC/BUILD/elektra-0.8.23/build' make[2]: Entering directory '/tmp/B.crNwZC/BUILD/elektra-0.8.23/build' cd /tmp/B.crNwZC/BUILD/elektra-0.8.23/build && /usr/bin/cmake -E cmake_depends "Unix Makefiles" /tmp/B.crNwZC/BUILD/elektra-0.8.23 /tmp/B.crNwZC/BUILD/elektra-0.8.23/doc/help /tmp/B.crNwZC/BUILD/elektra-0.8.23/build /tmp/B.crNwZC/BUILD/elektra-0.8.23/build/doc/help /tmp/B.crNwZC/BUILD/elektra-0.8.23/build/doc/help/CMakeFiles/man-elektra-granularity.dir/DependInfo.cmake --color= Scanning dependencies of target man-elektra-granularity make[2]: Leaving directory '/tmp/B.crNwZC/BUILD/elektra-0.8.23/build' /usr/bin/make -f doc/help/CMakeFiles/man-kdb-stash.dir/build.make doc/help/CMakeFiles/man-kdb-stash.dir/build make[2]: Entering directory '/tmp/B.crNwZC/BUILD/elektra-0.8.23/build' cd /tmp/B.crNwZC/BUILD/elektra-0.8.23/build && /usr/bin/cmake -E cmake_depends "Unix Makefiles" /tmp/B.crNwZC/BUILD/elektra-0.8.23 /tmp/B.crNwZC/BUILD/elektra-0.8.23/doc/help /tmp/B.crNwZC/BUILD/elektra-0.8.23/build /tmp/B.crNwZC/BUILD/elektra-0.8.23/build/doc/help /tmp/B.crNwZC/BUILD/elektra-0.8.23/build/doc/help/CMakeFiles/man-kdb-mount.dir/DependInfo.cmake --color= Scanning dependencies of target man-kdb-mount make[2]: Leaving directory '/tmp/B.crNwZC/BUILD/elektra-0.8.23/build' /usr/bin/make -f doc/help/CMakeFiles/man-kdb-introduction.dir/build.make doc/help/CMakeFiles/man-kdb-introduction.dir/build make[2]: Entering directory '/tmp/B.crNwZC/BUILD/elektra-0.8.23/build' cd /tmp/B.crNwZC/BUILD/elektra-0.8.23/build && /usr/bin/cmake -E cmake_depends "Unix Makefiles" /tmp/B.crNwZC/BUILD/elektra-0.8.23 /tmp/B.crNwZC/BUILD/elektra-0.8.23/doc/help /tmp/B.crNwZC/BUILD/elektra-0.8.23/build /tmp/B.crNwZC/BUILD/elektra-0.8.23/build/doc/help /tmp/B.crNwZC/BUILD/elektra-0.8.23/build/doc/help/CMakeFiles/man-kdb-vset.dir/DependInfo.cmake --color= Scanning dependencies of target man-kdb-vset make[2]: Leaving directory '/tmp/B.crNwZC/BUILD/elektra-0.8.23/build' /usr/bin/make -f doc/help/CMakeFiles/man-elektra-granularity.dir/build.make doc/help/CMakeFiles/man-elektra-granularity.dir/build make[1]: Entering directory '/tmp/B.crNwZC/BUILD/elektra-0.8.23/build' [ 1%] Built target man-kdb-global-mount make[1]: Leaving directory '/tmp/B.crNwZC/BUILD/elektra-0.8.23/build' /usr/bin/make -f doc/help/CMakeFiles/man-kdb-mount.dir/build.make doc/help/CMakeFiles/man-kdb-mount.dir/build /usr/bin/make -f doc/help/CMakeFiles/man-kdb-vset.dir/build.make doc/help/CMakeFiles/man-kdb-vset.dir/build /usr/bin/make -f doc/help/CMakeFiles/man-kdb-check.dir/build.make doc/help/CMakeFiles/man-kdb-check.dir/depend make[2]: Nothing to be done for 'doc/help/CMakeFiles/man-kdb-stash.dir/build'. make[2]: Nothing to be done for 'doc/help/CMakeFiles/man-kdb-introduction.dir/build'. make[2]: Nothing to be done for 'doc/help/CMakeFiles/man-elektra-granularity.dir/build'. make[2]: Nothing to be done for 'doc/help/CMakeFiles/man-kdb-vset.dir/build'. make[2]: Nothing to be done for 'doc/help/CMakeFiles/man-kdb-mount.dir/build'. make[2]: Entering directory '/tmp/B.crNwZC/BUILD/elektra-0.8.23/build' cd /tmp/B.crNwZC/BUILD/elektra-0.8.23/build && /usr/bin/cmake -E cmake_depends "Unix Makefiles" /tmp/B.crNwZC/BUILD/elektra-0.8.23 /tmp/B.crNwZC/BUILD/elektra-0.8.23/doc/help /tmp/B.crNwZC/BUILD/elektra-0.8.23/build /tmp/B.crNwZC/BUILD/elektra-0.8.23/build/doc/help /tmp/B.crNwZC/BUILD/elektra-0.8.23/build/doc/help/CMakeFiles/man-kdb-list-commands.dir/DependInfo.cmake --color= Scanning dependencies of target man-kdb-list-commands make[2]: Leaving directory '/tmp/B.crNwZC/BUILD/elektra-0.8.23/build' make[2]: Entering directory '/tmp/B.crNwZC/BUILD/elektra-0.8.23/build' cd /tmp/B.crNwZC/BUILD/elektra-0.8.23/build && /usr/bin/cmake -E cmake_depends "Unix Makefiles" /tmp/B.crNwZC/BUILD/elektra-0.8.23 /tmp/B.crNwZC/BUILD/elektra-0.8.23/doc/help /tmp/B.crNwZC/BUILD/elektra-0.8.23/build /tmp/B.crNwZC/BUILD/elektra-0.8.23/build/doc/help /tmp/B.crNwZC/BUILD/elektra-0.8.23/build/doc/help/CMakeFiles/man-kdb-rm.dir/DependInfo.cmake --color= Scanning dependencies of target man-kdb-rm make[2]: Leaving directory '/tmp/B.crNwZC/BUILD/elektra-0.8.23/build' /usr/bin/make -f doc/help/CMakeFiles/man-kdb-rm.dir/build.make doc/help/CMakeFiles/man-kdb-rm.dir/build /usr/bin/make -f doc/help/CMakeFiles/man-kdb-list-commands.dir/build.make doc/help/CMakeFiles/man-kdb-list-commands.dir/build make[2]: Nothing to be done for 'doc/help/CMakeFiles/man-kdb-rm.dir/build'. make[1]: Entering directory '/tmp/B.crNwZC/BUILD/elektra-0.8.23/build' [ 1%] Built target man-kdb-stash make[1]: Leaving directory '/tmp/B.crNwZC/BUILD/elektra-0.8.23/build' /usr/bin/make -f doc/help/CMakeFiles/man-kdb-file.dir/build.make doc/help/CMakeFiles/man-kdb-file.dir/depend make[1]: Entering directory '/tmp/B.crNwZC/BUILD/elektra-0.8.23/build' [ 1%] Built target man-kdb-introduction make[1]: Leaving directory '/tmp/B.crNwZC/BUILD/elektra-0.8.23/build' make[2]: Entering directory '/tmp/B.crNwZC/BUILD/elektra-0.8.23/build' cd /tmp/B.crNwZC/BUILD/elektra-0.8.23/build && /usr/bin/cmake -E cmake_depends "Unix Makefiles" /tmp/B.crNwZC/BUILD/elektra-0.8.23 /tmp/B.crNwZC/BUILD/elektra-0.8.23/doc/help /tmp/B.crNwZC/BUILD/elektra-0.8.23/build /tmp/B.crNwZC/BUILD/elektra-0.8.23/build/doc/help /tmp/B.crNwZC/BUILD/elektra-0.8.23/build/doc/help/CMakeFiles/man-kdb-check.dir/DependInfo.cmake --color= Scanning dependencies of target man-kdb-check make[2]: Leaving directory '/tmp/B.crNwZC/BUILD/elektra-0.8.23/build' /usr/bin/make -f doc/help/CMakeFiles/man-elektra-glossary.dir/build.make doc/help/CMakeFiles/man-elektra-glossary.dir/depend make[1]: Entering directory '/tmp/B.crNwZC/BUILD/elektra-0.8.23/build' [ 2%] Built target man-elektra-granularity make[1]: Leaving directory '/tmp/B.crNwZC/BUILD/elektra-0.8.23/build' /usr/bin/make -f doc/help/CMakeFiles/man-kdb-check.dir/build.make doc/help/CMakeFiles/man-kdb-check.dir/build make[1]: Entering directory '/tmp/B.crNwZC/BUILD/elektra-0.8.23/build' [ 3%] Built target man-kdb-mount make[1]: Leaving directory '/tmp/B.crNwZC/BUILD/elektra-0.8.23/build' make[2]: Nothing to be done for 'doc/help/CMakeFiles/man-kdb-list-commands.dir/build'. make[1]: Entering directory '/tmp/B.crNwZC/BUILD/elektra-0.8.23/build' [ 3%] Built target man-kdb-vset make[1]: Leaving directory '/tmp/B.crNwZC/BUILD/elektra-0.8.23/build' /usr/bin/make -f doc/help/CMakeFiles/man-kdb-get.dir/build.make doc/help/CMakeFiles/man-kdb-get.dir/depend /usr/bin/make -f doc/help/CMakeFiles/man-kdb-ls.dir/build.make doc/help/CMakeFiles/man-kdb-ls.dir/depend /usr/bin/make -f doc/help/CMakeFiles/man-kdb-editor.dir/build.make doc/help/CMakeFiles/man-kdb-editor.dir/depend make[1]: Entering directory '/tmp/B.crNwZC/BUILD/elektra-0.8.23/build' [ 3%] Built target man-kdb-rm make[1]: Leaving directory '/tmp/B.crNwZC/BUILD/elektra-0.8.23/build' make[2]: Nothing to be done for 'doc/help/CMakeFiles/man-kdb-check.dir/build'. /usr/bin/make -f doc/help/CMakeFiles/man-kdb-set.dir/build.make doc/help/CMakeFiles/man-kdb-set.dir/depend make[1]: Entering directory '/tmp/B.crNwZC/BUILD/elektra-0.8.23/build' [ 3%] Built target man-kdb-list-commands make[1]: Leaving directory '/tmp/B.crNwZC/BUILD/elektra-0.8.23/build' /usr/bin/make -f doc/help/CMakeFiles/man-kdb-check-env-dep.dir/build.make doc/help/CMakeFiles/man-kdb-check-env-dep.dir/depend make[2]: Entering directory '/tmp/B.crNwZC/BUILD/elektra-0.8.23/build' cd /tmp/B.crNwZC/BUILD/elektra-0.8.23/build && /usr/bin/cmake -E cmake_depends "Unix Makefiles" /tmp/B.crNwZC/BUILD/elektra-0.8.23 /tmp/B.crNwZC/BUILD/elektra-0.8.23/doc/help /tmp/B.crNwZC/BUILD/elektra-0.8.23/build /tmp/B.crNwZC/BUILD/elektra-0.8.23/build/doc/help /tmp/B.crNwZC/BUILD/elektra-0.8.23/build/doc/help/CMakeFiles/man-elektra-glossary.dir/DependInfo.cmake --color= Scanning dependencies of target man-elektra-glossary make[2]: Leaving directory '/tmp/B.crNwZC/BUILD/elektra-0.8.23/build' make[2]: Entering directory '/tmp/B.crNwZC/BUILD/elektra-0.8.23/build' cd /tmp/B.crNwZC/BUILD/elektra-0.8.23/build && /usr/bin/cmake -E cmake_depends "Unix Makefiles" /tmp/B.crNwZC/BUILD/elektra-0.8.23 /tmp/B.crNwZC/BUILD/elektra-0.8.23/doc/help /tmp/B.crNwZC/BUILD/elektra-0.8.23/build /tmp/B.crNwZC/BUILD/elektra-0.8.23/build/doc/help /tmp/B.crNwZC/BUILD/elektra-0.8.23/build/doc/help/CMakeFiles/man-kdb-ls.dir/DependInfo.cmake --color= Scanning dependencies of target man-kdb-ls make[2]: Leaving directory '/tmp/B.crNwZC/BUILD/elektra-0.8.23/build' make[2]: Entering directory '/tmp/B.crNwZC/BUILD/elektra-0.8.23/build' cd /tmp/B.crNwZC/BUILD/elektra-0.8.23/build && /usr/bin/cmake -E cmake_depends "Unix Makefiles" /tmp/B.crNwZC/BUILD/elektra-0.8.23 /tmp/B.crNwZC/BUILD/elektra-0.8.23/doc/help /tmp/B.crNwZC/BUILD/elektra-0.8.23/build /tmp/B.crNwZC/BUILD/elektra-0.8.23/build/doc/help /tmp/B.crNwZC/BUILD/elektra-0.8.23/build/doc/help/CMakeFiles/man-kdb-get.dir/DependInfo.cmake --color= Scanning dependencies of target man-kdb-get make[2]: Leaving directory '/tmp/B.crNwZC/BUILD/elektra-0.8.23/build' /usr/bin/make -f doc/help/CMakeFiles/man-elektra-glossary.dir/build.make doc/help/CMakeFiles/man-elektra-glossary.dir/build /usr/bin/make -f doc/help/CMakeFiles/man-kdb-ls.dir/build.make doc/help/CMakeFiles/man-kdb-ls.dir/build /usr/bin/make -f doc/help/CMakeFiles/man-kdb-get.dir/build.make doc/help/CMakeFiles/man-kdb-get.dir/build make[1]: Entering directory '/tmp/B.crNwZC/BUILD/elektra-0.8.23/build' [ 3%] Built target man-kdb-check make[1]: Leaving directory '/tmp/B.crNwZC/BUILD/elektra-0.8.23/build' /usr/bin/make -f src/tools/qt-gui/CMakeFiles/man-kdb-qt-gui.dir/build.make src/tools/qt-gui/CMakeFiles/man-kdb-qt-gui.dir/depend make[2]: Entering directory '/tmp/B.crNwZC/BUILD/elektra-0.8.23/build' cd /tmp/B.crNwZC/BUILD/elektra-0.8.23/build && /usr/bin/cmake -E cmake_depends "Unix Makefiles" /tmp/B.crNwZC/BUILD/elektra-0.8.23 /tmp/B.crNwZC/BUILD/elektra-0.8.23/doc/help /tmp/B.crNwZC/BUILD/elektra-0.8.23/build /tmp/B.crNwZC/BUILD/elektra-0.8.23/build/doc/help /tmp/B.crNwZC/BUILD/elektra-0.8.23/build/doc/help/CMakeFiles/man-kdb-set.dir/DependInfo.cmake --color= Scanning dependencies of target man-kdb-set make[2]: Leaving directory '/tmp/B.crNwZC/BUILD/elektra-0.8.23/build' make[2]: Entering directory '/tmp/B.crNwZC/BUILD/elektra-0.8.23/build' cd /tmp/B.crNwZC/BUILD/elektra-0.8.23/build && /usr/bin/cmake -E cmake_depends "Unix Makefiles" /tmp/B.crNwZC/BUILD/elektra-0.8.23 /tmp/B.crNwZC/BUILD/elektra-0.8.23/doc/help /tmp/B.crNwZC/BUILD/elektra-0.8.23/build /tmp/B.crNwZC/BUILD/elektra-0.8.23/build/doc/help /tmp/B.crNwZC/BUILD/elektra-0.8.23/build/doc/help/CMakeFiles/man-kdb-editor.dir/DependInfo.cmake --color= Scanning dependencies of target man-kdb-editor make[2]: Leaving directory '/tmp/B.crNwZC/BUILD/elektra-0.8.23/build' make[2]: Nothing to be done for 'doc/help/CMakeFiles/man-elektra-glossary.dir/build'. make[2]: Nothing to be done for 'doc/help/CMakeFiles/man-kdb-ls.dir/build'. make[2]: Nothing to be done for 'doc/help/CMakeFiles/man-kdb-get.dir/build'. /usr/bin/make -f doc/help/CMakeFiles/man-kdb-editor.dir/build.make doc/help/CMakeFiles/man-kdb-editor.dir/build /usr/bin/make -f doc/help/CMakeFiles/man-kdb-set.dir/build.make doc/help/CMakeFiles/man-kdb-set.dir/build make[2]: Entering directory '/tmp/B.crNwZC/BUILD/elektra-0.8.23/build' cd /tmp/B.crNwZC/BUILD/elektra-0.8.23/build && /usr/bin/cmake -E cmake_depends "Unix Makefiles" /tmp/B.crNwZC/BUILD/elektra-0.8.23 /tmp/B.crNwZC/BUILD/elektra-0.8.23/doc/help /tmp/B.crNwZC/BUILD/elektra-0.8.23/build /tmp/B.crNwZC/BUILD/elektra-0.8.23/build/doc/help /tmp/B.crNwZC/BUILD/elektra-0.8.23/build/doc/help/CMakeFiles/man-kdb-file.dir/DependInfo.cmake --color= Scanning dependencies of target man-kdb-file make[2]: Leaving directory '/tmp/B.crNwZC/BUILD/elektra-0.8.23/build' make[2]: Nothing to be done for 'doc/help/CMakeFiles/man-kdb-editor.dir/build'. make[2]: Nothing to be done for 'doc/help/CMakeFiles/man-kdb-set.dir/build'. /usr/bin/make -f doc/help/CMakeFiles/man-kdb-file.dir/build.make doc/help/CMakeFiles/man-kdb-file.dir/build make[2]: Nothing to be done for 'doc/help/CMakeFiles/man-kdb-file.dir/build'. make[2]: Entering directory '/tmp/B.crNwZC/BUILD/elektra-0.8.23/build' cd /tmp/B.crNwZC/BUILD/elektra-0.8.23/build && /usr/bin/cmake -E cmake_depends "Unix Makefiles" /tmp/B.crNwZC/BUILD/elektra-0.8.23 /tmp/B.crNwZC/BUILD/elektra-0.8.23/doc/help /tmp/B.crNwZC/BUILD/elektra-0.8.23/build /tmp/B.crNwZC/BUILD/elektra-0.8.23/build/doc/help /tmp/B.crNwZC/BUILD/elektra-0.8.23/build/doc/help/CMakeFiles/man-kdb-check-env-dep.dir/DependInfo.cmake --color= Scanning dependencies of target man-kdb-check-env-dep make[2]: Leaving directory '/tmp/B.crNwZC/BUILD/elektra-0.8.23/build' make[1]: Entering directory '/tmp/B.crNwZC/BUILD/elektra-0.8.23/build' [ 3%] Built target man-kdb-ls make[1]: Leaving directory '/tmp/B.crNwZC/BUILD/elektra-0.8.23/build' make[1]: Entering directory '/tmp/B.crNwZC/BUILD/elektra-0.8.23/build' [ 3%] Built target man-kdb-get make[1]: Leaving directory '/tmp/B.crNwZC/BUILD/elektra-0.8.23/build' /usr/bin/make -f doc/help/CMakeFiles/man-kdb-check-env-dep.dir/build.make doc/help/CMakeFiles/man-kdb-check-env-dep.dir/build /usr/bin/make -f doc/help/CMakeFiles/man-kdb-cp.dir/build.make doc/help/CMakeFiles/man-kdb-cp.dir/depend /usr/bin/make -f doc/help/CMakeFiles/man-kdb-change-resolver-symlink.dir/build.make doc/help/CMakeFiles/man-kdb-change-resolver-symlink.dir/depend make[2]: Entering directory '/tmp/B.crNwZC/BUILD/elektra-0.8.23/build' cd /tmp/B.crNwZC/BUILD/elektra-0.8.23/build && /usr/bin/cmake -E cmake_depends "Unix Makefiles" /tmp/B.crNwZC/BUILD/elektra-0.8.23 /tmp/B.crNwZC/BUILD/elektra-0.8.23/src/tools/qt-gui /tmp/B.crNwZC/BUILD/elektra-0.8.23/build /tmp/B.crNwZC/BUILD/elektra-0.8.23/build/src/tools/qt-gui /tmp/B.crNwZC/BUILD/elektra-0.8.23/build/src/tools/qt-gui/CMakeFiles/man-kdb-qt-gui.dir/DependInfo.cmake --color= Scanning dependencies of target man-kdb-qt-gui make[2]: Leaving directory '/tmp/B.crNwZC/BUILD/elektra-0.8.23/build' make[1]: Entering directory '/tmp/B.crNwZC/BUILD/elektra-0.8.23/build' [ 3%] Built target man-elektra-glossary make[1]: Leaving directory '/tmp/B.crNwZC/BUILD/elektra-0.8.23/build' /usr/bin/make -f src/tools/qt-gui/CMakeFiles/man-kdb-qt-gui.dir/build.make src/tools/qt-gui/CMakeFiles/man-kdb-qt-gui.dir/build make[1]: Entering directory '/tmp/B.crNwZC/BUILD/elektra-0.8.23/build' [ 3%] Built target man-kdb-editor make[1]: Leaving directory '/tmp/B.crNwZC/BUILD/elektra-0.8.23/build' make[2]: Nothing to be done for 'doc/help/CMakeFiles/man-kdb-check-env-dep.dir/build'. /usr/bin/make -f doc/help/CMakeFiles/man-kdb-complete.dir/build.make doc/help/CMakeFiles/man-kdb-complete.dir/depend /usr/bin/make -f doc/help/CMakeFiles/man-kdb-backup.dir/build.make doc/help/CMakeFiles/man-kdb-backup.dir/depend make[1]: Entering directory '/tmp/B.crNwZC/BUILD/elektra-0.8.23/build' [ 3%] Built target man-kdb-set make[1]: Leaving directory '/tmp/B.crNwZC/BUILD/elektra-0.8.23/build' /usr/bin/make -f doc/help/CMakeFiles/man-kdb-test.dir/build.make doc/help/CMakeFiles/man-kdb-test.dir/depend make[2]: Nothing to be done for 'src/tools/qt-gui/CMakeFiles/man-kdb-qt-gui.dir/build'. make[1]: Entering directory '/tmp/B.crNwZC/BUILD/elektra-0.8.23/build' [ 3%] Built target man-kdb-file make[1]: Leaving directory '/tmp/B.crNwZC/BUILD/elektra-0.8.23/build' /usr/bin/make -f doc/help/CMakeFiles/man-elektra-metadata.dir/build.make doc/help/CMakeFiles/man-elektra-metadata.dir/depend make[2]: Entering directory '/tmp/B.crNwZC/BUILD/elektra-0.8.23/build' cd /tmp/B.crNwZC/BUILD/elektra-0.8.23/build && /usr/bin/cmake -E cmake_depends "Unix Makefiles" /tmp/B.crNwZC/BUILD/elektra-0.8.23 /tmp/B.crNwZC/BUILD/elektra-0.8.23/doc/help /tmp/B.crNwZC/BUILD/elektra-0.8.23/build /tmp/B.crNwZC/BUILD/elektra-0.8.23/build/doc/help /tmp/B.crNwZC/BUILD/elektra-0.8.23/build/doc/help/CMakeFiles/man-kdb-cp.dir/DependInfo.cmake --color= Scanning dependencies of target man-kdb-cp make[2]: Leaving directory '/tmp/B.crNwZC/BUILD/elektra-0.8.23/build' make[2]: Entering directory '/tmp/B.crNwZC/BUILD/elektra-0.8.23/build' cd /tmp/B.crNwZC/BUILD/elektra-0.8.23/build && /usr/bin/cmake -E cmake_depends "Unix Makefiles" /tmp/B.crNwZC/BUILD/elektra-0.8.23 /tmp/B.crNwZC/BUILD/elektra-0.8.23/doc/help /tmp/B.crNwZC/BUILD/elektra-0.8.23/build /tmp/B.crNwZC/BUILD/elektra-0.8.23/build/doc/help /tmp/B.crNwZC/BUILD/elektra-0.8.23/build/doc/help/CMakeFiles/man-kdb-change-resolver-symlink.dir/DependInfo.cmake --color= Scanning dependencies of target man-kdb-change-resolver-symlink make[2]: Leaving directory '/tmp/B.crNwZC/BUILD/elektra-0.8.23/build' make[2]: Entering directory '/tmp/B.crNwZC/BUILD/elektra-0.8.23/build' cd /tmp/B.crNwZC/BUILD/elektra-0.8.23/build && /usr/bin/cmake -E cmake_depends "Unix Makefiles" /tmp/B.crNwZC/BUILD/elektra-0.8.23 /tmp/B.crNwZC/BUILD/elektra-0.8.23/doc/help /tmp/B.crNwZC/BUILD/elektra-0.8.23/build /tmp/B.crNwZC/BUILD/elektra-0.8.23/build/doc/help /tmp/B.crNwZC/BUILD/elektra-0.8.23/build/doc/help/CMakeFiles/man-kdb-complete.dir/DependInfo.cmake --color= Scanning dependencies of target man-kdb-complete make[2]: Leaving directory '/tmp/B.crNwZC/BUILD/elektra-0.8.23/build' /usr/bin/make -f doc/help/CMakeFiles/man-kdb-cp.dir/build.make doc/help/CMakeFiles/man-kdb-cp.dir/build make[2]: Entering directory '/tmp/B.crNwZC/BUILD/elektra-0.8.23/build' cd /tmp/B.crNwZC/BUILD/elektra-0.8.23/build && /usr/bin/cmake -E cmake_depends "Unix Makefiles" /tmp/B.crNwZC/BUILD/elektra-0.8.23 /tmp/B.crNwZC/BUILD/elektra-0.8.23/doc/help /tmp/B.crNwZC/BUILD/elektra-0.8.23/build /tmp/B.crNwZC/BUILD/elektra-0.8.23/build/doc/help /tmp/B.crNwZC/BUILD/elektra-0.8.23/build/doc/help/CMakeFiles/man-kdb-backup.dir/DependInfo.cmake --color= Scanning dependencies of target man-kdb-backup make[2]: Leaving directory '/tmp/B.crNwZC/BUILD/elektra-0.8.23/build' /usr/bin/make -f doc/help/CMakeFiles/man-kdb-change-resolver-symlink.dir/build.make doc/help/CMakeFiles/man-kdb-change-resolver-symlink.dir/build /usr/bin/make -f doc/help/CMakeFiles/man-kdb-complete.dir/build.make doc/help/CMakeFiles/man-kdb-complete.dir/build make[1]: Entering directory '/tmp/B.crNwZC/BUILD/elektra-0.8.23/build' [ 3%] Built target man-kdb-check-env-dep make[1]: Leaving directory '/tmp/B.crNwZC/BUILD/elektra-0.8.23/build' /usr/bin/make -f doc/help/CMakeFiles/man-kdb-backup.dir/build.make doc/help/CMakeFiles/man-kdb-backup.dir/build /usr/bin/make -f doc/help/CMakeFiles/man-elektra-semantics.dir/build.make doc/help/CMakeFiles/man-elektra-semantics.dir/depend make[2]: Nothing to be done for 'doc/help/CMakeFiles/man-kdb-cp.dir/build'. make[2]: Nothing to be done for 'doc/help/CMakeFiles/man-kdb-change-resolver-symlink.dir/build'. make[2]: Nothing to be done for 'doc/help/CMakeFiles/man-kdb-complete.dir/build'. make[2]: Nothing to be done for 'doc/help/CMakeFiles/man-kdb-backup.dir/build'. make[1]: Entering directory '/tmp/B.crNwZC/BUILD/elektra-0.8.23/build' [ 3%] Built target man-kdb-qt-gui make[1]: Leaving directory '/tmp/B.crNwZC/BUILD/elektra-0.8.23/build' /usr/bin/make -f doc/help/CMakeFiles/man-kdb-export.dir/build.make doc/help/CMakeFiles/man-kdb-export.dir/depend make[2]: Entering directory '/tmp/B.crNwZC/BUILD/elektra-0.8.23/build' cd /tmp/B.crNwZC/BUILD/elektra-0.8.23/build && /usr/bin/cmake -E cmake_depends "Unix Makefiles" /tmp/B.crNwZC/BUILD/elektra-0.8.23 /tmp/B.crNwZC/BUILD/elektra-0.8.23/doc/help /tmp/B.crNwZC/BUILD/elektra-0.8.23/build /tmp/B.crNwZC/BUILD/elektra-0.8.23/build/doc/help /tmp/B.crNwZC/BUILD/elektra-0.8.23/build/doc/help/CMakeFiles/man-kdb-test.dir/DependInfo.cmake --color= Scanning dependencies of target man-kdb-test make[2]: Leaving directory '/tmp/B.crNwZC/BUILD/elektra-0.8.23/build' make[2]: Entering directory '/tmp/B.crNwZC/BUILD/elektra-0.8.23/build' cd /tmp/B.crNwZC/BUILD/elektra-0.8.23/build && /usr/bin/cmake -E cmake_depends "Unix Makefiles" /tmp/B.crNwZC/BUILD/elektra-0.8.23 /tmp/B.crNwZC/BUILD/elektra-0.8.23/doc/help /tmp/B.crNwZC/BUILD/elektra-0.8.23/build /tmp/B.crNwZC/BUILD/elektra-0.8.23/build/doc/help /tmp/B.crNwZC/BUILD/elektra-0.8.23/build/doc/help/CMakeFiles/man-elektra-metadata.dir/DependInfo.cmake --color= Scanning dependencies of target man-elektra-metadata make[2]: Leaving directory '/tmp/B.crNwZC/BUILD/elektra-0.8.23/build' /usr/bin/make -f doc/help/CMakeFiles/man-kdb-test.dir/build.make doc/help/CMakeFiles/man-kdb-test.dir/build /usr/bin/make -f doc/help/CMakeFiles/man-elektra-metadata.dir/build.make doc/help/CMakeFiles/man-elektra-metadata.dir/build make[1]: Entering directory '/tmp/B.crNwZC/BUILD/elektra-0.8.23/build' [ 3%] Built target man-kdb-cp make[1]: Leaving directory '/tmp/B.crNwZC/BUILD/elektra-0.8.23/build' make[2]: Entering directory '/tmp/B.crNwZC/BUILD/elektra-0.8.23/build' cd /tmp/B.crNwZC/BUILD/elektra-0.8.23/build && /usr/bin/cmake -E cmake_depends "Unix Makefiles" /tmp/B.crNwZC/BUILD/elektra-0.8.23 /tmp/B.crNwZC/BUILD/elektra-0.8.23/doc/help /tmp/B.crNwZC/BUILD/elektra-0.8.23/build /tmp/B.crNwZC/BUILD/elektra-0.8.23/build/doc/help /tmp/B.crNwZC/BUILD/elektra-0.8.23/build/doc/help/CMakeFiles/man-elektra-semantics.dir/DependInfo.cmake --color= Scanning dependencies of target man-elektra-semantics make[2]: Leaving directory '/tmp/B.crNwZC/BUILD/elektra-0.8.23/build' make[1]: Entering directory '/tmp/B.crNwZC/BUILD/elektra-0.8.23/build' [ 3%] Built target man-kdb-change-resolver-symlink make[1]: Leaving directory '/tmp/B.crNwZC/BUILD/elektra-0.8.23/build' make[1]: Entering directory '/tmp/B.crNwZC/BUILD/elektra-0.8.23/build' [ 3%] Built target man-kdb-backup make[1]: Leaving directory '/tmp/B.crNwZC/BUILD/elektra-0.8.23/build' make[2]: Nothing to be done for 'doc/help/CMakeFiles/man-kdb-test.dir/build'. /usr/bin/make -f doc/help/CMakeFiles/man-kdb-fstab.dir/build.make doc/help/CMakeFiles/man-kdb-fstab.dir/depend make[1]: Entering directory '/tmp/B.crNwZC/BUILD/elektra-0.8.23/build' [ 3%] Built target man-kdb-complete make[1]: Leaving directory '/tmp/B.crNwZC/BUILD/elektra-0.8.23/build' /usr/bin/make -f doc/help/CMakeFiles/man-elektra-semantics.dir/build.make doc/help/CMakeFiles/man-elektra-semantics.dir/build /usr/bin/make -f doc/help/CMakeFiles/man-kdb-getmeta.dir/build.make doc/help/CMakeFiles/man-kdb-getmeta.dir/depend make[2]: Nothing to be done for 'doc/help/CMakeFiles/man-elektra-metadata.dir/build'. /usr/bin/make -f doc/help/CMakeFiles/man-kdb-rmmeta.dir/build.make doc/help/CMakeFiles/man-kdb-rmmeta.dir/depend /usr/bin/make -f doc/help/CMakeFiles/man-kdb-mountpoint-info.dir/build.make doc/help/CMakeFiles/man-kdb-mountpoint-info.dir/depend make[2]: Nothing to be done for 'doc/help/CMakeFiles/man-elektra-semantics.dir/build'. make[2]: Entering directory '/tmp/B.crNwZC/BUILD/elektra-0.8.23/build' cd /tmp/B.crNwZC/BUILD/elektra-0.8.23/build && /usr/bin/cmake -E cmake_depends "Unix Makefiles" /tmp/B.crNwZC/BUILD/elektra-0.8.23 /tmp/B.crNwZC/BUILD/elektra-0.8.23/doc/help /tmp/B.crNwZC/BUILD/elektra-0.8.23/build /tmp/B.crNwZC/BUILD/elektra-0.8.23/build/doc/help /tmp/B.crNwZC/BUILD/elektra-0.8.23/build/doc/help/CMakeFiles/man-kdb-export.dir/DependInfo.cmake --color= Scanning dependencies of target man-kdb-export make[2]: Leaving directory '/tmp/B.crNwZC/BUILD/elektra-0.8.23/build' make[1]: Entering directory '/tmp/B.crNwZC/BUILD/elektra-0.8.23/build' [ 3%] Built target man-kdb-test make[1]: Leaving directory '/tmp/B.crNwZC/BUILD/elektra-0.8.23/build' /usr/bin/make -f doc/help/CMakeFiles/man-kdb-list.dir/build.make doc/help/CMakeFiles/man-kdb-list.dir/depend /usr/bin/make -f doc/help/CMakeFiles/man-kdb-export.dir/build.make doc/help/CMakeFiles/man-kdb-export.dir/build make[2]: Entering directory '/tmp/B.crNwZC/BUILD/elektra-0.8.23/build' cd /tmp/B.crNwZC/BUILD/elektra-0.8.23/build && /usr/bin/cmake -E cmake_depends "Unix Makefiles" /tmp/B.crNwZC/BUILD/elektra-0.8.23 /tmp/B.crNwZC/BUILD/elektra-0.8.23/doc/help /tmp/B.crNwZC/BUILD/elektra-0.8.23/build /tmp/B.crNwZC/BUILD/elektra-0.8.23/build/doc/help /tmp/B.crNwZC/BUILD/elektra-0.8.23/build/doc/help/CMakeFiles/man-kdb-fstab.dir/DependInfo.cmake --color= Scanning dependencies of target man-kdb-fstab make[2]: Leaving directory '/tmp/B.crNwZC/BUILD/elektra-0.8.23/build' /usr/bin/make -f doc/help/CMakeFiles/man-kdb-fstab.dir/build.make doc/help/CMakeFiles/man-kdb-fstab.dir/build make[1]: Entering directory '/tmp/B.crNwZC/BUILD/elektra-0.8.23/build' [ 3%] Built target man-elektra-metadata make[1]: Leaving directory '/tmp/B.crNwZC/BUILD/elektra-0.8.23/build' make[2]: Entering directory '/tmp/B.crNwZC/BUILD/elektra-0.8.23/build' cd /tmp/B.crNwZC/BUILD/elektra-0.8.23/build && /usr/bin/cmake -E cmake_depends "Unix Makefiles" /tmp/B.crNwZC/BUILD/elektra-0.8.23 /tmp/B.crNwZC/BUILD/elektra-0.8.23/doc/help /tmp/B.crNwZC/BUILD/elektra-0.8.23/build /tmp/B.crNwZC/BUILD/elektra-0.8.23/build/doc/help /tmp/B.crNwZC/BUILD/elektra-0.8.23/build/doc/help/CMakeFiles/man-kdb-rmmeta.dir/DependInfo.cmake --color= Scanning dependencies of target man-kdb-rmmeta make[2]: Leaving directory '/tmp/B.crNwZC/BUILD/elektra-0.8.23/build' /usr/bin/make -f doc/help/CMakeFiles/man-kdb-remount.dir/build.make doc/help/CMakeFiles/man-kdb-remount.dir/depend make[2]: Entering directory '/tmp/B.crNwZC/BUILD/elektra-0.8.23/build' cd /tmp/B.crNwZC/BUILD/elektra-0.8.23/build && /usr/bin/cmake -E cmake_depends "Unix Makefiles" /tmp/B.crNwZC/BUILD/elektra-0.8.23 /tmp/B.crNwZC/BUILD/elektra-0.8.23/doc/help /tmp/B.crNwZC/BUILD/elektra-0.8.23/build /tmp/B.crNwZC/BUILD/elektra-0.8.23/build/doc/help /tmp/B.crNwZC/BUILD/elektra-0.8.23/build/doc/help/CMakeFiles/man-kdb-getmeta.dir/DependInfo.cmake --color= Scanning dependencies of target man-kdb-getmeta make[2]: Leaving directory '/tmp/B.crNwZC/BUILD/elektra-0.8.23/build' /usr/bin/make -f doc/help/CMakeFiles/man-kdb-getmeta.dir/build.make doc/help/CMakeFiles/man-kdb-getmeta.dir/build /usr/bin/make -f doc/help/CMakeFiles/man-kdb-rmmeta.dir/build.make doc/help/CMakeFiles/man-kdb-rmmeta.dir/build make[2]: Nothing to be done for 'doc/help/CMakeFiles/man-kdb-export.dir/build'. make[2]: Nothing to be done for 'doc/help/CMakeFiles/man-kdb-fstab.dir/build'. make[2]: Nothing to be done for 'doc/help/CMakeFiles/man-kdb-getmeta.dir/build'. make[2]: Entering directory '/tmp/B.crNwZC/BUILD/elektra-0.8.23/build' cd /tmp/B.crNwZC/BUILD/elektra-0.8.23/build && /usr/bin/cmake -E cmake_depends "Unix Makefiles" /tmp/B.crNwZC/BUILD/elektra-0.8.23 /tmp/B.crNwZC/BUILD/elektra-0.8.23/doc/help /tmp/B.crNwZC/BUILD/elektra-0.8.23/build /tmp/B.crNwZC/BUILD/elektra-0.8.23/build/doc/help /tmp/B.crNwZC/BUILD/elektra-0.8.23/build/doc/help/CMakeFiles/man-kdb-mountpoint-info.dir/DependInfo.cmake --color= Scanning dependencies of target man-kdb-mountpoint-info make[2]: Leaving directory '/tmp/B.crNwZC/BUILD/elektra-0.8.23/build' make[2]: Nothing to be done for 'doc/help/CMakeFiles/man-kdb-rmmeta.dir/build'. /usr/bin/make -f doc/help/CMakeFiles/man-kdb-mountpoint-info.dir/build.make doc/help/CMakeFiles/man-kdb-mountpoint-info.dir/build make[2]: Nothing to be done for 'doc/help/CMakeFiles/man-kdb-mountpoint-info.dir/build'. make[1]: Entering directory '/tmp/B.crNwZC/BUILD/elektra-0.8.23/build' [ 4%] Built target man-elektra-semantics make[1]: Leaving directory '/tmp/B.crNwZC/BUILD/elektra-0.8.23/build' /usr/bin/make -f doc/help/CMakeFiles/man-kdb-restore.dir/build.make doc/help/CMakeFiles/man-kdb-restore.dir/depend make[2]: Entering directory '/tmp/B.crNwZC/BUILD/elektra-0.8.23/build' cd /tmp/B.crNwZC/BUILD/elektra-0.8.23/build && /usr/bin/cmake -E cmake_depends "Unix Makefiles" /tmp/B.crNwZC/BUILD/elektra-0.8.23 /tmp/B.crNwZC/BUILD/elektra-0.8.23/doc/help /tmp/B.crNwZC/BUILD/elektra-0.8.23/build /tmp/B.crNwZC/BUILD/elektra-0.8.23/build/doc/help /tmp/B.crNwZC/BUILD/elektra-0.8.23/build/doc/help/CMakeFiles/man-kdb-list.dir/DependInfo.cmake --color= Scanning dependencies of target man-kdb-list make[2]: Leaving directory '/tmp/B.crNwZC/BUILD/elektra-0.8.23/build' make[1]: Entering directory '/tmp/B.crNwZC/BUILD/elektra-0.8.23/build' [ 4%] Built target man-kdb-export make[1]: Leaving directory '/tmp/B.crNwZC/BUILD/elektra-0.8.23/build' /usr/bin/make -f doc/help/CMakeFiles/man-elektra-faq.dir/build.make doc/help/CMakeFiles/man-elektra-faq.dir/depend /usr/bin/make -f doc/help/CMakeFiles/man-kdb-list.dir/build.make doc/help/CMakeFiles/man-kdb-list.dir/build make[2]: Entering directory '/tmp/B.crNwZC/BUILD/elektra-0.8.23/build' cd /tmp/B.crNwZC/BUILD/elektra-0.8.23/build && /usr/bin/cmake -E cmake_depends "Unix Makefiles" /tmp/B.crNwZC/BUILD/elektra-0.8.23 /tmp/B.crNwZC/BUILD/elektra-0.8.23/doc/help /tmp/B.crNwZC/BUILD/elektra-0.8.23/build /tmp/B.crNwZC/BUILD/elektra-0.8.23/build/doc/help /tmp/B.crNwZC/BUILD/elektra-0.8.23/build/doc/help/CMakeFiles/man-kdb-remount.dir/DependInfo.cmake --color= Scanning dependencies of target man-kdb-remount make[2]: Leaving directory '/tmp/B.crNwZC/BUILD/elektra-0.8.23/build' /usr/bin/make -f doc/help/CMakeFiles/man-kdb-remount.dir/build.make doc/help/CMakeFiles/man-kdb-remount.dir/build make[1]: Entering directory '/tmp/B.crNwZC/BUILD/elektra-0.8.23/build' [ 4%] Built target man-kdb-fstab make[1]: Leaving directory '/tmp/B.crNwZC/BUILD/elektra-0.8.23/build' make[1]: Entering directory '/tmp/B.crNwZC/BUILD/elektra-0.8.23/build' [ 4%] Built target man-kdb-rmmeta make[1]: Leaving directory '/tmp/B.crNwZC/BUILD/elektra-0.8.23/build' /usr/bin/make -f doc/help/CMakeFiles/man-kdb-setmeta.dir/build.make doc/help/CMakeFiles/man-kdb-setmeta.dir/depend make[2]: Nothing to be done for 'doc/help/CMakeFiles/man-kdb-list.dir/build'. make[1]: Entering directory '/tmp/B.crNwZC/BUILD/elektra-0.8.23/build' [ 4%] Built target man-kdb-getmeta make[1]: Leaving directory '/tmp/B.crNwZC/BUILD/elektra-0.8.23/build' /usr/bin/make -f doc/help/CMakeFiles/man-kdb-sget.dir/build.make doc/help/CMakeFiles/man-kdb-sget.dir/depend /usr/bin/make -f doc/help/CMakeFiles/man-kdb-umount.dir/build.make doc/help/CMakeFiles/man-kdb-umount.dir/depend make[2]: Nothing to be done for 'doc/help/CMakeFiles/man-kdb-remount.dir/build'. make[1]: Entering directory '/tmp/B.crNwZC/BUILD/elektra-0.8.23/build' [ 4%] Built target man-kdb-mountpoint-info make[1]: Leaving directory '/tmp/B.crNwZC/BUILD/elektra-0.8.23/build' /usr/bin/make -f doc/help/CMakeFiles/man-kdb.dir/build.make doc/help/CMakeFiles/man-kdb.dir/depend make[2]: Entering directory '/tmp/B.crNwZC/BUILD/elektra-0.8.23/build' cd /tmp/B.crNwZC/BUILD/elektra-0.8.23/build && /usr/bin/cmake -E cmake_depends "Unix Makefiles" /tmp/B.crNwZC/BUILD/elektra-0.8.23 /tmp/B.crNwZC/BUILD/elektra-0.8.23/doc/help /tmp/B.crNwZC/BUILD/elektra-0.8.23/build /tmp/B.crNwZC/BUILD/elektra-0.8.23/build/doc/help /tmp/B.crNwZC/BUILD/elektra-0.8.23/build/doc/help/CMakeFiles/man-kdb-restore.dir/DependInfo.cmake --color= Scanning dependencies of target man-kdb-restore make[2]: Leaving directory '/tmp/B.crNwZC/BUILD/elektra-0.8.23/build' /usr/bin/make -f doc/help/CMakeFiles/man-kdb-restore.dir/build.make doc/help/CMakeFiles/man-kdb-restore.dir/build make[2]: Entering directory '/tmp/B.crNwZC/BUILD/elektra-0.8.23/build' cd /tmp/B.crNwZC/BUILD/elektra-0.8.23/build && /usr/bin/cmake -E cmake_depends "Unix Makefiles" /tmp/B.crNwZC/BUILD/elektra-0.8.23 /tmp/B.crNwZC/BUILD/elektra-0.8.23/doc/help /tmp/B.crNwZC/BUILD/elektra-0.8.23/build /tmp/B.crNwZC/BUILD/elektra-0.8.23/build/doc/help /tmp/B.crNwZC/BUILD/elektra-0.8.23/build/doc/help/CMakeFiles/man-elektra-faq.dir/DependInfo.cmake --color= Scanning dependencies of target man-elektra-faq make[2]: Leaving directory '/tmp/B.crNwZC/BUILD/elektra-0.8.23/build' /usr/bin/make -f doc/help/CMakeFiles/man-elektra-faq.dir/build.make doc/help/CMakeFiles/man-elektra-faq.dir/build make[1]: Entering directory '/tmp/B.crNwZC/BUILD/elektra-0.8.23/build' [ 4%] Built target man-kdb-list make[1]: Leaving directory '/tmp/B.crNwZC/BUILD/elektra-0.8.23/build' /usr/bin/make -f doc/help/CMakeFiles/man-elektra-backends.dir/build.make doc/help/CMakeFiles/man-elektra-backends.dir/depend make[2]: Nothing to be done for 'doc/help/CMakeFiles/man-kdb-restore.dir/build'. make[2]: Nothing to be done for 'doc/help/CMakeFiles/man-elektra-faq.dir/build'. make[2]: Entering directory '/tmp/B.crNwZC/BUILD/elektra-0.8.23/build' cd /tmp/B.crNwZC/BUILD/elektra-0.8.23/build && /usr/bin/cmake -E cmake_depends "Unix Makefiles" /tmp/B.crNwZC/BUILD/elektra-0.8.23 /tmp/B.crNwZC/BUILD/elektra-0.8.23/doc/help /tmp/B.crNwZC/BUILD/elektra-0.8.23/build /tmp/B.crNwZC/BUILD/elektra-0.8.23/build/doc/help /tmp/B.crNwZC/BUILD/elektra-0.8.23/build/doc/help/CMakeFiles/man-kdb-umount.dir/DependInfo.cmake --color= Scanning dependencies of target man-kdb-umount make[2]: Leaving directory '/tmp/B.crNwZC/BUILD/elektra-0.8.23/build' /usr/bin/make -f doc/help/CMakeFiles/man-kdb-umount.dir/build.make doc/help/CMakeFiles/man-kdb-umount.dir/build make[1]: Entering directory '/tmp/B.crNwZC/BUILD/elektra-0.8.23/build' [ 4%] Built target man-kdb-remount make[1]: Leaving directory '/tmp/B.crNwZC/BUILD/elektra-0.8.23/build' make[2]: Entering directory '/tmp/B.crNwZC/BUILD/elektra-0.8.23/build' cd /tmp/B.crNwZC/BUILD/elektra-0.8.23/build && /usr/bin/cmake -E cmake_depends "Unix Makefiles" /tmp/B.crNwZC/BUILD/elektra-0.8.23 /tmp/B.crNwZC/BUILD/elektra-0.8.23/doc/help /tmp/B.crNwZC/BUILD/elektra-0.8.23/build /tmp/B.crNwZC/BUILD/elektra-0.8.23/build/doc/help /tmp/B.crNwZC/BUILD/elektra-0.8.23/build/doc/help/CMakeFiles/man-kdb-sget.dir/DependInfo.cmake --color= Scanning dependencies of target man-kdb-sget make[2]: Leaving directory '/tmp/B.crNwZC/BUILD/elektra-0.8.23/build' /usr/bin/make -f doc/help/CMakeFiles/man-elektra-introduction.dir/build.make doc/help/CMakeFiles/man-elektra-introduction.dir/depend make[2]: Entering directory '/tmp/B.crNwZC/BUILD/elektra-0.8.23/build' cd /tmp/B.crNwZC/BUILD/elektra-0.8.23/build && /usr/bin/cmake -E cmake_depends "Unix Makefiles" /tmp/B.crNwZC/BUILD/elektra-0.8.23 /tmp/B.crNwZC/BUILD/elektra-0.8.23/doc/help /tmp/B.crNwZC/BUILD/elektra-0.8.23/build /tmp/B.crNwZC/BUILD/elektra-0.8.23/build/doc/help /tmp/B.crNwZC/BUILD/elektra-0.8.23/build/doc/help/CMakeFiles/man-kdb-setmeta.dir/DependInfo.cmake --color= Scanning dependencies of target man-kdb-setmeta make[2]: Leaving directory '/tmp/B.crNwZC/BUILD/elektra-0.8.23/build' /usr/bin/make -f doc/help/CMakeFiles/man-kdb-setmeta.dir/build.make doc/help/CMakeFiles/man-kdb-setmeta.dir/build make[2]: Nothing to be done for 'doc/help/CMakeFiles/man-kdb-umount.dir/build'. /usr/bin/make -f doc/help/CMakeFiles/man-kdb-sget.dir/build.make doc/help/CMakeFiles/man-kdb-sget.dir/build make[2]: Nothing to be done for 'doc/help/CMakeFiles/man-kdb-setmeta.dir/build'. make[2]: Nothing to be done for 'doc/help/CMakeFiles/man-kdb-sget.dir/build'. make[2]: Entering directory '/tmp/B.crNwZC/BUILD/elektra-0.8.23/build' cd /tmp/B.crNwZC/BUILD/elektra-0.8.23/build && /usr/bin/cmake -E cmake_depends "Unix Makefiles" /tmp/B.crNwZC/BUILD/elektra-0.8.23 /tmp/B.crNwZC/BUILD/elektra-0.8.23/doc/help /tmp/B.crNwZC/BUILD/elektra-0.8.23/build /tmp/B.crNwZC/BUILD/elektra-0.8.23/build/doc/help /tmp/B.crNwZC/BUILD/elektra-0.8.23/build/doc/help/CMakeFiles/man-kdb.dir/DependInfo.cmake --color= Scanning dependencies of target man-kdb make[2]: Leaving directory '/tmp/B.crNwZC/BUILD/elektra-0.8.23/build' /usr/bin/make -f doc/help/CMakeFiles/man-kdb.dir/build.make doc/help/CMakeFiles/man-kdb.dir/build make[1]: Entering directory '/tmp/B.crNwZC/BUILD/elektra-0.8.23/build' [ 4%] Built target man-kdb-restore make[1]: Leaving directory '/tmp/B.crNwZC/BUILD/elektra-0.8.23/build' /usr/bin/make -f doc/help/CMakeFiles/man-elektra-merge-strategy.dir/build.make doc/help/CMakeFiles/man-elektra-merge-strategy.dir/depend make[1]: Entering directory '/tmp/B.crNwZC/BUILD/elektra-0.8.23/build' [ 4%] Built target man-elektra-faq make[1]: Leaving directory '/tmp/B.crNwZC/BUILD/elektra-0.8.23/build' /usr/bin/make -f doc/help/CMakeFiles/man-elektra-bootstrapping.dir/build.make doc/help/CMakeFiles/man-elektra-bootstrapping.dir/depend make[2]: Nothing to be done for 'doc/help/CMakeFiles/man-kdb.dir/build'. make[2]: Entering directory '/tmp/B.crNwZC/BUILD/elektra-0.8.23/build' cd /tmp/B.crNwZC/BUILD/elektra-0.8.23/build && /usr/bin/cmake -E cmake_depends "Unix Makefiles" /tmp/B.crNwZC/BUILD/elektra-0.8.23 /tmp/B.crNwZC/BUILD/elektra-0.8.23/doc/help /tmp/B.crNwZC/BUILD/elektra-0.8.23/build /tmp/B.crNwZC/BUILD/elektra-0.8.23/build/doc/help /tmp/B.crNwZC/BUILD/elektra-0.8.23/build/doc/help/CMakeFiles/man-elektra-backends.dir/DependInfo.cmake --color= Scanning dependencies of target man-elektra-backends make[2]: Leaving directory '/tmp/B.crNwZC/BUILD/elektra-0.8.23/build' /usr/bin/make -f doc/help/CMakeFiles/man-elektra-backends.dir/build.make doc/help/CMakeFiles/man-elektra-backends.dir/build make[1]: Entering directory '/tmp/B.crNwZC/BUILD/elektra-0.8.23/build' [ 4%] Built target man-kdb-setmeta make[1]: Leaving directory '/tmp/B.crNwZC/BUILD/elektra-0.8.23/build' /usr/bin/make -f doc/help/CMakeFiles/man-kdb-change-storage-symlink.dir/build.make doc/help/CMakeFiles/man-kdb-change-storage-symlink.dir/depend make[2]: Entering directory '/tmp/B.crNwZC/BUILD/elektra-0.8.23/build' cd /tmp/B.crNwZC/BUILD/elektra-0.8.23/build && /usr/bin/cmake -E cmake_depends "Unix Makefiles" /tmp/B.crNwZC/BUILD/elektra-0.8.23 /tmp/B.crNwZC/BUILD/elektra-0.8.23/doc/help /tmp/B.crNwZC/BUILD/elektra-0.8.23/build /tmp/B.crNwZC/BUILD/elektra-0.8.23/build/doc/help /tmp/B.crNwZC/BUILD/elektra-0.8.23/build/doc/help/CMakeFiles/man-elektra-introduction.dir/DependInfo.cmake --color= Scanning dependencies of target man-elektra-introduction make[2]: Leaving directory '/tmp/B.crNwZC/BUILD/elektra-0.8.23/build' make[1]: Entering directory '/tmp/B.crNwZC/BUILD/elektra-0.8.23/build' [ 4%] Built target man-kdb-umount make[1]: Leaving directory '/tmp/B.crNwZC/BUILD/elektra-0.8.23/build' make[1]: Entering directory '/tmp/B.crNwZC/BUILD/elektra-0.8.23/build' [ 5%] Built target man-kdb-sget make[1]: Leaving directory '/tmp/B.crNwZC/BUILD/elektra-0.8.23/build' /usr/bin/make -f doc/help/CMakeFiles/man-elektra-cascading.dir/build.make doc/help/CMakeFiles/man-elektra-cascading.dir/depend /usr/bin/make -f doc/help/CMakeFiles/man-elektra-introduction.dir/build.make doc/help/CMakeFiles/man-elektra-introduction.dir/build make[2]: Nothing to be done for 'doc/help/CMakeFiles/man-elektra-backends.dir/build'. /usr/bin/make -f doc/help/CMakeFiles/man-kdb-global-umount.dir/build.make doc/help/CMakeFiles/man-kdb-global-umount.dir/depend make[2]: Nothing to be done for 'doc/help/CMakeFiles/man-elektra-introduction.dir/build'. make[1]: Entering directory '/tmp/B.crNwZC/BUILD/elektra-0.8.23/build' [ 5%] Built target man-kdb make[1]: Leaving directory '/tmp/B.crNwZC/BUILD/elektra-0.8.23/build' make[2]: Entering directory '/tmp/B.crNwZC/BUILD/elektra-0.8.23/build' cd /tmp/B.crNwZC/BUILD/elektra-0.8.23/build && /usr/bin/cmake -E cmake_depends "Unix Makefiles" /tmp/B.crNwZC/BUILD/elektra-0.8.23 /tmp/B.crNwZC/BUILD/elektra-0.8.23/doc/help /tmp/B.crNwZC/BUILD/elektra-0.8.23/build /tmp/B.crNwZC/BUILD/elektra-0.8.23/build/doc/help /tmp/B.crNwZC/BUILD/elektra-0.8.23/build/doc/help/CMakeFiles/man-elektra-merge-strategy.dir/DependInfo.cmake --color= Scanning dependencies of target man-elektra-merge-strategy make[2]: Leaving directory '/tmp/B.crNwZC/BUILD/elektra-0.8.23/build' /usr/bin/make -f doc/help/CMakeFiles/man-kdb-convert.dir/build.make doc/help/CMakeFiles/man-kdb-convert.dir/depend /usr/bin/make -f doc/help/CMakeFiles/man-elektra-merge-strategy.dir/build.make doc/help/CMakeFiles/man-elektra-merge-strategy.dir/build make[2]: Entering directory '/tmp/B.crNwZC/BUILD/elektra-0.8.23/build' cd /tmp/B.crNwZC/BUILD/elektra-0.8.23/build && /usr/bin/cmake -E cmake_depends "Unix Makefiles" /tmp/B.crNwZC/BUILD/elektra-0.8.23 /tmp/B.crNwZC/BUILD/elektra-0.8.23/doc/help /tmp/B.crNwZC/BUILD/elektra-0.8.23/build /tmp/B.crNwZC/BUILD/elektra-0.8.23/build/doc/help /tmp/B.crNwZC/BUILD/elektra-0.8.23/build/doc/help/CMakeFiles/man-elektra-bootstrapping.dir/DependInfo.cmake --color= Scanning dependencies of target man-elektra-bootstrapping make[2]: Leaving directory '/tmp/B.crNwZC/BUILD/elektra-0.8.23/build' /usr/bin/make -f doc/help/CMakeFiles/man-elektra-bootstrapping.dir/build.make doc/help/CMakeFiles/man-elektra-bootstrapping.dir/build make[2]: Nothing to be done for 'doc/help/CMakeFiles/man-elektra-merge-strategy.dir/build'. make[2]: Entering directory '/tmp/B.crNwZC/BUILD/elektra-0.8.23/build' cd /tmp/B.crNwZC/BUILD/elektra-0.8.23/build && /usr/bin/cmake -E cmake_depends "Unix Makefiles" /tmp/B.crNwZC/BUILD/elektra-0.8.23 /tmp/B.crNwZC/BUILD/elektra-0.8.23/doc/help /tmp/B.crNwZC/BUILD/elektra-0.8.23/build /tmp/B.crNwZC/BUILD/elektra-0.8.23/build/doc/help /tmp/B.crNwZC/BUILD/elektra-0.8.23/build/doc/help/CMakeFiles/man-elektra-cascading.dir/DependInfo.cmake --color= Scanning dependencies of target man-elektra-cascading make[2]: Leaving directory '/tmp/B.crNwZC/BUILD/elektra-0.8.23/build' make[1]: Entering directory '/tmp/B.crNwZC/BUILD/elektra-0.8.23/build' [ 5%] Built target man-elektra-backends make[1]: Leaving directory '/tmp/B.crNwZC/BUILD/elektra-0.8.23/build' make[2]: Entering directory '/tmp/B.crNwZC/BUILD/elektra-0.8.23/build' cd /tmp/B.crNwZC/BUILD/elektra-0.8.23/build && /usr/bin/cmake -E cmake_depends "Unix Makefiles" /tmp/B.crNwZC/BUILD/elektra-0.8.23 /tmp/B.crNwZC/BUILD/elektra-0.8.23/doc/help /tmp/B.crNwZC/BUILD/elektra-0.8.23/build /tmp/B.crNwZC/BUILD/elektra-0.8.23/build/doc/help /tmp/B.crNwZC/BUILD/elektra-0.8.23/build/doc/help/CMakeFiles/man-kdb-change-storage-symlink.dir/DependInfo.cmake --color= Scanning dependencies of target man-kdb-change-storage-symlink make[2]: Leaving directory '/tmp/B.crNwZC/BUILD/elektra-0.8.23/build' make[2]: Nothing to be done for 'doc/help/CMakeFiles/man-elektra-bootstrapping.dir/build'. /usr/bin/make -f doc/help/CMakeFiles/man-elektra-contracts.dir/build.make doc/help/CMakeFiles/man-elektra-contracts.dir/depend /usr/bin/make -f doc/help/CMakeFiles/man-kdb-change-storage-symlink.dir/build.make doc/help/CMakeFiles/man-kdb-change-storage-symlink.dir/build /usr/bin/make -f doc/help/CMakeFiles/man-elektra-cascading.dir/build.make doc/help/CMakeFiles/man-elektra-cascading.dir/build make[2]: Entering directory '/tmp/B.crNwZC/BUILD/elektra-0.8.23/build' cd /tmp/B.crNwZC/BUILD/elektra-0.8.23/build && /usr/bin/cmake -E cmake_depends "Unix Makefiles" /tmp/B.crNwZC/BUILD/elektra-0.8.23 /tmp/B.crNwZC/BUILD/elektra-0.8.23/doc/help /tmp/B.crNwZC/BUILD/elektra-0.8.23/build /tmp/B.crNwZC/BUILD/elektra-0.8.23/build/doc/help /tmp/B.crNwZC/BUILD/elektra-0.8.23/build/doc/help/CMakeFiles/man-kdb-global-umount.dir/DependInfo.cmake --color= Scanning dependencies of target man-kdb-global-umount make[2]: Leaving directory '/tmp/B.crNwZC/BUILD/elektra-0.8.23/build' /usr/bin/make -f doc/help/CMakeFiles/man-kdb-global-umount.dir/build.make doc/help/CMakeFiles/man-kdb-global-umount.dir/build make[2]: Nothing to be done for 'doc/help/CMakeFiles/man-kdb-change-storage-symlink.dir/build'. make[2]: Nothing to be done for 'doc/help/CMakeFiles/man-elektra-cascading.dir/build'. make[1]: Entering directory '/tmp/B.crNwZC/BUILD/elektra-0.8.23/build' [ 5%] Built target man-elektra-introduction make[1]: Leaving directory '/tmp/B.crNwZC/BUILD/elektra-0.8.23/build' /usr/bin/make -f doc/help/CMakeFiles/man-elektra-hierarchy.dir/build.make doc/help/CMakeFiles/man-elektra-hierarchy.dir/depend make[2]: Nothing to be done for 'doc/help/CMakeFiles/man-kdb-global-umount.dir/build'. make[2]: Entering directory '/tmp/B.crNwZC/BUILD/elektra-0.8.23/build' [ 0%] Building C object doc/CMakeFiles/markdownlinkconverter.dir/markdownlinkconverter/markdownlinkconverter.c.o cd /tmp/B.crNwZC/BUILD/elektra-0.8.23/build/doc && /usr/bin/x86_64-pld-linux-gnux32-gcc -std=gnu99 -Wno-deprecated-declarations -Wstrict-prototypes -Wno-long-long -pedantic -Wno-variadic-macros -Wall -Wextra -Wno-overlength-strings -Wsign-compare -Wfloat-equal -Wformat -Wformat-security -Wshadow -Wcomments -Wtrigraphs -Wundef -Wuninitialized -Winit-self -Wmaybe-uninitialized -Wsign-compare -Wfloat-equal -O2 -fwrapv -pipe -Wformat -Werror=format-security -gdwarf-4 -fno-debug-types-section -fvar-tracking-assignments -g2 -Wp,-D_FORTIFY_SOURCE=2 -fstack-protector-strong --param=ssp-buffer-size=4 -Werror=trampolines -fPIC -mtune=generic -march=x86-64 -gdwarf-4 -fno-debug-types-section -fvar-tracking-assignments -g2 -DNDEBUG -DQT_NO_DEBUG -o CMakeFiles/markdownlinkconverter.dir/markdownlinkconverter/markdownlinkconverter.c.o -c /tmp/B.crNwZC/BUILD/elektra-0.8.23/doc/markdownlinkconverter/markdownlinkconverter.c make[2]: Leaving directory '/tmp/B.crNwZC/BUILD/elektra-0.8.23/build' make[2]: Entering directory '/tmp/B.crNwZC/BUILD/elektra-0.8.23/build' cd /tmp/B.crNwZC/BUILD/elektra-0.8.23/build && /usr/bin/cmake -E cmake_depends "Unix Makefiles" /tmp/B.crNwZC/BUILD/elektra-0.8.23 /tmp/B.crNwZC/BUILD/elektra-0.8.23/doc/help /tmp/B.crNwZC/BUILD/elektra-0.8.23/build /tmp/B.crNwZC/BUILD/elektra-0.8.23/build/doc/help /tmp/B.crNwZC/BUILD/elektra-0.8.23/build/doc/help/CMakeFiles/man-kdb-convert.dir/DependInfo.cmake --color= Scanning dependencies of target man-kdb-convert make[2]: Leaving directory '/tmp/B.crNwZC/BUILD/elektra-0.8.23/build' /usr/bin/make -f doc/help/CMakeFiles/man-kdb-convert.dir/build.make doc/help/CMakeFiles/man-kdb-convert.dir/build make[2]: Nothing to be done for 'doc/help/CMakeFiles/man-kdb-convert.dir/build'. make[1]: Entering directory '/tmp/B.crNwZC/BUILD/elektra-0.8.23/build' [ 5%] Built target man-elektra-bootstrapping make[1]: Leaving directory '/tmp/B.crNwZC/BUILD/elektra-0.8.23/build' make[1]: Entering directory '/tmp/B.crNwZC/BUILD/elektra-0.8.23/build' [ 5%] Built target man-elektra-merge-strategy make[1]: Leaving directory '/tmp/B.crNwZC/BUILD/elektra-0.8.23/build' /usr/bin/make -f doc/help/CMakeFiles/man-elektra-key-names.dir/build.make doc/help/CMakeFiles/man-elektra-key-names.dir/depend /usr/bin/make -f doc/help/CMakeFiles/man-elektra-namespaces.dir/build.make doc/help/CMakeFiles/man-elektra-namespaces.dir/depend make[1]: Entering directory '/tmp/B.crNwZC/BUILD/elektra-0.8.23/build' [ 5%] Built target man-elektra-cascading make[1]: Leaving directory '/tmp/B.crNwZC/BUILD/elektra-0.8.23/build' /usr/bin/make -f scripts/CMakeFiles/man-kdb-find-tools.dir/build.make scripts/CMakeFiles/man-kdb-find-tools.dir/depend make[2]: Entering directory '/tmp/B.crNwZC/BUILD/elektra-0.8.23/build' cd /tmp/B.crNwZC/BUILD/elektra-0.8.23/build && /usr/bin/cmake -E cmake_depends "Unix Makefiles" /tmp/B.crNwZC/BUILD/elektra-0.8.23 /tmp/B.crNwZC/BUILD/elektra-0.8.23/doc/help /tmp/B.crNwZC/BUILD/elektra-0.8.23/build /tmp/B.crNwZC/BUILD/elektra-0.8.23/build/doc/help /tmp/B.crNwZC/BUILD/elektra-0.8.23/build/doc/help/CMakeFiles/man-elektra-contracts.dir/DependInfo.cmake --color= Scanning dependencies of target man-elektra-contracts make[2]: Leaving directory '/tmp/B.crNwZC/BUILD/elektra-0.8.23/build' /usr/bin/make -f doc/help/CMakeFiles/man-elektra-contracts.dir/build.make doc/help/CMakeFiles/man-elektra-contracts.dir/build make[1]: Entering directory '/tmp/B.crNwZC/BUILD/elektra-0.8.23/build' [ 5%] Built target man-kdb-change-storage-symlink make[1]: Leaving directory '/tmp/B.crNwZC/BUILD/elektra-0.8.23/build' /usr/bin/make -f src/plugins/CMakeFiles/man-elektra-plugins.dir/build.make src/plugins/CMakeFiles/man-elektra-plugins.dir/depend make[2]: Entering directory '/tmp/B.crNwZC/BUILD/elektra-0.8.23/build' cd /tmp/B.crNwZC/BUILD/elektra-0.8.23/build && /usr/bin/cmake -E cmake_depends "Unix Makefiles" /tmp/B.crNwZC/BUILD/elektra-0.8.23 /tmp/B.crNwZC/BUILD/elektra-0.8.23/doc/help /tmp/B.crNwZC/BUILD/elektra-0.8.23/build /tmp/B.crNwZC/BUILD/elektra-0.8.23/build/doc/help /tmp/B.crNwZC/BUILD/elektra-0.8.23/build/doc/help/CMakeFiles/man-elektra-hierarchy.dir/DependInfo.cmake --color= Scanning dependencies of target man-elektra-hierarchy make[2]: Leaving directory '/tmp/B.crNwZC/BUILD/elektra-0.8.23/build' make[2]: Nothing to be done for 'doc/help/CMakeFiles/man-elektra-contracts.dir/build'. /usr/bin/make -f doc/help/CMakeFiles/man-elektra-hierarchy.dir/build.make doc/help/CMakeFiles/man-elektra-hierarchy.dir/build make[2]: Nothing to be done for 'doc/help/CMakeFiles/man-elektra-hierarchy.dir/build'. make[1]: Entering directory '/tmp/B.crNwZC/BUILD/elektra-0.8.23/build' [ 6%] Built target man-kdb-convert make[1]: Leaving directory '/tmp/B.crNwZC/BUILD/elektra-0.8.23/build' /usr/bin/make -f src/libs/CMakeFiles/man-elektra-libs.dir/build.make src/libs/CMakeFiles/man-elektra-libs.dir/depend make[1]: Entering directory '/tmp/B.crNwZC/BUILD/elektra-0.8.23/build' [ 6%] Built target man-kdb-global-umount make[1]: Leaving directory '/tmp/B.crNwZC/BUILD/elektra-0.8.23/build' /usr/bin/make -f src/bindings/intercept/env/CMakeFiles/man-kdb-elektrify-getenv.dir/build.make src/bindings/intercept/env/CMakeFiles/man-kdb-elektrify-getenv.dir/depend make[2]: Entering directory '/tmp/B.crNwZC/BUILD/elektra-0.8.23/build' cd /tmp/B.crNwZC/BUILD/elektra-0.8.23/build && /usr/bin/cmake -E cmake_depends "Unix Makefiles" /tmp/B.crNwZC/BUILD/elektra-0.8.23 /tmp/B.crNwZC/BUILD/elektra-0.8.23/doc/help /tmp/B.crNwZC/BUILD/elektra-0.8.23/build /tmp/B.crNwZC/BUILD/elektra-0.8.23/build/doc/help /tmp/B.crNwZC/BUILD/elektra-0.8.23/build/doc/help/CMakeFiles/man-elektra-namespaces.dir/DependInfo.cmake --color= Scanning dependencies of target man-elektra-namespaces make[2]: Leaving directory '/tmp/B.crNwZC/BUILD/elektra-0.8.23/build' make[2]: Entering directory '/tmp/B.crNwZC/BUILD/elektra-0.8.23/build' cd /tmp/B.crNwZC/BUILD/elektra-0.8.23/build && /usr/bin/cmake -E cmake_depends "Unix Makefiles" /tmp/B.crNwZC/BUILD/elektra-0.8.23 /tmp/B.crNwZC/BUILD/elektra-0.8.23/doc/help /tmp/B.crNwZC/BUILD/elektra-0.8.23/build /tmp/B.crNwZC/BUILD/elektra-0.8.23/build/doc/help /tmp/B.crNwZC/BUILD/elektra-0.8.23/build/doc/help/CMakeFiles/man-elektra-key-names.dir/DependInfo.cmake --color= Scanning dependencies of target man-elektra-key-names make[2]: Leaving directory '/tmp/B.crNwZC/BUILD/elektra-0.8.23/build' /usr/bin/make -f doc/help/CMakeFiles/man-elektra-namespaces.dir/build.make doc/help/CMakeFiles/man-elektra-namespaces.dir/build /usr/bin/make -f doc/help/CMakeFiles/man-elektra-key-names.dir/build.make doc/help/CMakeFiles/man-elektra-key-names.dir/build make[2]: Entering directory '/tmp/B.crNwZC/BUILD/elektra-0.8.23/build' cd /tmp/B.crNwZC/BUILD/elektra-0.8.23/build && /usr/bin/cmake -E cmake_depends "Unix Makefiles" /tmp/B.crNwZC/BUILD/elektra-0.8.23 /tmp/B.crNwZC/BUILD/elektra-0.8.23/scripts /tmp/B.crNwZC/BUILD/elektra-0.8.23/build /tmp/B.crNwZC/BUILD/elektra-0.8.23/build/scripts /tmp/B.crNwZC/BUILD/elektra-0.8.23/build/scripts/CMakeFiles/man-kdb-find-tools.dir/DependInfo.cmake --color= Scanning dependencies of target man-kdb-find-tools make[2]: Leaving directory '/tmp/B.crNwZC/BUILD/elektra-0.8.23/build' /usr/bin/make -f scripts/CMakeFiles/man-kdb-find-tools.dir/build.make scripts/CMakeFiles/man-kdb-find-tools.dir/build make[2]: Nothing to be done for 'doc/help/CMakeFiles/man-elektra-namespaces.dir/build'. make[2]: Nothing to be done for 'doc/help/CMakeFiles/man-elektra-key-names.dir/build'. make[2]: Nothing to be done for 'scripts/CMakeFiles/man-kdb-find-tools.dir/build'. make[1]: Entering directory '/tmp/B.crNwZC/BUILD/elektra-0.8.23/build' [ 6%] Built target man-elektra-contracts make[1]: Leaving directory '/tmp/B.crNwZC/BUILD/elektra-0.8.23/build' make[1]: Entering directory '/tmp/B.crNwZC/BUILD/elektra-0.8.23/build' [ 6%] Built target man-elektra-hierarchy make[1]: Leaving directory '/tmp/B.crNwZC/BUILD/elektra-0.8.23/build' /usr/bin/make -f src/tools/gen/CMakeFiles/man-kdb-gen.dir/build.make src/tools/gen/CMakeFiles/man-kdb-gen.dir/depend /usr/bin/make -f gtest/CMakeFiles/gtest_main.dir/build.make gtest/CMakeFiles/gtest_main.dir/depend make[2]: Entering directory '/tmp/B.crNwZC/BUILD/elektra-0.8.23/build' cd /tmp/B.crNwZC/BUILD/elektra-0.8.23/build && /usr/bin/cmake -E cmake_depends "Unix Makefiles" /tmp/B.crNwZC/BUILD/elektra-0.8.23 /tmp/B.crNwZC/BUILD/elektra-0.8.23/src/plugins /tmp/B.crNwZC/BUILD/elektra-0.8.23/build /tmp/B.crNwZC/BUILD/elektra-0.8.23/build/src/plugins /tmp/B.crNwZC/BUILD/elektra-0.8.23/build/src/plugins/CMakeFiles/man-elektra-plugins.dir/DependInfo.cmake --color= Scanning dependencies of target man-elektra-plugins make[2]: Leaving directory '/tmp/B.crNwZC/BUILD/elektra-0.8.23/build' /usr/bin/make -f src/plugins/CMakeFiles/man-elektra-plugins.dir/build.make src/plugins/CMakeFiles/man-elektra-plugins.dir/build make[2]: Nothing to be done for 'src/plugins/CMakeFiles/man-elektra-plugins.dir/build'. make[1]: Entering directory '/tmp/B.crNwZC/BUILD/elektra-0.8.23/build' [ 6%] Built target man-elektra-namespaces make[1]: Leaving directory '/tmp/B.crNwZC/BUILD/elektra-0.8.23/build' /usr/bin/make -f gtest/CMakeFiles/gtest.dir/build.make gtest/CMakeFiles/gtest.dir/depend make[2]: Entering directory '/tmp/B.crNwZC/BUILD/elektra-0.8.23/build' cd /tmp/B.crNwZC/BUILD/elektra-0.8.23/build && /usr/bin/cmake -E cmake_depends "Unix Makefiles" /tmp/B.crNwZC/BUILD/elektra-0.8.23 /tmp/B.crNwZC/BUILD/elektra-0.8.23/src/libs /tmp/B.crNwZC/BUILD/elektra-0.8.23/build /tmp/B.crNwZC/BUILD/elektra-0.8.23/build/src/libs /tmp/B.crNwZC/BUILD/elektra-0.8.23/build/src/libs/CMakeFiles/man-elektra-libs.dir/DependInfo.cmake --color= Scanning dependencies of target man-elektra-libs make[2]: Leaving directory '/tmp/B.crNwZC/BUILD/elektra-0.8.23/build' make[2]: Entering directory '/tmp/B.crNwZC/BUILD/elektra-0.8.23/build' cd /tmp/B.crNwZC/BUILD/elektra-0.8.23/build && /usr/bin/cmake -E cmake_depends "Unix Makefiles" /tmp/B.crNwZC/BUILD/elektra-0.8.23 /tmp/B.crNwZC/BUILD/elektra-0.8.23/src/bindings/intercept/env /tmp/B.crNwZC/BUILD/elektra-0.8.23/build /tmp/B.crNwZC/BUILD/elektra-0.8.23/build/src/bindings/intercept/env /tmp/B.crNwZC/BUILD/elektra-0.8.23/build/src/bindings/intercept/env/CMakeFiles/man-kdb-elektrify-getenv.dir/DependInfo.cmake --color= Scanning dependencies of target man-kdb-elektrify-getenv make[2]: Leaving directory '/tmp/B.crNwZC/BUILD/elektra-0.8.23/build' /usr/bin/make -f src/libs/CMakeFiles/man-elektra-libs.dir/build.make src/libs/CMakeFiles/man-elektra-libs.dir/build /usr/bin/make -f src/bindings/intercept/env/CMakeFiles/man-kdb-elektrify-getenv.dir/build.make src/bindings/intercept/env/CMakeFiles/man-kdb-elektrify-getenv.dir/build make[1]: Entering directory '/tmp/B.crNwZC/BUILD/elektra-0.8.23/build' [ 6%] Built target man-elektra-key-names make[1]: Leaving directory '/tmp/B.crNwZC/BUILD/elektra-0.8.23/build' /usr/bin/make -f src/error/CMakeFiles/exporttranslations.dir/build.make src/error/CMakeFiles/exporttranslations.dir/depend make[2]: Nothing to be done for 'src/libs/CMakeFiles/man-elektra-libs.dir/build'. make[1]: Entering directory '/tmp/B.crNwZC/BUILD/elektra-0.8.23/build' [ 6%] Built target man-kdb-find-tools make[1]: Leaving directory '/tmp/B.crNwZC/BUILD/elektra-0.8.23/build' /usr/bin/make -f src/error/CMakeFiles/elektra-export-errors.dir/build.make src/error/CMakeFiles/elektra-export-errors.dir/depend make[2]: Entering directory '/tmp/B.crNwZC/BUILD/elektra-0.8.23/build' cd /tmp/B.crNwZC/BUILD/elektra-0.8.23/build && /usr/bin/cmake -E cmake_depends "Unix Makefiles" /tmp/B.crNwZC/BUILD/elektra-0.8.23 /tmp/B.crNwZC/BUILD/elektra-0.8.23/src/tools/gen /tmp/B.crNwZC/BUILD/elektra-0.8.23/build /tmp/B.crNwZC/BUILD/elektra-0.8.23/build/src/tools/gen /tmp/B.crNwZC/BUILD/elektra-0.8.23/build/src/tools/gen/CMakeFiles/man-kdb-gen.dir/DependInfo.cmake --color= Scanning dependencies of target man-kdb-gen make[2]: Leaving directory '/tmp/B.crNwZC/BUILD/elektra-0.8.23/build' make[2]: Nothing to be done for 'src/bindings/intercept/env/CMakeFiles/man-kdb-elektrify-getenv.dir/build'. /usr/bin/make -f src/tools/gen/CMakeFiles/man-kdb-gen.dir/build.make src/tools/gen/CMakeFiles/man-kdb-gen.dir/build make[2]: Nothing to be done for 'src/tools/gen/CMakeFiles/man-kdb-gen.dir/build'. make[2]: Entering directory '/tmp/B.crNwZC/BUILD/elektra-0.8.23/build' [ 5%] Linking C executable ../bin/markdownlinkconverter cd /tmp/B.crNwZC/BUILD/elektra-0.8.23/build/doc && /usr/bin/cmake -E cmake_link_script CMakeFiles/markdownlinkconverter.dir/link.txt --verbose=1 /usr/bin/x86_64-pld-linux-gnux32-gcc -std=gnu99 -Wno-deprecated-declarations -Wstrict-prototypes -Wno-long-long -pedantic -Wno-variadic-macros -Wall -Wextra -Wno-overlength-strings -Wsign-compare -Wfloat-equal -Wformat -Wformat-security -Wshadow -Wcomments -Wtrigraphs -Wundef -Wuninitialized -Winit-self -Wmaybe-uninitialized -Wsign-compare -Wfloat-equal -O2 -fwrapv -pipe -Wformat -Werror=format-security -gdwarf-4 -fno-debug-types-section -fvar-tracking-assignments -g2 -Wp,-D_FORTIFY_SOURCE=2 -fstack-protector-strong --param=ssp-buffer-size=4 -Werror=trampolines -fPIC -mtune=generic -march=x86-64 -gdwarf-4 -fno-debug-types-section -fvar-tracking-assignments -g2 -DNDEBUG -DQT_NO_DEBUG -Wl,--as-needed -Wl,--no-copy-dt-needed-entries -Wl,-z,relro -Wl,-z,combreloc -rdynamic CMakeFiles/markdownlinkconverter.dir/markdownlinkconverter/markdownlinkconverter.c.o -o ../bin/markdownlinkconverter make[2]: Leaving directory '/tmp/B.crNwZC/BUILD/elektra-0.8.23/build' make[1]: Entering directory '/tmp/B.crNwZC/BUILD/elektra-0.8.23/build' [ 6%] Built target man-elektra-plugins make[1]: Leaving directory '/tmp/B.crNwZC/BUILD/elektra-0.8.23/build' /usr/bin/make -f src/libs/elektra/CMakeFiles/elektra-export-symbols.dir/build.make src/libs/elektra/CMakeFiles/elektra-export-symbols.dir/depend make[2]: Entering directory '/tmp/B.crNwZC/BUILD/elektra-0.8.23/build' cd /tmp/B.crNwZC/BUILD/elektra-0.8.23/build && /usr/bin/cmake -E cmake_depends "Unix Makefiles" /tmp/B.crNwZC/BUILD/elektra-0.8.23 /tmp/B.crNwZC/BUILD/elektra-0.8.23/tests/gtest-1.7.0 /tmp/B.crNwZC/BUILD/elektra-0.8.23/build /tmp/B.crNwZC/BUILD/elektra-0.8.23/build/gtest /tmp/B.crNwZC/BUILD/elektra-0.8.23/build/gtest/CMakeFiles/gtest_main.dir/DependInfo.cmake --color= Scanning dependencies of target gtest_main make[2]: Leaving directory '/tmp/B.crNwZC/BUILD/elektra-0.8.23/build' make[1]: Entering directory '/tmp/B.crNwZC/BUILD/elektra-0.8.23/build' [ 6%] Built target man-elektra-libs make[1]: Leaving directory '/tmp/B.crNwZC/BUILD/elektra-0.8.23/build' /usr/bin/make -f gtest/CMakeFiles/gtest_main.dir/build.make gtest/CMakeFiles/gtest_main.dir/build /usr/bin/make -f src/libs/io/adapter/dbus/CMakeFiles/io-adapter-dbus.dir/build.make src/libs/io/adapter/dbus/CMakeFiles/io-adapter-dbus.dir/depend make[2]: Entering directory '/tmp/B.crNwZC/BUILD/elektra-0.8.23/build' cd /tmp/B.crNwZC/BUILD/elektra-0.8.23/build && /usr/bin/cmake -E cmake_depends "Unix Makefiles" /tmp/B.crNwZC/BUILD/elektra-0.8.23 /tmp/B.crNwZC/BUILD/elektra-0.8.23/src/error /tmp/B.crNwZC/BUILD/elektra-0.8.23/build /tmp/B.crNwZC/BUILD/elektra-0.8.23/build/src/error /tmp/B.crNwZC/BUILD/elektra-0.8.23/build/src/error/CMakeFiles/exporttranslations.dir/DependInfo.cmake --color= Scanning dependencies of target exporttranslations make[2]: Leaving directory '/tmp/B.crNwZC/BUILD/elektra-0.8.23/build' make[1]: Entering directory '/tmp/B.crNwZC/BUILD/elektra-0.8.23/build' [ 6%] Built target man-kdb-elektrify-getenv make[1]: Leaving directory '/tmp/B.crNwZC/BUILD/elektra-0.8.23/build' /usr/bin/make -f src/error/CMakeFiles/exporttranslations.dir/build.make src/error/CMakeFiles/exporttranslations.dir/build make[2]: Entering directory '/tmp/B.crNwZC/BUILD/elektra-0.8.23/build' cd /tmp/B.crNwZC/BUILD/elektra-0.8.23/build && /usr/bin/cmake -E cmake_depends "Unix Makefiles" /tmp/B.crNwZC/BUILD/elektra-0.8.23 /tmp/B.crNwZC/BUILD/elektra-0.8.23/src/error /tmp/B.crNwZC/BUILD/elektra-0.8.23/build /tmp/B.crNwZC/BUILD/elektra-0.8.23/build/src/error /tmp/B.crNwZC/BUILD/elektra-0.8.23/build/src/error/CMakeFiles/elektra-export-errors.dir/DependInfo.cmake --color= Scanning dependencies of target elektra-export-errors make[2]: Leaving directory '/tmp/B.crNwZC/BUILD/elektra-0.8.23/build' make[1]: Entering directory '/tmp/B.crNwZC/BUILD/elektra-0.8.23/build' [ 6%] Built target man-kdb-gen make[1]: Leaving directory '/tmp/B.crNwZC/BUILD/elektra-0.8.23/build' /usr/bin/make -f src/bindings/io/uv/CMakeFiles/OBJ_elektra-io-uv.dir/build.make src/bindings/io/uv/CMakeFiles/OBJ_elektra-io-uv.dir/depend /usr/bin/make -f src/error/CMakeFiles/elektra-export-errors.dir/build.make src/error/CMakeFiles/elektra-export-errors.dir/build /usr/bin/make -f src/bindings/swig/python2/CMakeFiles/swig-python2_swig_compilation.dir/build.make src/bindings/swig/python2/CMakeFiles/swig-python2_swig_compilation.dir/depend make[2]: Entering directory '/tmp/B.crNwZC/BUILD/elektra-0.8.23/build' cd /tmp/B.crNwZC/BUILD/elektra-0.8.23/build && /usr/bin/cmake -E cmake_depends "Unix Makefiles" /tmp/B.crNwZC/BUILD/elektra-0.8.23 /tmp/B.crNwZC/BUILD/elektra-0.8.23/tests/gtest-1.7.0 /tmp/B.crNwZC/BUILD/elektra-0.8.23/build /tmp/B.crNwZC/BUILD/elektra-0.8.23/build/gtest /tmp/B.crNwZC/BUILD/elektra-0.8.23/build/gtest/CMakeFiles/gtest.dir/DependInfo.cmake --color= Scanning dependencies of target gtest make[2]: Leaving directory '/tmp/B.crNwZC/BUILD/elektra-0.8.23/build' /usr/bin/make -f gtest/CMakeFiles/gtest.dir/build.make gtest/CMakeFiles/gtest.dir/build make[1]: Entering directory '/tmp/B.crNwZC/BUILD/elektra-0.8.23/build' [ 6%] Built target markdownlinkconverter make[1]: Leaving directory '/tmp/B.crNwZC/BUILD/elektra-0.8.23/build' /usr/bin/make -f src/bindings/swig/python/CMakeFiles/swig-python_swig_compilation.dir/build.make src/bindings/swig/python/CMakeFiles/swig-python_swig_compilation.dir/depend make[2]: Entering directory '/tmp/B.crNwZC/BUILD/elektra-0.8.23/build' cd /tmp/B.crNwZC/BUILD/elektra-0.8.23/build && /usr/bin/cmake -E cmake_depends "Unix Makefiles" /tmp/B.crNwZC/BUILD/elektra-0.8.23 /tmp/B.crNwZC/BUILD/elektra-0.8.23/src/libs/elektra /tmp/B.crNwZC/BUILD/elektra-0.8.23/build /tmp/B.crNwZC/BUILD/elektra-0.8.23/build/src/libs/elektra /tmp/B.crNwZC/BUILD/elektra-0.8.23/build/src/libs/elektra/CMakeFiles/elektra-export-symbols.dir/DependInfo.cmake --color= Scanning dependencies of target elektra-export-symbols make[2]: Leaving directory '/tmp/B.crNwZC/BUILD/elektra-0.8.23/build' /usr/bin/make -f src/libs/elektra/CMakeFiles/elektra-export-symbols.dir/build.make src/libs/elektra/CMakeFiles/elektra-export-symbols.dir/build make[2]: Entering directory '/tmp/B.crNwZC/BUILD/elektra-0.8.23/build' cd /tmp/B.crNwZC/BUILD/elektra-0.8.23/build && /usr/bin/cmake -E cmake_depends "Unix Makefiles" /tmp/B.crNwZC/BUILD/elektra-0.8.23 /tmp/B.crNwZC/BUILD/elektra-0.8.23/src/libs/io/adapter/dbus /tmp/B.crNwZC/BUILD/elektra-0.8.23/build /tmp/B.crNwZC/BUILD/elektra-0.8.23/build/src/libs/io/adapter/dbus /tmp/B.crNwZC/BUILD/elektra-0.8.23/build/src/libs/io/adapter/dbus/CMakeFiles/io-adapter-dbus.dir/DependInfo.cmake --color= Scanning dependencies of target io-adapter-dbus make[2]: Leaving directory '/tmp/B.crNwZC/BUILD/elektra-0.8.23/build' make[2]: Entering directory '/tmp/B.crNwZC/BUILD/elektra-0.8.23/build' /usr/bin/make -f src/libs/io/adapter/dbus/CMakeFiles/io-adapter-dbus.dir/build.make src/libs/io/adapter/dbus/CMakeFiles/io-adapter-dbus.dir/build cd /tmp/B.crNwZC/BUILD/elektra-0.8.23/build && /usr/bin/cmake -E cmake_depends "Unix Makefiles" /tmp/B.crNwZC/BUILD/elektra-0.8.23 /tmp/B.crNwZC/BUILD/elektra-0.8.23/src/bindings/io/uv /tmp/B.crNwZC/BUILD/elektra-0.8.23/build /tmp/B.crNwZC/BUILD/elektra-0.8.23/build/src/bindings/io/uv /tmp/B.crNwZC/BUILD/elektra-0.8.23/build/src/bindings/io/uv/CMakeFiles/OBJ_elektra-io-uv.dir/DependInfo.cmake --color= Scanning dependencies of target OBJ_elektra-io-uv make[2]: Leaving directory '/tmp/B.crNwZC/BUILD/elektra-0.8.23/build' /usr/bin/make -f src/bindings/io/uv/CMakeFiles/OBJ_elektra-io-uv.dir/build.make src/bindings/io/uv/CMakeFiles/OBJ_elektra-io-uv.dir/build make[2]: Entering directory '/tmp/B.crNwZC/BUILD/elektra-0.8.23/build' cd /tmp/B.crNwZC/BUILD/elektra-0.8.23/build && /usr/bin/cmake -E cmake_depends "Unix Makefiles" /tmp/B.crNwZC/BUILD/elektra-0.8.23 /tmp/B.crNwZC/BUILD/elektra-0.8.23/src/bindings/swig/python2 /tmp/B.crNwZC/BUILD/elektra-0.8.23/build /tmp/B.crNwZC/BUILD/elektra-0.8.23/build/src/bindings/swig/python2 /tmp/B.crNwZC/BUILD/elektra-0.8.23/build/src/bindings/swig/python2/CMakeFiles/swig-python2_swig_compilation.dir/DependInfo.cmake --color= Scanning dependencies of target swig-python2_swig_compilation make[2]: Leaving directory '/tmp/B.crNwZC/BUILD/elektra-0.8.23/build' /usr/bin/make -f src/bindings/swig/python2/CMakeFiles/swig-python2_swig_compilation.dir/build.make src/bindings/swig/python2/CMakeFiles/swig-python2_swig_compilation.dir/build make[2]: Entering directory '/tmp/B.crNwZC/BUILD/elektra-0.8.23/build' cd /tmp/B.crNwZC/BUILD/elektra-0.8.23/build && /usr/bin/cmake -E cmake_depends "Unix Makefiles" /tmp/B.crNwZC/BUILD/elektra-0.8.23 /tmp/B.crNwZC/BUILD/elektra-0.8.23/src/bindings/swig/python /tmp/B.crNwZC/BUILD/elektra-0.8.23/build /tmp/B.crNwZC/BUILD/elektra-0.8.23/build/src/bindings/swig/python /tmp/B.crNwZC/BUILD/elektra-0.8.23/build/src/bindings/swig/python/CMakeFiles/swig-python_swig_compilation.dir/DependInfo.cmake --color= Scanning dependencies of target swig-python_swig_compilation make[2]: Leaving directory '/tmp/B.crNwZC/BUILD/elektra-0.8.23/build' /usr/bin/make -f src/bindings/swig/python/CMakeFiles/swig-python_swig_compilation.dir/build.make src/bindings/swig/python/CMakeFiles/swig-python_swig_compilation.dir/build make[2]: Entering directory '/tmp/B.crNwZC/BUILD/elektra-0.8.23/build' [ 6%] Building C object src/libs/elektra/CMakeFiles/elektra-export-symbols.dir/exportsymbols.c.o cd /tmp/B.crNwZC/BUILD/elektra-0.8.23/build/src/libs/elektra && /usr/bin/x86_64-pld-linux-gnux32-gcc -I/tmp/B.crNwZC/BUILD/elektra-0.8.23/build/src/include -I/tmp/B.crNwZC/BUILD/elektra-0.8.23/src/include -I/tmp/B.crNwZC/BUILD/elektra-0.8.23/build/src/libs/elektra -std=gnu99 -Wno-deprecated-declarations -Wstrict-prototypes -Wno-long-long -pedantic -Wno-variadic-macros -Wall -Wextra -Wno-overlength-strings -Wsign-compare -Wfloat-equal -Wformat -Wformat-security -Wshadow -Wcomments -Wtrigraphs -Wundef -Wuninitialized -Winit-self -Wmaybe-uninitialized -Wsign-compare -Wfloat-equal -O2 -fwrapv -pipe -Wformat -Werror=format-security -gdwarf-4 -fno-debug-types-section -fvar-tracking-assignments -g2 -Wp,-D_FORTIFY_SOURCE=2 -fstack-protector-strong --param=ssp-buffer-size=4 -Werror=trampolines -fPIC -mtune=generic -march=x86-64 -gdwarf-4 -fno-debug-types-section -fvar-tracking-assignments -g2 -DNDEBUG -DQT_NO_DEBUG -o CMakeFiles/elektra-export-symbols.dir/exportsymbols.c.o -c /tmp/B.crNwZC/BUILD/elektra-0.8.23/src/libs/elektra/exportsymbols.c make[2]: Leaving directory '/tmp/B.crNwZC/BUILD/elektra-0.8.23/build' make[2]: Entering directory '/tmp/B.crNwZC/BUILD/elektra-0.8.23/build' [ 6%] Building C object src/libs/io/adapter/dbus/CMakeFiles/io-adapter-dbus.dir/dbus.c.o cd /tmp/B.crNwZC/BUILD/elektra-0.8.23/build/src/libs/io/adapter/dbus && /usr/bin/x86_64-pld-linux-gnux32-gcc -I/tmp/B.crNwZC/BUILD/elektra-0.8.23/build/src/include -I/tmp/B.crNwZC/BUILD/elektra-0.8.23/src/include -isystem /usr/include/dbus-1.0 -isystem /usr/libx32/dbus-1.0/include -std=gnu99 -Wno-deprecated-declarations -Wstrict-prototypes -Wno-long-long -pedantic -Wno-variadic-macros -Wall -Wextra -Wno-overlength-strings -Wsign-compare -Wfloat-equal -Wformat -Wformat-security -Wshadow -Wcomments -Wtrigraphs -Wundef -Wuninitialized -Winit-self -Wmaybe-uninitialized -Wsign-compare -Wfloat-equal -O2 -fwrapv -pipe -Wformat -Werror=format-security -gdwarf-4 -fno-debug-types-section -fvar-tracking-assignments -g2 -Wp,-D_FORTIFY_SOURCE=2 -fstack-protector-strong --param=ssp-buffer-size=4 -Werror=trampolines -fPIC -mtune=generic -march=x86-64 -gdwarf-4 -fno-debug-types-section -fvar-tracking-assignments -g2 -DNDEBUG -DQT_NO_DEBUG -fPIC -o CMakeFiles/io-adapter-dbus.dir/dbus.c.o -c /tmp/B.crNwZC/BUILD/elektra-0.8.23/src/libs/io/adapter/dbus/dbus.c make[2]: Leaving directory '/tmp/B.crNwZC/BUILD/elektra-0.8.23/build' make[2]: Entering directory '/tmp/B.crNwZC/BUILD/elektra-0.8.23/build' [ 6%] Linking C executable ../../../bin/elektra-export-symbols cd /tmp/B.crNwZC/BUILD/elektra-0.8.23/build/src/libs/elektra && /usr/bin/cmake -E cmake_link_script CMakeFiles/elektra-export-symbols.dir/link.txt --verbose=1 /usr/bin/x86_64-pld-linux-gnux32-gcc -std=gnu99 -Wno-deprecated-declarations -Wstrict-prototypes -Wno-long-long -pedantic -Wno-variadic-macros -Wall -Wextra -Wno-overlength-strings -Wsign-compare -Wfloat-equal -Wformat -Wformat-security -Wshadow -Wcomments -Wtrigraphs -Wundef -Wuninitialized -Winit-self -Wmaybe-uninitialized -Wsign-compare -Wfloat-equal -O2 -fwrapv -pipe -Wformat -Werror=format-security -gdwarf-4 -fno-debug-types-section -fvar-tracking-assignments -g2 -Wp,-D_FORTIFY_SOURCE=2 -fstack-protector-strong --param=ssp-buffer-size=4 -Werror=trampolines -fPIC -mtune=generic -march=x86-64 -gdwarf-4 -fno-debug-types-section -fvar-tracking-assignments -g2 -DNDEBUG -DQT_NO_DEBUG -Wl,--as-needed -Wl,--no-copy-dt-needed-entries -Wl,-z,relro -Wl,-z,combreloc -rdynamic CMakeFiles/elektra-export-symbols.dir/exportsymbols.c.o -o ../../../bin/elektra-export-symbols make[2]: Leaving directory '/tmp/B.crNwZC/BUILD/elektra-0.8.23/build' make[1]: Entering directory '/tmp/B.crNwZC/BUILD/elektra-0.8.23/build' [ 6%] Built target io-adapter-dbus make[1]: Leaving directory '/tmp/B.crNwZC/BUILD/elektra-0.8.23/build' make[2]: Entering directory '/tmp/B.crNwZC/BUILD/elektra-0.8.23/build' [ 6%] Building C object src/bindings/io/uv/CMakeFiles/OBJ_elektra-io-uv.dir/io_uv.c.o cd /tmp/B.crNwZC/BUILD/elektra-0.8.23/build/src/bindings/io/uv && /usr/bin/x86_64-pld-linux-gnux32-gcc -DHAVE_LIBUV1 -I/tmp/B.crNwZC/BUILD/elektra-0.8.23/build/src/include -I/tmp/B.crNwZC/BUILD/elektra-0.8.23/src/include -std=gnu99 -Wno-deprecated-declarations -Wstrict-prototypes -Wno-long-long -pedantic -Wno-variadic-macros -Wall -Wextra -Wno-overlength-strings -Wsign-compare -Wfloat-equal -Wformat -Wformat-security -Wshadow -Wcomments -Wtrigraphs -Wundef -Wuninitialized -Winit-self -Wmaybe-uninitialized -Wsign-compare -Wfloat-equal -O2 -fwrapv -pipe -Wformat -Werror=format-security -gdwarf-4 -fno-debug-types-section -fvar-tracking-assignments -g2 -Wp,-D_FORTIFY_SOURCE=2 -fstack-protector-strong --param=ssp-buffer-size=4 -Werror=trampolines -fPIC -mtune=generic -march=x86-64 -gdwarf-4 -fno-debug-types-section -fvar-tracking-assignments -g2 -DNDEBUG -DQT_NO_DEBUG -o CMakeFiles/OBJ_elektra-io-uv.dir/io_uv.c.o -c /tmp/B.crNwZC/BUILD/elektra-0.8.23/src/bindings/io/uv/io_uv.c make[2]: Leaving directory '/tmp/B.crNwZC/BUILD/elektra-0.8.23/build' make[1]: Entering directory '/tmp/B.crNwZC/BUILD/elektra-0.8.23/build' [ 6%] Built target elektra-export-symbols make[1]: Leaving directory '/tmp/B.crNwZC/BUILD/elektra-0.8.23/build' /usr/bin/make -f src/bindings/swig/lua/CMakeFiles/swig-lua_swig_compilation.dir/build.make src/bindings/swig/lua/CMakeFiles/swig-lua_swig_compilation.dir/depend make[1]: Entering directory '/tmp/B.crNwZC/BUILD/elektra-0.8.23/build' [ 6%] Built target OBJ_elektra-io-uv make[1]: Leaving directory '/tmp/B.crNwZC/BUILD/elektra-0.8.23/build' /usr/bin/make -f src/bindings/swig/ruby/CMakeFiles/swig-ruby-tools_swig_compilation.dir/build.make src/bindings/swig/ruby/CMakeFiles/swig-ruby-tools_swig_compilation.dir/depend make[2]: Entering directory '/tmp/B.crNwZC/BUILD/elektra-0.8.23/build' cd /tmp/B.crNwZC/BUILD/elektra-0.8.23/build && /usr/bin/cmake -E cmake_depends "Unix Makefiles" /tmp/B.crNwZC/BUILD/elektra-0.8.23 /tmp/B.crNwZC/BUILD/elektra-0.8.23/src/bindings/swig/lua /tmp/B.crNwZC/BUILD/elektra-0.8.23/build /tmp/B.crNwZC/BUILD/elektra-0.8.23/build/src/bindings/swig/lua /tmp/B.crNwZC/BUILD/elektra-0.8.23/build/src/bindings/swig/lua/CMakeFiles/swig-lua_swig_compilation.dir/DependInfo.cmake --color= Scanning dependencies of target swig-lua_swig_compilation make[2]: Leaving directory '/tmp/B.crNwZC/BUILD/elektra-0.8.23/build' /usr/bin/make -f src/bindings/swig/lua/CMakeFiles/swig-lua_swig_compilation.dir/build.make src/bindings/swig/lua/CMakeFiles/swig-lua_swig_compilation.dir/build make[2]: Entering directory '/tmp/B.crNwZC/BUILD/elektra-0.8.23/build' cd /tmp/B.crNwZC/BUILD/elektra-0.8.23/build && /usr/bin/cmake -E cmake_depends "Unix Makefiles" /tmp/B.crNwZC/BUILD/elektra-0.8.23 /tmp/B.crNwZC/BUILD/elektra-0.8.23/src/bindings/swig/ruby /tmp/B.crNwZC/BUILD/elektra-0.8.23/build /tmp/B.crNwZC/BUILD/elektra-0.8.23/build/src/bindings/swig/ruby /tmp/B.crNwZC/BUILD/elektra-0.8.23/build/src/bindings/swig/ruby/CMakeFiles/swig-ruby-tools_swig_compilation.dir/DependInfo.cmake --color= Scanning dependencies of target swig-ruby-tools_swig_compilation make[2]: Leaving directory '/tmp/B.crNwZC/BUILD/elektra-0.8.23/build' /usr/bin/make -f src/bindings/swig/ruby/CMakeFiles/swig-ruby-tools_swig_compilation.dir/build.make src/bindings/swig/ruby/CMakeFiles/swig-ruby-tools_swig_compilation.dir/build make[2]: Entering directory '/tmp/B.crNwZC/BUILD/elektra-0.8.23/build' [ 6%] Swig compile kdb.i for lua cd /tmp/B.crNwZC/BUILD/elektra-0.8.23/build/src/bindings/swig/lua && /usr/bin/cmake -E make_directory /tmp/B.crNwZC/BUILD/elektra-0.8.23/build/src/bindings/swig/lua /tmp/B.crNwZC/BUILD/elektra-0.8.23/build/src/bindings/swig/lua cd /tmp/B.crNwZC/BUILD/elektra-0.8.23/build/src/bindings/swig/lua && /usr/bin/cmake -E touch /tmp/B.crNwZC/BUILD/elektra-0.8.23/build/src/bindings/swig/lua/CMakeFiles/swig-lua.dir/kdbLUA.stamp cd /tmp/B.crNwZC/BUILD/elektra-0.8.23/build/src/bindings/swig/lua && /usr/bin/cmake -E env SWIG_LIB=/usr/share/swig/4.0.1 /usr/bin/swig -lua -O -outdir /tmp/B.crNwZC/BUILD/elektra-0.8.23/build/src/bindings/swig/lua -c++ -I/tmp/B.crNwZC/BUILD/elektra-0.8.23/build/src/include -I/tmp/B.crNwZC/BUILD/elektra-0.8.23/src/include -I/tmp/B.crNwZC/BUILD/elektra-0.8.23/build/src/bindings/cpp/include -I/tmp/B.crNwZC/BUILD/elektra-0.8.23/src/bindings/cpp/include -I/usr/include/lua5.3 -I/tmp/B.crNwZC/BUILD/elektra-0.8.23/src/bindings/swig/lua -o /tmp/B.crNwZC/BUILD/elektra-0.8.23/build/src/bindings/swig/lua/kdbLUA_wrap.cxx /tmp/B.crNwZC/BUILD/elektra-0.8.23/src/bindings/swig/lua/kdb.i make[2]: Leaving directory '/tmp/B.crNwZC/BUILD/elektra-0.8.23/build' make[1]: Entering directory '/tmp/B.crNwZC/BUILD/elektra-0.8.23/build' [ 7%] Built target swig-lua_swig_compilation make[1]: Leaving directory '/tmp/B.crNwZC/BUILD/elektra-0.8.23/build' /usr/bin/make -f src/bindings/swig/ruby/CMakeFiles/swig-ruby_swig_compilation.dir/build.make src/bindings/swig/ruby/CMakeFiles/swig-ruby_swig_compilation.dir/depend make[2]: Entering directory '/tmp/B.crNwZC/BUILD/elektra-0.8.23/build' cd /tmp/B.crNwZC/BUILD/elektra-0.8.23/build && /usr/bin/cmake -E cmake_depends "Unix Makefiles" /tmp/B.crNwZC/BUILD/elektra-0.8.23 /tmp/B.crNwZC/BUILD/elektra-0.8.23/src/bindings/swig/ruby /tmp/B.crNwZC/BUILD/elektra-0.8.23/build /tmp/B.crNwZC/BUILD/elektra-0.8.23/build/src/bindings/swig/ruby /tmp/B.crNwZC/BUILD/elektra-0.8.23/build/src/bindings/swig/ruby/CMakeFiles/swig-ruby_swig_compilation.dir/DependInfo.cmake --color= Scanning dependencies of target swig-ruby_swig_compilation make[2]: Leaving directory '/tmp/B.crNwZC/BUILD/elektra-0.8.23/build' /usr/bin/make -f src/bindings/swig/ruby/CMakeFiles/swig-ruby_swig_compilation.dir/build.make src/bindings/swig/ruby/CMakeFiles/swig-ruby_swig_compilation.dir/build make[2]: Entering directory '/tmp/B.crNwZC/BUILD/elektra-0.8.23/build' [ 6%] Swig compile kdb.i for python cd /tmp/B.crNwZC/BUILD/elektra-0.8.23/build/src/bindings/swig/python && /usr/bin/cmake -E make_directory /tmp/B.crNwZC/BUILD/elektra-0.8.23/build/src/bindings/swig/python /tmp/B.crNwZC/BUILD/elektra-0.8.23/build/src/bindings/swig/python cd /tmp/B.crNwZC/BUILD/elektra-0.8.23/build/src/bindings/swig/python && /usr/bin/cmake -E touch /tmp/B.crNwZC/BUILD/elektra-0.8.23/build/src/bindings/swig/python/CMakeFiles/_swig-python.dir/kdbPYTHON.stamp cd /tmp/B.crNwZC/BUILD/elektra-0.8.23/build/src/bindings/swig/python && /usr/bin/cmake -E env SWIG_LIB=/usr/share/swig/4.0.1 /usr/bin/swig -python -O -py3 -extranative -outdir /tmp/B.crNwZC/BUILD/elektra-0.8.23/build/src/bindings/swig/python -c++ -interface _kdb -I/tmp/B.crNwZC/BUILD/elektra-0.8.23/build/src/include -I/tmp/B.crNwZC/BUILD/elektra-0.8.23/src/include -I/tmp/B.crNwZC/BUILD/elektra-0.8.23/build/src/bindings/cpp/include -I/tmp/B.crNwZC/BUILD/elektra-0.8.23/src/bindings/cpp/include -I/usr/include/python3.9 -I/tmp/B.crNwZC/BUILD/elektra-0.8.23/src/bindings/swig/python -o /tmp/B.crNwZC/BUILD/elektra-0.8.23/build/src/bindings/swig/python/kdbPYTHON_wrap.cxx /tmp/B.crNwZC/BUILD/elektra-0.8.23/src/bindings/swig/python/kdb.i make[2]: Leaving directory '/tmp/B.crNwZC/BUILD/elektra-0.8.23/build' make[2]: Entering directory '/tmp/B.crNwZC/BUILD/elektra-0.8.23/build' [ 6%] Swig compile kdb.i for python cd /tmp/B.crNwZC/BUILD/elektra-0.8.23/build/src/bindings/swig/python2 && /usr/bin/cmake -E make_directory /tmp/B.crNwZC/BUILD/elektra-0.8.23/build/src/bindings/swig/python2 /tmp/B.crNwZC/BUILD/elektra-0.8.23/build/src/bindings/swig/python2 cd /tmp/B.crNwZC/BUILD/elektra-0.8.23/build/src/bindings/swig/python2 && /usr/bin/cmake -E touch /tmp/B.crNwZC/BUILD/elektra-0.8.23/build/src/bindings/swig/python2/CMakeFiles/_swig-python2.dir/kdbPYTHON.stamp cd /tmp/B.crNwZC/BUILD/elektra-0.8.23/build/src/bindings/swig/python2 && /usr/bin/cmake -E env SWIG_LIB=/usr/share/swig/4.0.1 /usr/bin/swig -python -O -extranative -outdir /tmp/B.crNwZC/BUILD/elektra-0.8.23/build/src/bindings/swig/python2 -c++ -interface _kdb -I/tmp/B.crNwZC/BUILD/elektra-0.8.23/build/src/include -I/tmp/B.crNwZC/BUILD/elektra-0.8.23/src/include -I/tmp/B.crNwZC/BUILD/elektra-0.8.23/build/src/bindings/cpp/include -I/tmp/B.crNwZC/BUILD/elektra-0.8.23/src/bindings/cpp/include -I/usr/include/python2.7 -I/tmp/B.crNwZC/BUILD/elektra-0.8.23/src/bindings/swig/python2 -o /tmp/B.crNwZC/BUILD/elektra-0.8.23/build/src/bindings/swig/python2/kdbPYTHON_wrap.cxx /tmp/B.crNwZC/BUILD/elektra-0.8.23/src/bindings/swig/python2/kdb.i make[2]: Leaving directory '/tmp/B.crNwZC/BUILD/elektra-0.8.23/build' make[1]: Entering directory '/tmp/B.crNwZC/BUILD/elektra-0.8.23/build' [ 7%] Built target swig-python_swig_compilation make[1]: Leaving directory '/tmp/B.crNwZC/BUILD/elektra-0.8.23/build' /usr/bin/make -f src/include/CMakeFiles/elektra_config_headers.dir/build.make src/include/CMakeFiles/elektra_config_headers.dir/depend make[1]: Entering directory '/tmp/B.crNwZC/BUILD/elektra-0.8.23/build' [ 7%] Built target swig-python2_swig_compilation make[1]: Leaving directory '/tmp/B.crNwZC/BUILD/elektra-0.8.23/build' /usr/bin/make -f src/bindings/io/glib/CMakeFiles/OBJ_elektra-io-glib.dir/build.make src/bindings/io/glib/CMakeFiles/OBJ_elektra-io-glib.dir/depend make[2]: Entering directory '/tmp/B.crNwZC/BUILD/elektra-0.8.23/build' cd /tmp/B.crNwZC/BUILD/elektra-0.8.23/build && /usr/bin/cmake -E cmake_depends "Unix Makefiles" /tmp/B.crNwZC/BUILD/elektra-0.8.23 /tmp/B.crNwZC/BUILD/elektra-0.8.23/src/include /tmp/B.crNwZC/BUILD/elektra-0.8.23/build /tmp/B.crNwZC/BUILD/elektra-0.8.23/build/src/include /tmp/B.crNwZC/BUILD/elektra-0.8.23/build/src/include/CMakeFiles/elektra_config_headers.dir/DependInfo.cmake --color= Scanning dependencies of target elektra_config_headers make[2]: Leaving directory '/tmp/B.crNwZC/BUILD/elektra-0.8.23/build' /usr/bin/make -f src/include/CMakeFiles/elektra_config_headers.dir/build.make src/include/CMakeFiles/elektra_config_headers.dir/build make[2]: Nothing to be done for 'src/include/CMakeFiles/elektra_config_headers.dir/build'. make[2]: Entering directory '/tmp/B.crNwZC/BUILD/elektra-0.8.23/build' cd /tmp/B.crNwZC/BUILD/elektra-0.8.23/build && /usr/bin/cmake -E cmake_depends "Unix Makefiles" /tmp/B.crNwZC/BUILD/elektra-0.8.23 /tmp/B.crNwZC/BUILD/elektra-0.8.23/src/bindings/io/glib /tmp/B.crNwZC/BUILD/elektra-0.8.23/build /tmp/B.crNwZC/BUILD/elektra-0.8.23/build/src/bindings/io/glib /tmp/B.crNwZC/BUILD/elektra-0.8.23/build/src/bindings/io/glib/CMakeFiles/OBJ_elektra-io-glib.dir/DependInfo.cmake --color= Scanning dependencies of target OBJ_elektra-io-glib make[2]: Leaving directory '/tmp/B.crNwZC/BUILD/elektra-0.8.23/build' /usr/bin/make -f src/bindings/io/glib/CMakeFiles/OBJ_elektra-io-glib.dir/build.make src/bindings/io/glib/CMakeFiles/OBJ_elektra-io-glib.dir/build make[1]: Entering directory '/tmp/B.crNwZC/BUILD/elektra-0.8.23/build' [ 7%] Built target elektra_config_headers make[1]: Leaving directory '/tmp/B.crNwZC/BUILD/elektra-0.8.23/build' /usr/bin/make -f src/tools/kdb/CMakeFiles/kdb-objects.dir/build.make src/tools/kdb/CMakeFiles/kdb-objects.dir/depend make[2]: Entering directory '/tmp/B.crNwZC/BUILD/elektra-0.8.23/build' cd /tmp/B.crNwZC/BUILD/elektra-0.8.23/build && /usr/bin/cmake -E cmake_depends "Unix Makefiles" /tmp/B.crNwZC/BUILD/elektra-0.8.23 /tmp/B.crNwZC/BUILD/elektra-0.8.23/src/tools/kdb /tmp/B.crNwZC/BUILD/elektra-0.8.23/build /tmp/B.crNwZC/BUILD/elektra-0.8.23/build/src/tools/kdb /tmp/B.crNwZC/BUILD/elektra-0.8.23/build/src/tools/kdb/CMakeFiles/kdb-objects.dir/DependInfo.cmake --color= Scanning dependencies of target kdb-objects make[2]: Leaving directory '/tmp/B.crNwZC/BUILD/elektra-0.8.23/build' /usr/bin/make -f src/tools/kdb/CMakeFiles/kdb-objects.dir/build.make src/tools/kdb/CMakeFiles/kdb-objects.dir/build make[2]: Entering directory '/tmp/B.crNwZC/BUILD/elektra-0.8.23/build' [ 6%] Building CXX object gtest/CMakeFiles/gtest_main.dir/src/gtest_main.cc.o cd /tmp/B.crNwZC/BUILD/elektra-0.8.23/build/gtest && /usr/bin/x86_64-pld-linux-gnux32-g++ -DGTEST_HAS_PTHREAD=1 -I/tmp/B.crNwZC/BUILD/elektra-0.8.23/tests/gtest-1.7.0/include -I/tmp/B.crNwZC/BUILD/elektra-0.8.23/tests/gtest-1.7.0 -std=c++11 -Wno-deprecated-declarations -Wold-style-cast -Wstrict-null-sentinel -D_GLIBCXX_USE_NANOSLEEP -Wno-missing-field-initializers -Woverloaded-virtual -Wsign-promo -Wno-long-long -pedantic -Wno-variadic-macros -Wall -Wextra -Wno-overlength-strings -Wsign-compare -Wfloat-equal -Wformat -Wformat-security -Wshadow -Wcomments -Wtrigraphs -Wundef -Wuninitialized -Winit-self -Wmaybe-uninitialized -O2 -fwrapv -pipe -Wformat -Werror=format-security -gdwarf-4 -fno-debug-types-section -fvar-tracking-assignments -g2 -Wp,-D_FORTIFY_SOURCE=2 -fstack-protector-strong --param=ssp-buffer-size=4 -Werror=trampolines -fPIC -mtune=generic -march=x86-64 -gdwarf-4 -fno-debug-types-section -fvar-tracking-assignments -g2 -DNDEBUG -DQT_NO_DEBUG -w -o CMakeFiles/gtest_main.dir/src/gtest_main.cc.o -c /tmp/B.crNwZC/BUILD/elektra-0.8.23/tests/gtest-1.7.0/src/gtest_main.cc make[2]: Leaving directory '/tmp/B.crNwZC/BUILD/elektra-0.8.23/build' make[2]: Entering directory '/tmp/B.crNwZC/BUILD/elektra-0.8.23/build' [ 6%] Building CXX object src/error/CMakeFiles/exporttranslations.dir/exporttranslations.cpp.o cd /tmp/B.crNwZC/BUILD/elektra-0.8.23/build/src/error && /usr/bin/x86_64-pld-linux-gnux32-g++ -std=c++11 -Wno-deprecated-declarations -Wold-style-cast -Wstrict-null-sentinel -D_GLIBCXX_USE_NANOSLEEP -Wno-missing-field-initializers -Woverloaded-virtual -Wsign-promo -Wno-long-long -pedantic -Wno-variadic-macros -Wall -Wextra -Wno-overlength-strings -Wsign-compare -Wfloat-equal -Wformat -Wformat-security -Wshadow -Wcomments -Wtrigraphs -Wundef -Wuninitialized -Winit-self -Wmaybe-uninitialized -O2 -fwrapv -pipe -Wformat -Werror=format-security -gdwarf-4 -fno-debug-types-section -fvar-tracking-assignments -g2 -Wp,-D_FORTIFY_SOURCE=2 -fstack-protector-strong --param=ssp-buffer-size=4 -Werror=trampolines -fPIC -mtune=generic -march=x86-64 -gdwarf-4 -fno-debug-types-section -fvar-tracking-assignments -g2 -DNDEBUG -DQT_NO_DEBUG -o CMakeFiles/exporttranslations.dir/exporttranslations.cpp.o -c /tmp/B.crNwZC/BUILD/elektra-0.8.23/src/error/exporttranslations.cpp make[2]: Leaving directory '/tmp/B.crNwZC/BUILD/elektra-0.8.23/build' make[2]: Entering directory '/tmp/B.crNwZC/BUILD/elektra-0.8.23/build' [ 7%] Swig compile kdb.i for ruby cd /tmp/B.crNwZC/BUILD/elektra-0.8.23/build/src/bindings/swig/ruby && /usr/bin/cmake -E make_directory /tmp/B.crNwZC/BUILD/elektra-0.8.23/build/src/bindings/swig/ruby /tmp/B.crNwZC/BUILD/elektra-0.8.23/build/src/bindings/swig/ruby cd /tmp/B.crNwZC/BUILD/elektra-0.8.23/build/src/bindings/swig/ruby && /usr/bin/cmake -E touch /tmp/B.crNwZC/BUILD/elektra-0.8.23/build/src/bindings/swig/ruby/CMakeFiles/swig-ruby.dir/kdbRUBY.stamp cd /tmp/B.crNwZC/BUILD/elektra-0.8.23/build/src/bindings/swig/ruby && /usr/bin/cmake -E env SWIG_LIB=/usr/share/swig/4.0.1 /usr/bin/swig -ruby -O -autorename -DSWIG_NO_EXPORT_ITERATOR_METHODS -DSWIG_WITHOUT_OVERRIDE -initname _kdb -outdir /tmp/B.crNwZC/BUILD/elektra-0.8.23/build/src/bindings/swig/ruby -c++ -I/tmp/B.crNwZC/BUILD/elektra-0.8.23/build/src/include -I/tmp/B.crNwZC/BUILD/elektra-0.8.23/src/include -I/tmp/B.crNwZC/BUILD/elektra-0.8.23/build/src/bindings/cpp/include -I/tmp/B.crNwZC/BUILD/elektra-0.8.23/src/bindings/cpp/include -I/tmp/B.crNwZC/BUILD/elektra-0.8.23/build/src/libs/tools/include -I/tmp/B.crNwZC/BUILD/elektra-0.8.23/src/libs/tools/include -I/tmp/B.crNwZC/BUILD/elektra-0.8.23/src/bindings/swig/ruby -I/usr/libx32/ruby/vendor_ruby/2.6 -I/usr/include/ruby-2.6 -o /tmp/B.crNwZC/BUILD/elektra-0.8.23/build/src/bindings/swig/ruby/kdbRUBY_wrap.cxx /tmp/B.crNwZC/BUILD/elektra-0.8.23/src/bindings/swig/ruby/kdb.i make[2]: Leaving directory '/tmp/B.crNwZC/BUILD/elektra-0.8.23/build' make[2]: Entering directory '/tmp/B.crNwZC/BUILD/elektra-0.8.23/build' [ 7%] Linking CXX static library ../lib/libgtest_main.a cd /tmp/B.crNwZC/BUILD/elektra-0.8.23/build/gtest && /usr/bin/cmake -P CMakeFiles/gtest_main.dir/cmake_clean_target.cmake cd /tmp/B.crNwZC/BUILD/elektra-0.8.23/build/gtest && /usr/bin/cmake -E cmake_link_script CMakeFiles/gtest_main.dir/link.txt --verbose=1 /usr/bin/ar qc ../lib/libgtest_main.a CMakeFiles/gtest_main.dir/src/gtest_main.cc.o /usr/bin/ranlib ../lib/libgtest_main.a make[2]: Leaving directory '/tmp/B.crNwZC/BUILD/elektra-0.8.23/build' make[1]: Entering directory '/tmp/B.crNwZC/BUILD/elektra-0.8.23/build' [ 7%] Built target swig-ruby_swig_compilation make[1]: Leaving directory '/tmp/B.crNwZC/BUILD/elektra-0.8.23/build' /usr/bin/make -f doc/CMakeFiles/html.dir/build.make doc/CMakeFiles/html.dir/depend make[1]: Entering directory '/tmp/B.crNwZC/BUILD/elektra-0.8.23/build' [ 7%] Built target gtest_main make[1]: Leaving directory '/tmp/B.crNwZC/BUILD/elektra-0.8.23/build' make[2]: Entering directory '/tmp/B.crNwZC/BUILD/elektra-0.8.23/build' [ 7%] Building C object src/bindings/io/glib/CMakeFiles/OBJ_elektra-io-glib.dir/io_glib.c.o cd /tmp/B.crNwZC/BUILD/elektra-0.8.23/build/src/bindings/io/glib && /usr/bin/x86_64-pld-linux-gnux32-gcc -I/tmp/B.crNwZC/BUILD/elektra-0.8.23/build/src/include -I/tmp/B.crNwZC/BUILD/elektra-0.8.23/src/include -isystem /usr/include/glib-2.0 -isystem /usr/libx32/glib-2.0/include -std=gnu99 -Wno-deprecated-declarations -Wstrict-prototypes -Wno-long-long -pedantic -Wno-variadic-macros -Wall -Wextra -Wno-overlength-strings -Wsign-compare -Wfloat-equal -Wformat -Wformat-security -Wshadow -Wcomments -Wtrigraphs -Wundef -Wuninitialized -Winit-self -Wmaybe-uninitialized -Wsign-compare -Wfloat-equal -O2 -fwrapv -pipe -Wformat -Werror=format-security -gdwarf-4 -fno-debug-types-section -fvar-tracking-assignments -g2 -Wp,-D_FORTIFY_SOURCE=2 -fstack-protector-strong --param=ssp-buffer-size=4 -Werror=trampolines -fPIC -mtune=generic -march=x86-64 -gdwarf-4 -fno-debug-types-section -fvar-tracking-assignments -g2 -DNDEBUG -DQT_NO_DEBUG -o CMakeFiles/OBJ_elektra-io-glib.dir/io_glib.c.o -c /tmp/B.crNwZC/BUILD/elektra-0.8.23/src/bindings/io/glib/io_glib.c make[2]: Leaving directory '/tmp/B.crNwZC/BUILD/elektra-0.8.23/build' make[1]: Entering directory '/tmp/B.crNwZC/BUILD/elektra-0.8.23/build' [ 7%] Built target OBJ_elektra-io-glib make[1]: Leaving directory '/tmp/B.crNwZC/BUILD/elektra-0.8.23/build' /usr/bin/make -f doc/help/CMakeFiles/man.dir/build.make doc/help/CMakeFiles/man.dir/depend make[2]: Entering directory '/tmp/B.crNwZC/BUILD/elektra-0.8.23/build' cd /tmp/B.crNwZC/BUILD/elektra-0.8.23/build && /usr/bin/cmake -E cmake_depends "Unix Makefiles" /tmp/B.crNwZC/BUILD/elektra-0.8.23 /tmp/B.crNwZC/BUILD/elektra-0.8.23/doc /tmp/B.crNwZC/BUILD/elektra-0.8.23/build /tmp/B.crNwZC/BUILD/elektra-0.8.23/build/doc /tmp/B.crNwZC/BUILD/elektra-0.8.23/build/doc/CMakeFiles/html.dir/DependInfo.cmake --color= Scanning dependencies of target html make[2]: Leaving directory '/tmp/B.crNwZC/BUILD/elektra-0.8.23/build' /usr/bin/make -f doc/CMakeFiles/html.dir/build.make doc/CMakeFiles/html.dir/build make[2]: Entering directory '/tmp/B.crNwZC/BUILD/elektra-0.8.23/build' cd /tmp/B.crNwZC/BUILD/elektra-0.8.23/build && /usr/bin/cmake -E cmake_depends "Unix Makefiles" /tmp/B.crNwZC/BUILD/elektra-0.8.23 /tmp/B.crNwZC/BUILD/elektra-0.8.23/doc/help /tmp/B.crNwZC/BUILD/elektra-0.8.23/build /tmp/B.crNwZC/BUILD/elektra-0.8.23/build/doc/help /tmp/B.crNwZC/BUILD/elektra-0.8.23/build/doc/help/CMakeFiles/man.dir/DependInfo.cmake --color= Scanning dependencies of target man make[2]: Leaving directory '/tmp/B.crNwZC/BUILD/elektra-0.8.23/build' /usr/bin/make -f doc/help/CMakeFiles/man.dir/build.make doc/help/CMakeFiles/man.dir/build make[2]: Nothing to be done for 'doc/help/CMakeFiles/man.dir/build'. make[1]: Entering directory '/tmp/B.crNwZC/BUILD/elektra-0.8.23/build' [ 7%] Built target man make[1]: Leaving directory '/tmp/B.crNwZC/BUILD/elektra-0.8.23/build' make[2]: Entering directory '/tmp/B.crNwZC/BUILD/elektra-0.8.23/build' [ 7%] Building CXX object src/tools/kdb/CMakeFiles/kdb-objects.dir/ansicolors.cpp.o cd /tmp/B.crNwZC/BUILD/elektra-0.8.23/build/src/tools/kdb && /usr/bin/x86_64-pld-linux-gnux32-g++ -I/tmp/B.crNwZC/BUILD/elektra-0.8.23/build/src/include -I/tmp/B.crNwZC/BUILD/elektra-0.8.23/src/include -I/tmp/B.crNwZC/BUILD/elektra-0.8.23/build/src/bindings/cpp/include -I/tmp/B.crNwZC/BUILD/elektra-0.8.23/src/bindings/cpp/include -I/tmp/B.crNwZC/BUILD/elektra-0.8.23/build/src/libs/tools/include -I/tmp/B.crNwZC/BUILD/elektra-0.8.23/src/libs/tools/include -I/tmp/B.crNwZC/BUILD/elektra-0.8.23/src/tools/kdb -std=c++11 -Wno-deprecated-declarations -Wold-style-cast -Wstrict-null-sentinel -D_GLIBCXX_USE_NANOSLEEP -Wno-missing-field-initializers -Woverloaded-virtual -Wsign-promo -Wno-long-long -pedantic -Wno-variadic-macros -Wall -Wextra -Wno-overlength-strings -Wsign-compare -Wfloat-equal -Wformat -Wformat-security -Wshadow -Wcomments -Wtrigraphs -Wundef -Wuninitialized -Winit-self -Wmaybe-uninitialized -O2 -fwrapv -pipe -Wformat -Werror=format-security -gdwarf-4 -fno-debug-types-section -fvar-tracking-assignments -g2 -Wp,-D_FORTIFY_SOURCE=2 -fstack-protector-strong --param=ssp-buffer-size=4 -Werror=trampolines -fPIC -mtune=generic -march=x86-64 -gdwarf-4 -fno-debug-types-section -fvar-tracking-assignments -g2 -DNDEBUG -DQT_NO_DEBUG -o CMakeFiles/kdb-objects.dir/ansicolors.cpp.o -c /tmp/B.crNwZC/BUILD/elektra-0.8.23/src/tools/kdb/ansicolors.cpp make[2]: Leaving directory '/tmp/B.crNwZC/BUILD/elektra-0.8.23/build' make[2]: Entering directory '/tmp/B.crNwZC/BUILD/elektra-0.8.23/build' [ 6%] Building CXX object src/error/CMakeFiles/exporttranslations.dir/parser.cpp.o cd /tmp/B.crNwZC/BUILD/elektra-0.8.23/build/src/error && /usr/bin/x86_64-pld-linux-gnux32-g++ -std=c++11 -Wno-deprecated-declarations -Wold-style-cast -Wstrict-null-sentinel -D_GLIBCXX_USE_NANOSLEEP -Wno-missing-field-initializers -Woverloaded-virtual -Wsign-promo -Wno-long-long -pedantic -Wno-variadic-macros -Wall -Wextra -Wno-overlength-strings -Wsign-compare -Wfloat-equal -Wformat -Wformat-security -Wshadow -Wcomments -Wtrigraphs -Wundef -Wuninitialized -Winit-self -Wmaybe-uninitialized -O2 -fwrapv -pipe -Wformat -Werror=format-security -gdwarf-4 -fno-debug-types-section -fvar-tracking-assignments -g2 -Wp,-D_FORTIFY_SOURCE=2 -fstack-protector-strong --param=ssp-buffer-size=4 -Werror=trampolines -fPIC -mtune=generic -march=x86-64 -gdwarf-4 -fno-debug-types-section -fvar-tracking-assignments -g2 -DNDEBUG -DQT_NO_DEBUG -o CMakeFiles/exporttranslations.dir/parser.cpp.o -c /tmp/B.crNwZC/BUILD/elektra-0.8.23/src/error/parser.cpp make[2]: Leaving directory '/tmp/B.crNwZC/BUILD/elektra-0.8.23/build' make[2]: Entering directory '/tmp/B.crNwZC/BUILD/elektra-0.8.23/build' [ 7%] Linking CXX executable ../../bin/exporttranslations cd /tmp/B.crNwZC/BUILD/elektra-0.8.23/build/src/error && /usr/bin/cmake -E cmake_link_script CMakeFiles/exporttranslations.dir/link.txt --verbose=1 /usr/bin/x86_64-pld-linux-gnux32-g++ -std=c++11 -Wno-deprecated-declarations -Wold-style-cast -Wstrict-null-sentinel -D_GLIBCXX_USE_NANOSLEEP -Wno-missing-field-initializers -Woverloaded-virtual -Wsign-promo -Wno-long-long -pedantic -Wno-variadic-macros -Wall -Wextra -Wno-overlength-strings -Wsign-compare -Wfloat-equal -Wformat -Wformat-security -Wshadow -Wcomments -Wtrigraphs -Wundef -Wuninitialized -Winit-self -Wmaybe-uninitialized -O2 -fwrapv -pipe -Wformat -Werror=format-security -gdwarf-4 -fno-debug-types-section -fvar-tracking-assignments -g2 -Wp,-D_FORTIFY_SOURCE=2 -fstack-protector-strong --param=ssp-buffer-size=4 -Werror=trampolines -fPIC -mtune=generic -march=x86-64 -gdwarf-4 -fno-debug-types-section -fvar-tracking-assignments -g2 -DNDEBUG -DQT_NO_DEBUG -Wl,--as-needed -Wl,--no-copy-dt-needed-entries -Wl,-z,relro -Wl,-z,combreloc -rdynamic CMakeFiles/exporttranslations.dir/exporttranslations.cpp.o CMakeFiles/exporttranslations.dir/parser.cpp.o -o ../../bin/exporttranslations make[2]: Leaving directory '/tmp/B.crNwZC/BUILD/elektra-0.8.23/build' make[1]: Entering directory '/tmp/B.crNwZC/BUILD/elektra-0.8.23/build' [ 7%] Built target exporttranslations make[1]: Leaving directory '/tmp/B.crNwZC/BUILD/elektra-0.8.23/build' make[2]: Entering directory '/tmp/B.crNwZC/BUILD/elektra-0.8.23/build' [ 7%] Building CXX object src/tools/kdb/CMakeFiles/kdb-objects.dir/command.cpp.o cd /tmp/B.crNwZC/BUILD/elektra-0.8.23/build/src/tools/kdb && /usr/bin/x86_64-pld-linux-gnux32-g++ -I/tmp/B.crNwZC/BUILD/elektra-0.8.23/build/src/include -I/tmp/B.crNwZC/BUILD/elektra-0.8.23/src/include -I/tmp/B.crNwZC/BUILD/elektra-0.8.23/build/src/bindings/cpp/include -I/tmp/B.crNwZC/BUILD/elektra-0.8.23/src/bindings/cpp/include -I/tmp/B.crNwZC/BUILD/elektra-0.8.23/build/src/libs/tools/include -I/tmp/B.crNwZC/BUILD/elektra-0.8.23/src/libs/tools/include -I/tmp/B.crNwZC/BUILD/elektra-0.8.23/src/tools/kdb -std=c++11 -Wno-deprecated-declarations -Wold-style-cast -Wstrict-null-sentinel -D_GLIBCXX_USE_NANOSLEEP -Wno-missing-field-initializers -Woverloaded-virtual -Wsign-promo -Wno-long-long -pedantic -Wno-variadic-macros -Wall -Wextra -Wno-overlength-strings -Wsign-compare -Wfloat-equal -Wformat -Wformat-security -Wshadow -Wcomments -Wtrigraphs -Wundef -Wuninitialized -Winit-self -Wmaybe-uninitialized -O2 -fwrapv -pipe -Wformat -Werror=format-security -gdwarf-4 -fno-debug-types-section -fvar-tracking-assignments -g2 -Wp,-D_FORTIFY_SOURCE=2 -fstack-protector-strong --param=ssp-buffer-size=4 -Werror=trampolines -fPIC -mtune=generic -march=x86-64 -gdwarf-4 -fno-debug-types-section -fvar-tracking-assignments -g2 -DNDEBUG -DQT_NO_DEBUG -o CMakeFiles/kdb-objects.dir/command.cpp.o -c /tmp/B.crNwZC/BUILD/elektra-0.8.23/src/tools/kdb/command.cpp make[2]: Leaving directory '/tmp/B.crNwZC/BUILD/elektra-0.8.23/build' make[2]: Entering directory '/tmp/B.crNwZC/BUILD/elektra-0.8.23/build' [ 7%] Swig compile kdbtools.i for ruby cd /tmp/B.crNwZC/BUILD/elektra-0.8.23/build/src/bindings/swig/ruby && /usr/bin/cmake -E make_directory /tmp/B.crNwZC/BUILD/elektra-0.8.23/build/src/bindings/swig/ruby /tmp/B.crNwZC/BUILD/elektra-0.8.23/build/src/bindings/swig/ruby cd /tmp/B.crNwZC/BUILD/elektra-0.8.23/build/src/bindings/swig/ruby && /usr/bin/cmake -E touch /tmp/B.crNwZC/BUILD/elektra-0.8.23/build/src/bindings/swig/ruby/CMakeFiles/swig-ruby-tools.dir/kdbtoolsRUBY.stamp cd /tmp/B.crNwZC/BUILD/elektra-0.8.23/build/src/bindings/swig/ruby && /usr/bin/cmake -E env SWIG_LIB=/usr/share/swig/4.0.1 /usr/bin/swig -ruby -O -autorename -DSWIG_NO_EXPORT_ITERATOR_METHODS -DSWIG_WITHOUT_OVERRIDE -initname _kdbtools -minherit -outdir /tmp/B.crNwZC/BUILD/elektra-0.8.23/build/src/bindings/swig/ruby -c++ -I/tmp/B.crNwZC/BUILD/elektra-0.8.23/build/src/include -I/tmp/B.crNwZC/BUILD/elektra-0.8.23/src/include -I/tmp/B.crNwZC/BUILD/elektra-0.8.23/build/src/bindings/cpp/include -I/tmp/B.crNwZC/BUILD/elektra-0.8.23/src/bindings/cpp/include -I/tmp/B.crNwZC/BUILD/elektra-0.8.23/build/src/libs/tools/include -I/tmp/B.crNwZC/BUILD/elektra-0.8.23/src/libs/tools/include -I/tmp/B.crNwZC/BUILD/elektra-0.8.23/src/bindings/swig/ruby -I/usr/libx32/ruby/vendor_ruby/2.6 -I/usr/include/ruby-2.6 -o /tmp/B.crNwZC/BUILD/elektra-0.8.23/build/src/bindings/swig/ruby/kdbtoolsRUBY_wrap.cxx /tmp/B.crNwZC/BUILD/elektra-0.8.23/src/bindings/swig/ruby/kdbtools.i make[2]: Leaving directory '/tmp/B.crNwZC/BUILD/elektra-0.8.23/build' make[1]: Entering directory '/tmp/B.crNwZC/BUILD/elektra-0.8.23/build' [ 8%] Built target swig-ruby-tools_swig_compilation make[1]: Leaving directory '/tmp/B.crNwZC/BUILD/elektra-0.8.23/build' make[2]: Entering directory '/tmp/B.crNwZC/BUILD/elektra-0.8.23/build' [ 6%] Building CXX object src/error/CMakeFiles/elektra-export-errors.dir/exporterrors.cpp.o cd /tmp/B.crNwZC/BUILD/elektra-0.8.23/build/src/error && /usr/bin/x86_64-pld-linux-gnux32-g++ -std=c++11 -Wno-deprecated-declarations -Wold-style-cast -Wstrict-null-sentinel -D_GLIBCXX_USE_NANOSLEEP -Wno-missing-field-initializers -Woverloaded-virtual -Wsign-promo -Wno-long-long -pedantic -Wno-variadic-macros -Wall -Wextra -Wno-overlength-strings -Wsign-compare -Wfloat-equal -Wformat -Wformat-security -Wshadow -Wcomments -Wtrigraphs -Wundef -Wuninitialized -Winit-self -Wmaybe-uninitialized -O2 -fwrapv -pipe -Wformat -Werror=format-security -gdwarf-4 -fno-debug-types-section -fvar-tracking-assignments -g2 -Wp,-D_FORTIFY_SOURCE=2 -fstack-protector-strong --param=ssp-buffer-size=4 -Werror=trampolines -fPIC -mtune=generic -march=x86-64 -gdwarf-4 -fno-debug-types-section -fvar-tracking-assignments -g2 -DNDEBUG -DQT_NO_DEBUG -o CMakeFiles/elektra-export-errors.dir/exporterrors.cpp.o -c /tmp/B.crNwZC/BUILD/elektra-0.8.23/src/error/exporterrors.cpp make[2]: Leaving directory '/tmp/B.crNwZC/BUILD/elektra-0.8.23/build' make[2]: Entering directory '/tmp/B.crNwZC/BUILD/elektra-0.8.23/build' [ 7%] Building CXX object src/tools/kdb/CMakeFiles/kdb-objects.dir/cmdline.cpp.o cd /tmp/B.crNwZC/BUILD/elektra-0.8.23/build/src/tools/kdb && /usr/bin/x86_64-pld-linux-gnux32-g++ -I/tmp/B.crNwZC/BUILD/elektra-0.8.23/build/src/include -I/tmp/B.crNwZC/BUILD/elektra-0.8.23/src/include -I/tmp/B.crNwZC/BUILD/elektra-0.8.23/build/src/bindings/cpp/include -I/tmp/B.crNwZC/BUILD/elektra-0.8.23/src/bindings/cpp/include -I/tmp/B.crNwZC/BUILD/elektra-0.8.23/build/src/libs/tools/include -I/tmp/B.crNwZC/BUILD/elektra-0.8.23/src/libs/tools/include -I/tmp/B.crNwZC/BUILD/elektra-0.8.23/src/tools/kdb -std=c++11 -Wno-deprecated-declarations -Wold-style-cast -Wstrict-null-sentinel -D_GLIBCXX_USE_NANOSLEEP -Wno-missing-field-initializers -Woverloaded-virtual -Wsign-promo -Wno-long-long -pedantic -Wno-variadic-macros -Wall -Wextra -Wno-overlength-strings -Wsign-compare -Wfloat-equal -Wformat -Wformat-security -Wshadow -Wcomments -Wtrigraphs -Wundef -Wuninitialized -Winit-self -Wmaybe-uninitialized -O2 -fwrapv -pipe -Wformat -Werror=format-security -gdwarf-4 -fno-debug-types-section -fvar-tracking-assignments -g2 -Wp,-D_FORTIFY_SOURCE=2 -fstack-protector-strong --param=ssp-buffer-size=4 -Werror=trampolines -fPIC -mtune=generic -march=x86-64 -gdwarf-4 -fno-debug-types-section -fvar-tracking-assignments -g2 -DNDEBUG -DQT_NO_DEBUG -o CMakeFiles/kdb-objects.dir/cmdline.cpp.o -c /tmp/B.crNwZC/BUILD/elektra-0.8.23/src/tools/kdb/cmdline.cpp /tmp/B.crNwZC/BUILD/elektra-0.8.23/src/tools/kdb/cmdline.cpp: In constructor 'Cmdline::Cmdline(int, char**, Command*)': /tmp/B.crNwZC/BUILD/elektra-0.8.23/src/tools/kdb/cmdline.cpp:39:99: error: 'numeric_limits' was not declared in this scope 39 | debug (), force (), load (), humanReadable (), help (), interactive (), minDepth (0), maxDepth (numeric_limits<int>::max ()), | ^~~~~~~~~~~~~~ /tmp/B.crNwZC/BUILD/elektra-0.8.23/src/tools/kdb/cmdline.cpp:39:114: error: expected primary-expression before 'int' 39 | debug (), force (), load (), humanReadable (), help (), interactive (), minDepth (0), maxDepth (numeric_limits<int>::max ()), | ^~~ /tmp/B.crNwZC/BUILD/elektra-0.8.23/src/tools/kdb/cmdline.cpp:418:59: error: expected primary-expression before 'int' 418 | maxDepth = numeric_limits<int>::max (); | ^~~ make[2]: *** [src/tools/kdb/CMakeFiles/kdb-objects.dir/build.make:112: src/tools/kdb/CMakeFiles/kdb-objects.dir/cmdline.cpp.o] Error 1 make[2]: Leaving directory '/tmp/B.crNwZC/BUILD/elektra-0.8.23/build' make[2]: *** Waiting for unfinished jobs.... make[2]: Entering directory '/tmp/B.crNwZC/BUILD/elektra-0.8.23/build' [ 7%] Building CXX object src/error/CMakeFiles/elektra-export-errors.dir/parser.cpp.o cd /tmp/B.crNwZC/BUILD/elektra-0.8.23/build/src/error && /usr/bin/x86_64-pld-linux-gnux32-g++ -std=c++11 -Wno-deprecated-declarations -Wold-style-cast -Wstrict-null-sentinel -D_GLIBCXX_USE_NANOSLEEP -Wno-missing-field-initializers -Woverloaded-virtual -Wsign-promo -Wno-long-long -pedantic -Wno-variadic-macros -Wall -Wextra -Wno-overlength-strings -Wsign-compare -Wfloat-equal -Wformat -Wformat-security -Wshadow -Wcomments -Wtrigraphs -Wundef -Wuninitialized -Winit-self -Wmaybe-uninitialized -O2 -fwrapv -pipe -Wformat -Werror=format-security -gdwarf-4 -fno-debug-types-section -fvar-tracking-assignments -g2 -Wp,-D_FORTIFY_SOURCE=2 -fstack-protector-strong --param=ssp-buffer-size=4 -Werror=trampolines -fPIC -mtune=generic -march=x86-64 -gdwarf-4 -fno-debug-types-section -fvar-tracking-assignments -g2 -DNDEBUG -DQT_NO_DEBUG -o CMakeFiles/elektra-export-errors.dir/parser.cpp.o -c /tmp/B.crNwZC/BUILD/elektra-0.8.23/src/error/parser.cpp make[2]: Leaving directory '/tmp/B.crNwZC/BUILD/elektra-0.8.23/build' make[2]: Entering directory '/tmp/B.crNwZC/BUILD/elektra-0.8.23/build' [ 8%] Linking CXX executable ../../bin/elektra-export-errors cd /tmp/B.crNwZC/BUILD/elektra-0.8.23/build/src/error && /usr/bin/cmake -E cmake_link_script CMakeFiles/elektra-export-errors.dir/link.txt --verbose=1 /usr/bin/x86_64-pld-linux-gnux32-g++ -std=c++11 -Wno-deprecated-declarations -Wold-style-cast -Wstrict-null-sentinel -D_GLIBCXX_USE_NANOSLEEP -Wno-missing-field-initializers -Woverloaded-virtual -Wsign-promo -Wno-long-long -pedantic -Wno-variadic-macros -Wall -Wextra -Wno-overlength-strings -Wsign-compare -Wfloat-equal -Wformat -Wformat-security -Wshadow -Wcomments -Wtrigraphs -Wundef -Wuninitialized -Winit-self -Wmaybe-uninitialized -O2 -fwrapv -pipe -Wformat -Werror=format-security -gdwarf-4 -fno-debug-types-section -fvar-tracking-assignments -g2 -Wp,-D_FORTIFY_SOURCE=2 -fstack-protector-strong --param=ssp-buffer-size=4 -Werror=trampolines -fPIC -mtune=generic -march=x86-64 -gdwarf-4 -fno-debug-types-section -fvar-tracking-assignments -g2 -DNDEBUG -DQT_NO_DEBUG -Wl,--as-needed -Wl,--no-copy-dt-needed-entries -Wl,-z,relro -Wl,-z,combreloc -rdynamic CMakeFiles/elektra-export-errors.dir/exporterrors.cpp.o CMakeFiles/elektra-export-errors.dir/parser.cpp.o -o ../../bin/elektra-export-errors make[2]: Leaving directory '/tmp/B.crNwZC/BUILD/elektra-0.8.23/build' make[1]: Entering directory '/tmp/B.crNwZC/BUILD/elektra-0.8.23/build' [ 8%] Built target elektra-export-errors make[1]: Leaving directory '/tmp/B.crNwZC/BUILD/elektra-0.8.23/build' /usr/bin/make -f src/error/CMakeFiles/kdberrors_generated.dir/build.make src/error/CMakeFiles/kdberrors_generated.dir/depend make[2]: Entering directory '/tmp/B.crNwZC/BUILD/elektra-0.8.23/build' cd /tmp/B.crNwZC/BUILD/elektra-0.8.23/build && /usr/bin/cmake -E cmake_depends "Unix Makefiles" /tmp/B.crNwZC/BUILD/elektra-0.8.23 /tmp/B.crNwZC/BUILD/elektra-0.8.23/src/error /tmp/B.crNwZC/BUILD/elektra-0.8.23/build /tmp/B.crNwZC/BUILD/elektra-0.8.23/build/src/error /tmp/B.crNwZC/BUILD/elektra-0.8.23/build/src/error/CMakeFiles/kdberrors_generated.dir/DependInfo.cmake --color= Scanning dependencies of target kdberrors_generated make[2]: Leaving directory '/tmp/B.crNwZC/BUILD/elektra-0.8.23/build' /usr/bin/make -f src/error/CMakeFiles/kdberrors_generated.dir/build.make src/error/CMakeFiles/kdberrors_generated.dir/build make[2]: Entering directory '/tmp/B.crNwZC/BUILD/elektra-0.8.23/build' [ 8%] Generating ../include/kdberrors.h cd /tmp/B.crNwZC/BUILD/elektra-0.8.23/build/src/error && ../../bin/elektra-export-errors /tmp/B.crNwZC/BUILD/elektra-0.8.23/src/error/specification /tmp/B.crNwZC/BUILD/elektra-0.8.23/build/src/include/kdberrors.h make[2]: Leaving directory '/tmp/B.crNwZC/BUILD/elektra-0.8.23/build' make[1]: Entering directory '/tmp/B.crNwZC/BUILD/elektra-0.8.23/build' [ 8%] Built target kdberrors_generated make[1]: Leaving directory '/tmp/B.crNwZC/BUILD/elektra-0.8.23/build' /usr/bin/make -f src/libs/elektra/CMakeFiles/elektra-core.dir/build.make src/libs/elektra/CMakeFiles/elektra-core.dir/depend /usr/bin/make -f src/plugins/augeas/CMakeFiles/elektra-augeas-objects.dir/build.make src/plugins/augeas/CMakeFiles/elektra-augeas-objects.dir/depend make[2]: Entering directory '/tmp/B.crNwZC/BUILD/elektra-0.8.23/build' cd /tmp/B.crNwZC/BUILD/elektra-0.8.23/build && /usr/bin/cmake -E cmake_depends "Unix Makefiles" /tmp/B.crNwZC/BUILD/elektra-0.8.23 /tmp/B.crNwZC/BUILD/elektra-0.8.23/src/plugins/augeas /tmp/B.crNwZC/BUILD/elektra-0.8.23/build /tmp/B.crNwZC/BUILD/elektra-0.8.23/build/src/plugins/augeas /tmp/B.crNwZC/BUILD/elektra-0.8.23/build/src/plugins/augeas/CMakeFiles/elektra-augeas-objects.dir/DependInfo.cmake --color= Scanning dependencies of target elektra-augeas-objects make[2]: Leaving directory '/tmp/B.crNwZC/BUILD/elektra-0.8.23/build' /usr/bin/make -f src/plugins/augeas/CMakeFiles/elektra-augeas-objects.dir/build.make src/plugins/augeas/CMakeFiles/elektra-augeas-objects.dir/build make[2]: Entering directory '/tmp/B.crNwZC/BUILD/elektra-0.8.23/build' [ 8%] Generating exported_symbols.h cd /tmp/B.crNwZC/BUILD/elektra-0.8.23/build/src/libs/elektra && ../../../bin/elektra-export-symbols resolver_fm_hpu_b dump augeas base64 blockresolver boolean c cachefilter camel ccode conditionals constants counter crypto_gcrypt crypto_openssl csvstorage curlget date dbus dbusrecv desktop dini directoryvalue doc dpkg dump enum error fcrypt file filecheck fstab gitresolver glob hexcode hidden hosts iconv ini internalnotification ipaddr iterate journald keytometa line lineendings list logchange lua mathcheck mini mozprefs multifile network ni noresolver null passwd path profile python python2 range regexstore rename required resolver_fm_b_b resolver_fm_hb_b resolver_fm_hp_b resolver_fm_hpu_b resolver_fm_pb_b resolver_fm_ub_x resolver_fm_uhb_xb resolver_fm_xb_x resolver_fm_xhp_x resolver_fm_xp_x ruby semlock shell simpleini simplespeclang spec struct sync syslog tcl template timeofday tracer type uname validation wresolver xerces xmltool yajl yamlcpp Exporting symbols for dump augeas base64 blockresolver boolean c cachefilter camel ccode conditionals constants counter crypto_gcrypt crypto_openssl csvstorage curlget date dbus dbusrecv desktop dini directoryvalue doc dpkg dump enum error fcrypt file filecheck fstab gitresolver glob hexcode hidden hosts iconv ini internalnotification ipaddr iterate journald keytometa line lineendings list logchange lua mathcheck mini mozprefs multifile network ni noresolver null passwd path profile python python2 range regexstore rename required resolver_fm_b_b resolver_fm_hb_b resolver_fm_hp_b resolver_fm_hpu_b resolver_fm_pb_b resolver_fm_ub_x resolver_fm_uhb_xb resolver_fm_xb_x resolver_fm_xhp_x resolver_fm_xp_x ruby semlock shell simpleini simplespeclang spec struct sync syslog tcl template timeofday tracer type uname validation wresolver xerces xmltool yajl yamlcpp make[2]: Leaving directory '/tmp/B.crNwZC/BUILD/elektra-0.8.23/build' make[2]: Entering directory '/tmp/B.crNwZC/BUILD/elektra-0.8.23/build' cd /tmp/B.crNwZC/BUILD/elektra-0.8.23/build && /usr/bin/cmake -E cmake_depends "Unix Makefiles" /tmp/B.crNwZC/BUILD/elektra-0.8.23 /tmp/B.crNwZC/BUILD/elektra-0.8.23/src/libs/elektra /tmp/B.crNwZC/BUILD/elektra-0.8.23/build /tmp/B.crNwZC/BUILD/elektra-0.8.23/build/src/libs/elektra /tmp/B.crNwZC/BUILD/elektra-0.8.23/build/src/libs/elektra/CMakeFiles/elektra-core.dir/DependInfo.cmake --color= Scanning dependencies of target elektra-core make[2]: Leaving directory '/tmp/B.crNwZC/BUILD/elektra-0.8.23/build' /usr/bin/make -f src/libs/elektra/CMakeFiles/elektra-core.dir/build.make src/libs/elektra/CMakeFiles/elektra-core.dir/build make[2]: Entering directory '/tmp/B.crNwZC/BUILD/elektra-0.8.23/build' [ 8%] Building C object src/libs/elektra/CMakeFiles/elektra-core.dir/global.c.o cd /tmp/B.crNwZC/BUILD/elektra-0.8.23/build/src/libs/elektra && /usr/bin/x86_64-pld-linux-gnux32-gcc -DHAVE_KDBCONFIG_H -Delektra_core_EXPORTS -I/tmp/B.crNwZC/BUILD/elektra-0.8.23/build/src/include -I/tmp/B.crNwZC/BUILD/elektra-0.8.23/src/include -I/tmp/B.crNwZC/BUILD/elektra-0.8.23/build/src/libs/elektra -std=gnu99 -Wno-deprecated-declarations -Wstrict-prototypes -Wno-long-long -pedantic -Wno-variadic-macros -Wall -Wextra -Wno-overlength-strings -Wsign-compare -Wfloat-equal -Wformat -Wformat-security -Wshadow -Wcomments -Wtrigraphs -Wundef -Wuninitialized -Winit-self -Wmaybe-uninitialized -Wsign-compare -Wfloat-equal -O2 -fwrapv -pipe -Wformat -Werror=format-security -gdwarf-4 -fno-debug-types-section -fvar-tracking-assignments -g2 -Wp,-D_FORTIFY_SOURCE=2 -fstack-protector-strong --param=ssp-buffer-size=4 -Werror=trampolines -fPIC -mtune=generic -march=x86-64 -gdwarf-4 -fno-debug-types-section -fvar-tracking-assignments -g2 -DNDEBUG -DQT_NO_DEBUG -fPIC -o CMakeFiles/elektra-core.dir/global.c.o -c /tmp/B.crNwZC/BUILD/elektra-0.8.23/src/libs/elektra/global.c make[2]: Leaving directory '/tmp/B.crNwZC/BUILD/elektra-0.8.23/build' make[2]: Entering directory '/tmp/B.crNwZC/BUILD/elektra-0.8.23/build' [ 7%] Building CXX object src/tools/kdb/CMakeFiles/kdb-objects.dir/check.cpp.o cd /tmp/B.crNwZC/BUILD/elektra-0.8.23/build/src/tools/kdb && /usr/bin/x86_64-pld-linux-gnux32-g++ -I/tmp/B.crNwZC/BUILD/elektra-0.8.23/build/src/include -I/tmp/B.crNwZC/BUILD/elektra-0.8.23/src/include -I/tmp/B.crNwZC/BUILD/elektra-0.8.23/build/src/bindings/cpp/include -I/tmp/B.crNwZC/BUILD/elektra-0.8.23/src/bindings/cpp/include -I/tmp/B.crNwZC/BUILD/elektra-0.8.23/build/src/libs/tools/include -I/tmp/B.crNwZC/BUILD/elektra-0.8.23/src/libs/tools/include -I/tmp/B.crNwZC/BUILD/elektra-0.8.23/src/tools/kdb -std=c++11 -Wno-deprecated-declarations -Wold-style-cast -Wstrict-null-sentinel -D_GLIBCXX_USE_NANOSLEEP -Wno-missing-field-initializers -Woverloaded-virtual -Wsign-promo -Wno-long-long -pedantic -Wno-variadic-macros -Wall -Wextra -Wno-overlength-strings -Wsign-compare -Wfloat-equal -Wformat -Wformat-security -Wshadow -Wcomments -Wtrigraphs -Wundef -Wuninitialized -Winit-self -Wmaybe-uninitialized -O2 -fwrapv -pipe -Wformat -Werror=format-security -gdwarf-4 -fno-debug-types-section -fvar-tracking-assignments -g2 -Wp,-D_FORTIFY_SOURCE=2 -fstack-protector-strong --param=ssp-buffer-size=4 -Werror=trampolines -fPIC -mtune=generic -march=x86-64 -gdwarf-4 -fno-debug-types-section -fvar-tracking-assignments -g2 -DNDEBUG -DQT_NO_DEBUG -o CMakeFiles/kdb-objects.dir/check.cpp.o -c /tmp/B.crNwZC/BUILD/elektra-0.8.23/src/tools/kdb/check.cpp make[2]: Leaving directory '/tmp/B.crNwZC/BUILD/elektra-0.8.23/build' make[2]: Entering directory '/tmp/B.crNwZC/BUILD/elektra-0.8.23/build' [ 8%] Building C object src/libs/elektra/CMakeFiles/elektra-core.dir/kdbenum.c.o cd /tmp/B.crNwZC/BUILD/elektra-0.8.23/build/src/libs/elektra && /usr/bin/x86_64-pld-linux-gnux32-gcc -DHAVE_KDBCONFIG_H -Delektra_core_EXPORTS -I/tmp/B.crNwZC/BUILD/elektra-0.8.23/build/src/include -I/tmp/B.crNwZC/BUILD/elektra-0.8.23/src/include -I/tmp/B.crNwZC/BUILD/elektra-0.8.23/build/src/libs/elektra -std=gnu99 -Wno-deprecated-declarations -Wstrict-prototypes -Wno-long-long -pedantic -Wno-variadic-macros -Wall -Wextra -Wno-overlength-strings -Wsign-compare -Wfloat-equal -Wformat -Wformat-security -Wshadow -Wcomments -Wtrigraphs -Wundef -Wuninitialized -Winit-self -Wmaybe-uninitialized -Wsign-compare -Wfloat-equal -O2 -fwrapv -pipe -Wformat -Werror=format-security -gdwarf-4 -fno-debug-types-section -fvar-tracking-assignments -g2 -Wp,-D_FORTIFY_SOURCE=2 -fstack-protector-strong --param=ssp-buffer-size=4 -Werror=trampolines -fPIC -mtune=generic -march=x86-64 -gdwarf-4 -fno-debug-types-section -fvar-tracking-assignments -g2 -DNDEBUG -DQT_NO_DEBUG -fPIC -o CMakeFiles/elektra-core.dir/kdbenum.c.o -c /tmp/B.crNwZC/BUILD/elektra-0.8.23/src/libs/elektra/kdbenum.c make[2]: Leaving directory '/tmp/B.crNwZC/BUILD/elektra-0.8.23/build' make[2]: Entering directory '/tmp/B.crNwZC/BUILD/elektra-0.8.23/build' [ 8%] Building CXX object src/tools/kdb/CMakeFiles/kdb-objects.dir/convert.cpp.o cd /tmp/B.crNwZC/BUILD/elektra-0.8.23/build/src/tools/kdb && /usr/bin/x86_64-pld-linux-gnux32-g++ -I/tmp/B.crNwZC/BUILD/elektra-0.8.23/build/src/include -I/tmp/B.crNwZC/BUILD/elektra-0.8.23/src/include -I/tmp/B.crNwZC/BUILD/elektra-0.8.23/build/src/bindings/cpp/include -I/tmp/B.crNwZC/BUILD/elektra-0.8.23/src/bindings/cpp/include -I/tmp/B.crNwZC/BUILD/elektra-0.8.23/build/src/libs/tools/include -I/tmp/B.crNwZC/BUILD/elektra-0.8.23/src/libs/tools/include -I/tmp/B.crNwZC/BUILD/elektra-0.8.23/src/tools/kdb -std=c++11 -Wno-deprecated-declarations -Wold-style-cast -Wstrict-null-sentinel -D_GLIBCXX_USE_NANOSLEEP -Wno-missing-field-initializers -Woverloaded-virtual -Wsign-promo -Wno-long-long -pedantic -Wno-variadic-macros -Wall -Wextra -Wno-overlength-strings -Wsign-compare -Wfloat-equal -Wformat -Wformat-security -Wshadow -Wcomments -Wtrigraphs -Wundef -Wuninitialized -Winit-self -Wmaybe-uninitialized -O2 -fwrapv -pipe -Wformat -Werror=format-security -gdwarf-4 -fno-debug-types-section -fvar-tracking-assignments -g2 -Wp,-D_FORTIFY_SOURCE=2 -fstack-protector-strong --param=ssp-buffer-size=4 -Werror=trampolines -fPIC -mtune=generic -march=x86-64 -gdwarf-4 -fno-debug-types-section -fvar-tracking-assignments -g2 -DNDEBUG -DQT_NO_DEBUG -o CMakeFiles/kdb-objects.dir/convert.cpp.o -c /tmp/B.crNwZC/BUILD/elektra-0.8.23/src/tools/kdb/convert.cpp make[2]: Leaving directory '/tmp/B.crNwZC/BUILD/elektra-0.8.23/build' make[2]: Entering directory '/tmp/B.crNwZC/BUILD/elektra-0.8.23/build' [ 8%] Building C object src/libs/elektra/CMakeFiles/elektra-core.dir/internal.c.o cd /tmp/B.crNwZC/BUILD/elektra-0.8.23/build/src/libs/elektra && /usr/bin/x86_64-pld-linux-gnux32-gcc -DHAVE_KDBCONFIG_H -Delektra_core_EXPORTS -I/tmp/B.crNwZC/BUILD/elektra-0.8.23/build/src/include -I/tmp/B.crNwZC/BUILD/elektra-0.8.23/src/include -I/tmp/B.crNwZC/BUILD/elektra-0.8.23/build/src/libs/elektra -std=gnu99 -Wno-deprecated-declarations -Wstrict-prototypes -Wno-long-long -pedantic -Wno-variadic-macros -Wall -Wextra -Wno-overlength-strings -Wsign-compare -Wfloat-equal -Wformat -Wformat-security -Wshadow -Wcomments -Wtrigraphs -Wundef -Wuninitialized -Winit-self -Wmaybe-uninitialized -Wsign-compare -Wfloat-equal -O2 -fwrapv -pipe -Wformat -Werror=format-security -gdwarf-4 -fno-debug-types-section -fvar-tracking-assignments -g2 -Wp,-D_FORTIFY_SOURCE=2 -fstack-protector-strong --param=ssp-buffer-size=4 -Werror=trampolines -fPIC -mtune=generic -march=x86-64 -gdwarf-4 -fno-debug-types-section -fvar-tracking-assignments -g2 -DNDEBUG -DQT_NO_DEBUG -fPIC -o CMakeFiles/elektra-core.dir/internal.c.o -c /tmp/B.crNwZC/BUILD/elektra-0.8.23/src/libs/elektra/internal.c make[2]: Leaving directory '/tmp/B.crNwZC/BUILD/elektra-0.8.23/build' make[2]: Entering directory '/tmp/B.crNwZC/BUILD/elektra-0.8.23/build' [ 8%] Building C object src/libs/elektra/CMakeFiles/elektra-core.dir/key.c.o cd /tmp/B.crNwZC/BUILD/elektra-0.8.23/build/src/libs/elektra && /usr/bin/x86_64-pld-linux-gnux32-gcc -DHAVE_KDBCONFIG_H -Delektra_core_EXPORTS -I/tmp/B.crNwZC/BUILD/elektra-0.8.23/build/src/include -I/tmp/B.crNwZC/BUILD/elektra-0.8.23/src/include -I/tmp/B.crNwZC/BUILD/elektra-0.8.23/build/src/libs/elektra -std=gnu99 -Wno-deprecated-declarations -Wstrict-prototypes -Wno-long-long -pedantic -Wno-variadic-macros -Wall -Wextra -Wno-overlength-strings -Wsign-compare -Wfloat-equal -Wformat -Wformat-security -Wshadow -Wcomments -Wtrigraphs -Wundef -Wuninitialized -Winit-self -Wmaybe-uninitialized -Wsign-compare -Wfloat-equal -O2 -fwrapv -pipe -Wformat -Werror=format-security -gdwarf-4 -fno-debug-types-section -fvar-tracking-assignments -g2 -Wp,-D_FORTIFY_SOURCE=2 -fstack-protector-strong --param=ssp-buffer-size=4 -Werror=trampolines -fPIC -mtune=generic -march=x86-64 -gdwarf-4 -fno-debug-types-section -fvar-tracking-assignments -g2 -DNDEBUG -DQT_NO_DEBUG -fPIC -o CMakeFiles/elektra-core.dir/key.c.o -c /tmp/B.crNwZC/BUILD/elektra-0.8.23/src/libs/elektra/key.c make[2]: Leaving directory '/tmp/B.crNwZC/BUILD/elektra-0.8.23/build' make[2]: Entering directory '/tmp/B.crNwZC/BUILD/elektra-0.8.23/build' [ 8%] Building C object src/plugins/augeas/CMakeFiles/elektra-augeas-objects.dir/augeas.c.o cd /tmp/B.crNwZC/BUILD/elektra-0.8.23/build/src/plugins/augeas && /usr/bin/x86_64-pld-linux-gnux32-gcc -DELEKTRA_STATIC -DHAVE_KDBCONFIG_H -DLIBAUGEAS_PREFIX=\"/usr\" -DPLUGIN_SHORT_NAME=augeas -DREADME=readme_augeas.c -I/tmp/B.crNwZC/BUILD/elektra-0.8.23/build/src/include -I/tmp/B.crNwZC/BUILD/elektra-0.8.23/src/include -I/usr/include/libxml2 -I/tmp/B.crNwZC/BUILD/elektra-0.8.23/build/src/plugins/augeas -std=gnu99 -Wno-deprecated-declarations -Wstrict-prototypes -Wno-long-long -pedantic -Wno-variadic-macros -Wall -Wextra -Wno-overlength-strings -Wsign-compare -Wfloat-equal -Wformat -Wformat-security -Wshadow -Wcomments -Wtrigraphs -Wundef -Wuninitialized -Winit-self -Wmaybe-uninitialized -Wsign-compare -Wfloat-equal -O2 -fwrapv -pipe -Wformat -Werror=format-security -gdwarf-4 -fno-debug-types-section -fvar-tracking-assignments -g2 -Wp,-D_FORTIFY_SOURCE=2 -fstack-protector-strong --param=ssp-buffer-size=4 -Werror=trampolines -fPIC -mtune=generic -march=x86-64 -gdwarf-4 -fno-debug-types-section -fvar-tracking-assignments -g2 -DNDEBUG -DQT_NO_DEBUG -fPIC -o CMakeFiles/elektra-augeas-objects.dir/augeas.c.o -c /tmp/B.crNwZC/BUILD/elektra-0.8.23/src/plugins/augeas/augeas.c make[2]: Leaving directory '/tmp/B.crNwZC/BUILD/elektra-0.8.23/build' make[1]: Entering directory '/tmp/B.crNwZC/BUILD/elektra-0.8.23/build' [ 8%] Built target elektra-augeas-objects make[1]: Leaving directory '/tmp/B.crNwZC/BUILD/elektra-0.8.23/build' /usr/bin/make -f src/plugins/base64/CMakeFiles/elektra-base64-objects.dir/build.make src/plugins/base64/CMakeFiles/elektra-base64-objects.dir/depend make[2]: Entering directory '/tmp/B.crNwZC/BUILD/elektra-0.8.23/build' [ 8%] Building C object src/libs/elektra/CMakeFiles/elektra-core.dir/keymeta.c.o cd /tmp/B.crNwZC/BUILD/elektra-0.8.23/build/src/libs/elektra && /usr/bin/x86_64-pld-linux-gnux32-gcc -DHAVE_KDBCONFIG_H -Delektra_core_EXPORTS -I/tmp/B.crNwZC/BUILD/elektra-0.8.23/build/src/include -I/tmp/B.crNwZC/BUILD/elektra-0.8.23/src/include -I/tmp/B.crNwZC/BUILD/elektra-0.8.23/build/src/libs/elektra -std=gnu99 -Wno-deprecated-declarations -Wstrict-prototypes -Wno-long-long -pedantic -Wno-variadic-macros -Wall -Wextra -Wno-overlength-strings -Wsign-compare -Wfloat-equal -Wformat -Wformat-security -Wshadow -Wcomments -Wtrigraphs -Wundef -Wuninitialized -Winit-self -Wmaybe-uninitialized -Wsign-compare -Wfloat-equal -O2 -fwrapv -pipe -Wformat -Werror=format-security -gdwarf-4 -fno-debug-types-section -fvar-tracking-assignments -g2 -Wp,-D_FORTIFY_SOURCE=2 -fstack-protector-strong --param=ssp-buffer-size=4 -Werror=trampolines -fPIC -mtune=generic -march=x86-64 -gdwarf-4 -fno-debug-types-section -fvar-tracking-assignments -g2 -DNDEBUG -DQT_NO_DEBUG -fPIC -o CMakeFiles/elektra-core.dir/keymeta.c.o -c /tmp/B.crNwZC/BUILD/elektra-0.8.23/src/libs/elektra/keymeta.c make[2]: Leaving directory '/tmp/B.crNwZC/BUILD/elektra-0.8.23/build' make[2]: Entering directory '/tmp/B.crNwZC/BUILD/elektra-0.8.23/build' cd /tmp/B.crNwZC/BUILD/elektra-0.8.23/build && /usr/bin/cmake -E cmake_depends "Unix Makefiles" /tmp/B.crNwZC/BUILD/elektra-0.8.23 /tmp/B.crNwZC/BUILD/elektra-0.8.23/src/plugins/base64 /tmp/B.crNwZC/BUILD/elektra-0.8.23/build /tmp/B.crNwZC/BUILD/elektra-0.8.23/build/src/plugins/base64 /tmp/B.crNwZC/BUILD/elektra-0.8.23/build/src/plugins/base64/CMakeFiles/elektra-base64-objects.dir/DependInfo.cmake --color= Scanning dependencies of target elektra-base64-objects make[2]: Leaving directory '/tmp/B.crNwZC/BUILD/elektra-0.8.23/build' /usr/bin/make -f src/plugins/base64/CMakeFiles/elektra-base64-objects.dir/build.make src/plugins/base64/CMakeFiles/elektra-base64-objects.dir/build make[2]: Entering directory '/tmp/B.crNwZC/BUILD/elektra-0.8.23/build' [ 8%] Building C object src/libs/elektra/CMakeFiles/elektra-core.dir/keyhelpers.c.o cd /tmp/B.crNwZC/BUILD/elektra-0.8.23/build/src/libs/elektra && /usr/bin/x86_64-pld-linux-gnux32-gcc -DHAVE_KDBCONFIG_H -Delektra_core_EXPORTS -I/tmp/B.crNwZC/BUILD/elektra-0.8.23/build/src/include -I/tmp/B.crNwZC/BUILD/elektra-0.8.23/src/include -I/tmp/B.crNwZC/BUILD/elektra-0.8.23/build/src/libs/elektra -std=gnu99 -Wno-deprecated-declarations -Wstrict-prototypes -Wno-long-long -pedantic -Wno-variadic-macros -Wall -Wextra -Wno-overlength-strings -Wsign-compare -Wfloat-equal -Wformat -Wformat-security -Wshadow -Wcomments -Wtrigraphs -Wundef -Wuninitialized -Winit-self -Wmaybe-uninitialized -Wsign-compare -Wfloat-equal -O2 -fwrapv -pipe -Wformat -Werror=format-security -gdwarf-4 -fno-debug-types-section -fvar-tracking-assignments -g2 -Wp,-D_FORTIFY_SOURCE=2 -fstack-protector-strong --param=ssp-buffer-size=4 -Werror=trampolines -fPIC -mtune=generic -march=x86-64 -gdwarf-4 -fno-debug-types-section -fvar-tracking-assignments -g2 -DNDEBUG -DQT_NO_DEBUG -fPIC -o CMakeFiles/elektra-core.dir/keyhelpers.c.o -c /tmp/B.crNwZC/BUILD/elektra-0.8.23/src/libs/elektra/keyhelpers.c make[2]: Leaving directory '/tmp/B.crNwZC/BUILD/elektra-0.8.23/build' make[2]: Entering directory '/tmp/B.crNwZC/BUILD/elektra-0.8.23/build' [ 8%] Building CXX object src/tools/kdb/CMakeFiles/kdb-objects.dir/cp.cpp.o cd /tmp/B.crNwZC/BUILD/elektra-0.8.23/build/src/tools/kdb && /usr/bin/x86_64-pld-linux-gnux32-g++ -I/tmp/B.crNwZC/BUILD/elektra-0.8.23/build/src/include -I/tmp/B.crNwZC/BUILD/elektra-0.8.23/src/include -I/tmp/B.crNwZC/BUILD/elektra-0.8.23/build/src/bindings/cpp/include -I/tmp/B.crNwZC/BUILD/elektra-0.8.23/src/bindings/cpp/include -I/tmp/B.crNwZC/BUILD/elektra-0.8.23/build/src/libs/tools/include -I/tmp/B.crNwZC/BUILD/elektra-0.8.23/src/libs/tools/include -I/tmp/B.crNwZC/BUILD/elektra-0.8.23/src/tools/kdb -std=c++11 -Wno-deprecated-declarations -Wold-style-cast -Wstrict-null-sentinel -D_GLIBCXX_USE_NANOSLEEP -Wno-missing-field-initializers -Woverloaded-virtual -Wsign-promo -Wno-long-long -pedantic -Wno-variadic-macros -Wall -Wextra -Wno-overlength-strings -Wsign-compare -Wfloat-equal -Wformat -Wformat-security -Wshadow -Wcomments -Wtrigraphs -Wundef -Wuninitialized -Winit-self -Wmaybe-uninitialized -O2 -fwrapv -pipe -Wformat -Werror=format-security -gdwarf-4 -fno-debug-types-section -fvar-tracking-assignments -g2 -Wp,-D_FORTIFY_SOURCE=2 -fstack-protector-strong --param=ssp-buffer-size=4 -Werror=trampolines -fPIC -mtune=generic -march=x86-64 -gdwarf-4 -fno-debug-types-section -fvar-tracking-assignments -g2 -DNDEBUG -DQT_NO_DEBUG -o CMakeFiles/kdb-objects.dir/cp.cpp.o -c /tmp/B.crNwZC/BUILD/elektra-0.8.23/src/tools/kdb/cp.cpp make[2]: Leaving directory '/tmp/B.crNwZC/BUILD/elektra-0.8.23/build' make[2]: Entering directory '/tmp/B.crNwZC/BUILD/elektra-0.8.23/build' [ 8%] Building C object src/libs/elektra/CMakeFiles/elektra-core.dir/keyname.c.o cd /tmp/B.crNwZC/BUILD/elektra-0.8.23/build/src/libs/elektra && /usr/bin/x86_64-pld-linux-gnux32-gcc -DHAVE_KDBCONFIG_H -Delektra_core_EXPORTS -I/tmp/B.crNwZC/BUILD/elektra-0.8.23/build/src/include -I/tmp/B.crNwZC/BUILD/elektra-0.8.23/src/include -I/tmp/B.crNwZC/BUILD/elektra-0.8.23/build/src/libs/elektra -std=gnu99 -Wno-deprecated-declarations -Wstrict-prototypes -Wno-long-long -pedantic -Wno-variadic-macros -Wall -Wextra -Wno-overlength-strings -Wsign-compare -Wfloat-equal -Wformat -Wformat-security -Wshadow -Wcomments -Wtrigraphs -Wundef -Wuninitialized -Winit-self -Wmaybe-uninitialized -Wsign-compare -Wfloat-equal -O2 -fwrapv -pipe -Wformat -Werror=format-security -gdwarf-4 -fno-debug-types-section -fvar-tracking-assignments -g2 -Wp,-D_FORTIFY_SOURCE=2 -fstack-protector-strong --param=ssp-buffer-size=4 -Werror=trampolines -fPIC -mtune=generic -march=x86-64 -gdwarf-4 -fno-debug-types-section -fvar-tracking-assignments -g2 -DNDEBUG -DQT_NO_DEBUG -fPIC -o CMakeFiles/elektra-core.dir/keyname.c.o -c /tmp/B.crNwZC/BUILD/elektra-0.8.23/src/libs/elektra/keyname.c make[2]: Leaving directory '/tmp/B.crNwZC/BUILD/elektra-0.8.23/build' make[2]: Entering directory '/tmp/B.crNwZC/BUILD/elektra-0.8.23/build' [ 8%] Building CXX object src/tools/kdb/CMakeFiles/kdb-objects.dir/editor.cpp.o cd /tmp/B.crNwZC/BUILD/elektra-0.8.23/build/src/tools/kdb && /usr/bin/x86_64-pld-linux-gnux32-g++ -I/tmp/B.crNwZC/BUILD/elektra-0.8.23/build/src/include -I/tmp/B.crNwZC/BUILD/elektra-0.8.23/src/include -I/tmp/B.crNwZC/BUILD/elektra-0.8.23/build/src/bindings/cpp/include -I/tmp/B.crNwZC/BUILD/elektra-0.8.23/src/bindings/cpp/include -I/tmp/B.crNwZC/BUILD/elektra-0.8.23/build/src/libs/tools/include -I/tmp/B.crNwZC/BUILD/elektra-0.8.23/src/libs/tools/include -I/tmp/B.crNwZC/BUILD/elektra-0.8.23/src/tools/kdb -std=c++11 -Wno-deprecated-declarations -Wold-style-cast -Wstrict-null-sentinel -D_GLIBCXX_USE_NANOSLEEP -Wno-missing-field-initializers -Woverloaded-virtual -Wsign-promo -Wno-long-long -pedantic -Wno-variadic-macros -Wall -Wextra -Wno-overlength-strings -Wsign-compare -Wfloat-equal -Wformat -Wformat-security -Wshadow -Wcomments -Wtrigraphs -Wundef -Wuninitialized -Winit-self -Wmaybe-uninitialized -O2 -fwrapv -pipe -Wformat -Werror=format-security -gdwarf-4 -fno-debug-types-section -fvar-tracking-assignments -g2 -Wp,-D_FORTIFY_SOURCE=2 -fstack-protector-strong --param=ssp-buffer-size=4 -Werror=trampolines -fPIC -mtune=generic -march=x86-64 -gdwarf-4 -fno-debug-types-section -fvar-tracking-assignments -g2 -DNDEBUG -DQT_NO_DEBUG -o CMakeFiles/kdb-objects.dir/editor.cpp.o -c /tmp/B.crNwZC/BUILD/elektra-0.8.23/src/tools/kdb/editor.cpp make[2]: Leaving directory '/tmp/B.crNwZC/BUILD/elektra-0.8.23/build' make[2]: Entering directory '/tmp/B.crNwZC/BUILD/elektra-0.8.23/build' [ 9%] Building C object src/plugins/base64/CMakeFiles/elektra-base64-objects.dir/base64_functions.c.o cd /tmp/B.crNwZC/BUILD/elektra-0.8.23/build/src/plugins/base64 && /usr/bin/x86_64-pld-linux-gnux32-gcc -DELEKTRA_PLUGIN_NAME=\"base64\" -DELEKTRA_PLUGIN_NAME_C=base64 -DELEKTRA_STATIC -DHAVE_KDBCONFIG_H -DPLUGIN_SHORT_NAME=base64 -DREADME=readme_base64.c -I/tmp/B.crNwZC/BUILD/elektra-0.8.23/build/src/include -I/tmp/B.crNwZC/BUILD/elektra-0.8.23/src/include -I/tmp/B.crNwZC/BUILD/elektra-0.8.23/build/src/plugins/base64 -std=gnu99 -Wno-deprecated-declarations -Wstrict-prototypes -Wno-long-long -pedantic -Wno-variadic-macros -Wall -Wextra -Wno-overlength-strings -Wsign-compare -Wfloat-equal -Wformat -Wformat-security -Wshadow -Wcomments -Wtrigraphs -Wundef -Wuninitialized -Winit-self -Wmaybe-uninitialized -Wsign-compare -Wfloat-equal -O2 -fwrapv -pipe -Wformat -Werror=format-security -gdwarf-4 -fno-debug-types-section -fvar-tracking-assignments -g2 -Wp,-D_FORTIFY_SOURCE=2 -fstack-protector-strong --param=ssp-buffer-size=4 -Werror=trampolines -fPIC -mtune=generic -march=x86-64 -gdwarf-4 -fno-debug-types-section -fvar-tracking-assignments -g2 -DNDEBUG -DQT_NO_DEBUG -fPIC -o CMakeFiles/elektra-base64-objects.dir/base64_functions.c.o -c /tmp/B.crNwZC/BUILD/elektra-0.8.23/src/plugins/base64/base64_functions.c make[2]: Leaving directory '/tmp/B.crNwZC/BUILD/elektra-0.8.23/build' make[2]: Entering directory '/tmp/B.crNwZC/BUILD/elektra-0.8.23/build' [ 9%] Building C object src/libs/elektra/CMakeFiles/elektra-core.dir/keytest.c.o cd /tmp/B.crNwZC/BUILD/elektra-0.8.23/build/src/libs/elektra && /usr/bin/x86_64-pld-linux-gnux32-gcc -DHAVE_KDBCONFIG_H -Delektra_core_EXPORTS -I/tmp/B.crNwZC/BUILD/elektra-0.8.23/build/src/include -I/tmp/B.crNwZC/BUILD/elektra-0.8.23/src/include -I/tmp/B.crNwZC/BUILD/elektra-0.8.23/build/src/libs/elektra -std=gnu99 -Wno-deprecated-declarations -Wstrict-prototypes -Wno-long-long -pedantic -Wno-variadic-macros -Wall -Wextra -Wno-overlength-strings -Wsign-compare -Wfloat-equal -Wformat -Wformat-security -Wshadow -Wcomments -Wtrigraphs -Wundef -Wuninitialized -Winit-self -Wmaybe-uninitialized -Wsign-compare -Wfloat-equal -O2 -fwrapv -pipe -Wformat -Werror=format-security -gdwarf-4 -fno-debug-types-section -fvar-tracking-assignments -g2 -Wp,-D_FORTIFY_SOURCE=2 -fstack-protector-strong --param=ssp-buffer-size=4 -Werror=trampolines -fPIC -mtune=generic -march=x86-64 -gdwarf-4 -fno-debug-types-section -fvar-tracking-assignments -g2 -DNDEBUG -DQT_NO_DEBUG -fPIC -o CMakeFiles/elektra-core.dir/keytest.c.o -c /tmp/B.crNwZC/BUILD/elektra-0.8.23/src/libs/elektra/keytest.c make[2]: Leaving directory '/tmp/B.crNwZC/BUILD/elektra-0.8.23/build' make[2]: Entering directory '/tmp/B.crNwZC/BUILD/elektra-0.8.23/build' [ 10%] Building C object src/libs/elektra/CMakeFiles/elektra-core.dir/nolog.c.o cd /tmp/B.crNwZC/BUILD/elektra-0.8.23/build/src/libs/elektra && /usr/bin/x86_64-pld-linux-gnux32-gcc -DHAVE_KDBCONFIG_H -Delektra_core_EXPORTS -I/tmp/B.crNwZC/BUILD/elektra-0.8.23/build/src/include -I/tmp/B.crNwZC/BUILD/elektra-0.8.23/src/include -I/tmp/B.crNwZC/BUILD/elektra-0.8.23/build/src/libs/elektra -std=gnu99 -Wno-deprecated-declarations -Wstrict-prototypes -Wno-long-long -pedantic -Wno-variadic-macros -Wall -Wextra -Wno-overlength-strings -Wsign-compare -Wfloat-equal -Wformat -Wformat-security -Wshadow -Wcomments -Wtrigraphs -Wundef -Wuninitialized -Winit-self -Wmaybe-uninitialized -Wsign-compare -Wfloat-equal -O2 -fwrapv -pipe -Wformat -Werror=format-security -gdwarf-4 -fno-debug-types-section -fvar-tracking-assignments -g2 -Wp,-D_FORTIFY_SOURCE=2 -fstack-protector-strong --param=ssp-buffer-size=4 -Werror=trampolines -fPIC -mtune=generic -march=x86-64 -gdwarf-4 -fno-debug-types-section -fvar-tracking-assignments -g2 -DNDEBUG -DQT_NO_DEBUG -fPIC -o CMakeFiles/elektra-core.dir/nolog.c.o -c /tmp/B.crNwZC/BUILD/elektra-0.8.23/src/libs/elektra/nolog.c make[2]: Leaving directory '/tmp/B.crNwZC/BUILD/elektra-0.8.23/build' make[2]: Entering directory '/tmp/B.crNwZC/BUILD/elektra-0.8.23/build' [ 10%] Building C object src/libs/elektra/CMakeFiles/elektra-core.dir/keyvalue.c.o cd /tmp/B.crNwZC/BUILD/elektra-0.8.23/build/src/libs/elektra && /usr/bin/x86_64-pld-linux-gnux32-gcc -DHAVE_KDBCONFIG_H -Delektra_core_EXPORTS -I/tmp/B.crNwZC/BUILD/elektra-0.8.23/build/src/include -I/tmp/B.crNwZC/BUILD/elektra-0.8.23/src/include -I/tmp/B.crNwZC/BUILD/elektra-0.8.23/build/src/libs/elektra -std=gnu99 -Wno-deprecated-declarations -Wstrict-prototypes -Wno-long-long -pedantic -Wno-variadic-macros -Wall -Wextra -Wno-overlength-strings -Wsign-compare -Wfloat-equal -Wformat -Wformat-security -Wshadow -Wcomments -Wtrigraphs -Wundef -Wuninitialized -Winit-self -Wmaybe-uninitialized -Wsign-compare -Wfloat-equal -O2 -fwrapv -pipe -Wformat -Werror=format-security -gdwarf-4 -fno-debug-types-section -fvar-tracking-assignments -g2 -Wp,-D_FORTIFY_SOURCE=2 -fstack-protector-strong --param=ssp-buffer-size=4 -Werror=trampolines -fPIC -mtune=generic -march=x86-64 -gdwarf-4 -fno-debug-types-section -fvar-tracking-assignments -g2 -DNDEBUG -DQT_NO_DEBUG -fPIC -o CMakeFiles/elektra-core.dir/keyvalue.c.o -c /tmp/B.crNwZC/BUILD/elektra-0.8.23/src/libs/elektra/keyvalue.c make[2]: Leaving directory '/tmp/B.crNwZC/BUILD/elektra-0.8.23/build' make[2]: Entering directory '/tmp/B.crNwZC/BUILD/elektra-0.8.23/build' [ 10%] Building C object src/libs/elektra/CMakeFiles/elektra-core.dir/owner.c.o cd /tmp/B.crNwZC/BUILD/elektra-0.8.23/build/src/libs/elektra && /usr/bin/x86_64-pld-linux-gnux32-gcc -DHAVE_KDBCONFIG_H -Delektra_core_EXPORTS -I/tmp/B.crNwZC/BUILD/elektra-0.8.23/build/src/include -I/tmp/B.crNwZC/BUILD/elektra-0.8.23/src/include -I/tmp/B.crNwZC/BUILD/elektra-0.8.23/build/src/libs/elektra -std=gnu99 -Wno-deprecated-declarations -Wstrict-prototypes -Wno-long-long -pedantic -Wno-variadic-macros -Wall -Wextra -Wno-overlength-strings -Wsign-compare -Wfloat-equal -Wformat -Wformat-security -Wshadow -Wcomments -Wtrigraphs -Wundef -Wuninitialized -Winit-self -Wmaybe-uninitialized -Wsign-compare -Wfloat-equal -O2 -fwrapv -pipe -Wformat -Werror=format-security -gdwarf-4 -fno-debug-types-section -fvar-tracking-assignments -g2 -Wp,-D_FORTIFY_SOURCE=2 -fstack-protector-strong --param=ssp-buffer-size=4 -Werror=trampolines -fPIC -mtune=generic -march=x86-64 -gdwarf-4 -fno-debug-types-section -fvar-tracking-assignments -g2 -DNDEBUG -DQT_NO_DEBUG -fPIC -o CMakeFiles/elektra-core.dir/owner.c.o -c /tmp/B.crNwZC/BUILD/elektra-0.8.23/src/libs/elektra/owner.c make[2]: Leaving directory '/tmp/B.crNwZC/BUILD/elektra-0.8.23/build' make[2]: Entering directory '/tmp/B.crNwZC/BUILD/elektra-0.8.23/build' [ 10%] Building C object src/libs/elektra/CMakeFiles/elektra-core.dir/rand.c.o cd /tmp/B.crNwZC/BUILD/elektra-0.8.23/build/src/libs/elektra && /usr/bin/x86_64-pld-linux-gnux32-gcc -DHAVE_KDBCONFIG_H -Delektra_core_EXPORTS -I/tmp/B.crNwZC/BUILD/elektra-0.8.23/build/src/include -I/tmp/B.crNwZC/BUILD/elektra-0.8.23/src/include -I/tmp/B.crNwZC/BUILD/elektra-0.8.23/build/src/libs/elektra -std=gnu99 -Wno-deprecated-declarations -Wstrict-prototypes -Wno-long-long -pedantic -Wno-variadic-macros -Wall -Wextra -Wno-overlength-strings -Wsign-compare -Wfloat-equal -Wformat -Wformat-security -Wshadow -Wcomments -Wtrigraphs -Wundef -Wuninitialized -Winit-self -Wmaybe-uninitialized -Wsign-compare -Wfloat-equal -O2 -fwrapv -pipe -Wformat -Werror=format-security -gdwarf-4 -fno-debug-types-section -fvar-tracking-assignments -g2 -Wp,-D_FORTIFY_SOURCE=2 -fstack-protector-strong --param=ssp-buffer-size=4 -Werror=trampolines -fPIC -mtune=generic -march=x86-64 -gdwarf-4 -fno-debug-types-section -fvar-tracking-assignments -g2 -DNDEBUG -DQT_NO_DEBUG -fPIC -o CMakeFiles/elektra-core.dir/rand.c.o -c /tmp/B.crNwZC/BUILD/elektra-0.8.23/src/libs/elektra/rand.c make[2]: Leaving directory '/tmp/B.crNwZC/BUILD/elektra-0.8.23/build' /usr/bin/make -f src/libs/elektra/CMakeFiles/elektra.dir/build.make src/libs/elektra/CMakeFiles/elektra.dir/depend make[2]: Entering directory '/tmp/B.crNwZC/BUILD/elektra-0.8.23/build' [ 10%] Building C object src/libs/elektra/CMakeFiles/elektra-core.dir/proposal.c.o cd /tmp/B.crNwZC/BUILD/elektra-0.8.23/build/src/libs/elektra && /usr/bin/x86_64-pld-linux-gnux32-gcc -DHAVE_KDBCONFIG_H -Delektra_core_EXPORTS -I/tmp/B.crNwZC/BUILD/elektra-0.8.23/build/src/include -I/tmp/B.crNwZC/BUILD/elektra-0.8.23/src/include -I/tmp/B.crNwZC/BUILD/elektra-0.8.23/build/src/libs/elektra -std=gnu99 -Wno-deprecated-declarations -Wstrict-prototypes -Wno-long-long -pedantic -Wno-variadic-macros -Wall -Wextra -Wno-overlength-strings -Wsign-compare -Wfloat-equal -Wformat -Wformat-security -Wshadow -Wcomments -Wtrigraphs -Wundef -Wuninitialized -Winit-self -Wmaybe-uninitialized -Wsign-compare -Wfloat-equal -O2 -fwrapv -pipe -Wformat -Werror=format-security -gdwarf-4 -fno-debug-types-section -fvar-tracking-assignments -g2 -Wp,-D_FORTIFY_SOURCE=2 -fstack-protector-strong --param=ssp-buffer-size=4 -Werror=trampolines -fPIC -mtune=generic -march=x86-64 -gdwarf-4 -fno-debug-types-section -fvar-tracking-assignments -g2 -DNDEBUG -DQT_NO_DEBUG -fPIC -o CMakeFiles/elektra-core.dir/proposal.c.o -c /tmp/B.crNwZC/BUILD/elektra-0.8.23/src/libs/elektra/proposal.c make[2]: Leaving directory '/tmp/B.crNwZC/BUILD/elektra-0.8.23/build' /usr/bin/make -f src/plugins/blockresolver/CMakeFiles/elektra-blockresolver-objects.dir/build.make src/plugins/blockresolver/CMakeFiles/elektra-blockresolver-objects.dir/depend make[2]: Entering directory '/tmp/B.crNwZC/BUILD/elektra-0.8.23/build' cd /tmp/B.crNwZC/BUILD/elektra-0.8.23/build && /usr/bin/cmake -E cmake_depends "Unix Makefiles" /tmp/B.crNwZC/BUILD/elektra-0.8.23 /tmp/B.crNwZC/BUILD/elektra-0.8.23/src/libs/elektra /tmp/B.crNwZC/BUILD/elektra-0.8.23/build /tmp/B.crNwZC/BUILD/elektra-0.8.23/build/src/libs/elektra /tmp/B.crNwZC/BUILD/elektra-0.8.23/build/src/libs/elektra/CMakeFiles/elektra.dir/DependInfo.cmake --color= Scanning dependencies of target elektra make[2]: Leaving directory '/tmp/B.crNwZC/BUILD/elektra-0.8.23/build' /usr/bin/make -f src/libs/elektra/CMakeFiles/elektra.dir/build.make src/libs/elektra/CMakeFiles/elektra.dir/build make[2]: Entering directory '/tmp/B.crNwZC/BUILD/elektra-0.8.23/build' cd /tmp/B.crNwZC/BUILD/elektra-0.8.23/build && /usr/bin/cmake -E cmake_depends "Unix Makefiles" /tmp/B.crNwZC/BUILD/elektra-0.8.23 /tmp/B.crNwZC/BUILD/elektra-0.8.23/src/plugins/blockresolver /tmp/B.crNwZC/BUILD/elektra-0.8.23/build /tmp/B.crNwZC/BUILD/elektra-0.8.23/build/src/plugins/blockresolver /tmp/B.crNwZC/BUILD/elektra-0.8.23/build/src/plugins/blockresolver/CMakeFiles/elektra-blockresolver-objects.dir/DependInfo.cmake --color= Scanning dependencies of target elektra-blockresolver-objects make[2]: Leaving directory '/tmp/B.crNwZC/BUILD/elektra-0.8.23/build' /usr/bin/make -f src/plugins/blockresolver/CMakeFiles/elektra-blockresolver-objects.dir/build.make src/plugins/blockresolver/CMakeFiles/elektra-blockresolver-objects.dir/build make[2]: Entering directory '/tmp/B.crNwZC/BUILD/elektra-0.8.23/build' [ 10%] Building C object src/libs/elektra/CMakeFiles/elektra-core.dir/opmphm.c.o cd /tmp/B.crNwZC/BUILD/elektra-0.8.23/build/src/libs/elektra && /usr/bin/x86_64-pld-linux-gnux32-gcc -DHAVE_KDBCONFIG_H -Delektra_core_EXPORTS -I/tmp/B.crNwZC/BUILD/elektra-0.8.23/build/src/include -I/tmp/B.crNwZC/BUILD/elektra-0.8.23/src/include -I/tmp/B.crNwZC/BUILD/elektra-0.8.23/build/src/libs/elektra -std=gnu99 -Wno-deprecated-declarations -Wstrict-prototypes -Wno-long-long -pedantic -Wno-variadic-macros -Wall -Wextra -Wno-overlength-strings -Wsign-compare -Wfloat-equal -Wformat -Wformat-security -Wshadow -Wcomments -Wtrigraphs -Wundef -Wuninitialized -Winit-self -Wmaybe-uninitialized -Wsign-compare -Wfloat-equal -O2 -fwrapv -pipe -Wformat -Werror=format-security -gdwarf-4 -fno-debug-types-section -fvar-tracking-assignments -g2 -Wp,-D_FORTIFY_SOURCE=2 -fstack-protector-strong --param=ssp-buffer-size=4 -Werror=trampolines -fPIC -mtune=generic -march=x86-64 -gdwarf-4 -fno-debug-types-section -fvar-tracking-assignments -g2 -DNDEBUG -DQT_NO_DEBUG -fPIC -o CMakeFiles/elektra-core.dir/opmphm.c.o -c /tmp/B.crNwZC/BUILD/elektra-0.8.23/src/libs/elektra/opmphm.c make[2]: Leaving directory '/tmp/B.crNwZC/BUILD/elektra-0.8.23/build' make[2]: Entering directory '/tmp/B.crNwZC/BUILD/elektra-0.8.23/build' [ 8%] Building C object src/libs/elektra/CMakeFiles/elektra-core.dir/keyset.c.o cd /tmp/B.crNwZC/BUILD/elektra-0.8.23/build/src/libs/elektra && /usr/bin/x86_64-pld-linux-gnux32-gcc -DHAVE_KDBCONFIG_H -Delektra_core_EXPORTS -I/tmp/B.crNwZC/BUILD/elektra-0.8.23/build/src/include -I/tmp/B.crNwZC/BUILD/elektra-0.8.23/src/include -I/tmp/B.crNwZC/BUILD/elektra-0.8.23/build/src/libs/elektra -std=gnu99 -Wno-deprecated-declarations -Wstrict-prototypes -Wno-long-long -pedantic -Wno-variadic-macros -Wall -Wextra -Wno-overlength-strings -Wsign-compare -Wfloat-equal -Wformat -Wformat-security -Wshadow -Wcomments -Wtrigraphs -Wundef -Wuninitialized -Winit-self -Wmaybe-uninitialized -Wsign-compare -Wfloat-equal -O2 -fwrapv -pipe -Wformat -Werror=format-security -gdwarf-4 -fno-debug-types-section -fvar-tracking-assignments -g2 -Wp,-D_FORTIFY_SOURCE=2 -fstack-protector-strong --param=ssp-buffer-size=4 -Werror=trampolines -fPIC -mtune=generic -march=x86-64 -gdwarf-4 -fno-debug-types-section -fvar-tracking-assignments -g2 -DNDEBUG -DQT_NO_DEBUG -fPIC -o CMakeFiles/elektra-core.dir/keyset.c.o -c /tmp/B.crNwZC/BUILD/elektra-0.8.23/src/libs/elektra/keyset.c In file included from /usr/include/string.h:519, from /tmp/B.crNwZC/BUILD/elektra-0.8.23/src/libs/elektra/keyset.c:26: In function 'strncpy', inlined from 'elektraLookupByCascading' at /tmp/B.crNwZC/BUILD/elektra-0.8.23/src/libs/elektra/keyset.c:1801:3: /usr/include/bits/string_fortified.h:95:10: warning: '__builtin_strncpy' output truncated before terminating nul copying 4 bytes from a string of the same length [-Wstringop-truncation] 95 | return __builtin___strncpy_chk (__dest, __src, __len, | ^~~~~~~~~~~~~~~~~~~~~~~~~~~~~~~~~~~~~~~~~~~~~~ 96 | __glibc_objsize (__dest)); | ~~~~~~~~~~~~~~~~~~~~~~~~~ In function 'strncpy', inlined from 'elektraLookupByCascading' at /tmp/B.crNwZC/BUILD/elektra-0.8.23/src/libs/elektra/keyset.c:1832:2: /usr/include/bits/string_fortified.h:95:10: warning: '__builtin_strncpy' output truncated before terminating nul copying 4 bytes from a string of the same length [-Wstringop-truncation] 95 | return __builtin___strncpy_chk (__dest, __src, __len, | ^~~~~~~~~~~~~~~~~~~~~~~~~~~~~~~~~~~~~~~~~~~~~~ 96 | __glibc_objsize (__dest)); | ~~~~~~~~~~~~~~~~~~~~~~~~~ In function 'strncpy', inlined from 'elektraLookupByCascading' at /tmp/B.crNwZC/BUILD/elektra-0.8.23/src/libs/elektra/keyset.c:1851:3: /usr/include/bits/string_fortified.h:95:10: warning: '__builtin_strncpy' output truncated before terminating nul copying 4 bytes from a string of the same length [-Wstringop-truncation] 95 | return __builtin___strncpy_chk (__dest, __src, __len, | ^~~~~~~~~~~~~~~~~~~~~~~~~~~~~~~~~~~~~~~~~~~~~~ 96 | __glibc_objsize (__dest)); | ~~~~~~~~~~~~~~~~~~~~~~~~~ In function 'strncpy', inlined from 'elektraLookupByCascading' at /tmp/B.crNwZC/BUILD/elektra-0.8.23/src/libs/elektra/keyset.c:1841:3: /usr/include/bits/string_fortified.h:95:10: warning: '__builtin_strncpy' output truncated before terminating nul copying 3 bytes from a string of the same length [-Wstringop-truncation] 95 | return __builtin___strncpy_chk (__dest, __src, __len, | ^~~~~~~~~~~~~~~~~~~~~~~~~~~~~~~~~~~~~~~~~~~~~~ 96 | __glibc_objsize (__dest)); | ~~~~~~~~~~~~~~~~~~~~~~~~~ In function 'strncpy', inlined from 'elektraLookupByCascading' at /tmp/B.crNwZC/BUILD/elektra-0.8.23/src/libs/elektra/keyset.c:1861:3: /usr/include/bits/string_fortified.h:95:10: warning: '__builtin_strncpy' output truncated before terminating nul copying 6 bytes from a string of the same length [-Wstringop-truncation] 95 | return __builtin___strncpy_chk (__dest, __src, __len, | ^~~~~~~~~~~~~~~~~~~~~~~~~~~~~~~~~~~~~~~~~~~~~~ 96 | __glibc_objsize (__dest)); | ~~~~~~~~~~~~~~~~~~~~~~~~~ In function 'strncpy', inlined from 'ksCut' at /tmp/B.crNwZC/BUILD/elektra-0.8.23/src/libs/elektra/keyset.c:1089:5: /usr/include/bits/string_fortified.h:95:10: warning: '__builtin_strncpy' output truncated before terminating nul copying 4 bytes from a string of the same length [-Wstringop-truncation] 95 | return __builtin___strncpy_chk (__dest, __src, __len, | ^~~~~~~~~~~~~~~~~~~~~~~~~~~~~~~~~~~~~~~~~~~~~~ 96 | __glibc_objsize (__dest)); | ~~~~~~~~~~~~~~~~~~~~~~~~~ In function 'strncpy', inlined from 'ksCut' at /tmp/B.crNwZC/BUILD/elektra-0.8.23/src/libs/elektra/keyset.c:1097:5: /usr/include/bits/string_fortified.h:95:10: warning: '__builtin_strncpy' output truncated before terminating nul copying 4 bytes from a string of the same length [-Wstringop-truncation] 95 | return __builtin___strncpy_chk (__dest, __src, __len, | ^~~~~~~~~~~~~~~~~~~~~~~~~~~~~~~~~~~~~~~~~~~~~~ 96 | __glibc_objsize (__dest)); | ~~~~~~~~~~~~~~~~~~~~~~~~~ In function 'strncpy', inlined from 'ksCut' at /tmp/B.crNwZC/BUILD/elektra-0.8.23/src/libs/elektra/keyset.c:1105:5: /usr/include/bits/string_fortified.h:95:10: warning: '__builtin_strncpy' output truncated before terminating nul copying 3 bytes from a string of the same length [-Wstringop-truncation] 95 | return __builtin___strncpy_chk (__dest, __src, __len, | ^~~~~~~~~~~~~~~~~~~~~~~~~~~~~~~~~~~~~~~~~~~~~~ 96 | __glibc_objsize (__dest)); | ~~~~~~~~~~~~~~~~~~~~~~~~~ In function 'strncpy', inlined from 'ksCut' at /tmp/B.crNwZC/BUILD/elektra-0.8.23/src/libs/elektra/keyset.c:1113:5: /usr/include/bits/string_fortified.h:95:10: warning: '__builtin_strncpy' output truncated before terminating nul copying 4 bytes from a string of the same length [-Wstringop-truncation] 95 | return __builtin___strncpy_chk (__dest, __src, __len, | ^~~~~~~~~~~~~~~~~~~~~~~~~~~~~~~~~~~~~~~~~~~~~~ 96 | __glibc_objsize (__dest)); | ~~~~~~~~~~~~~~~~~~~~~~~~~ In function 'strncpy', inlined from 'ksCut' at /tmp/B.crNwZC/BUILD/elektra-0.8.23/src/libs/elektra/keyset.c:1121:5: /usr/include/bits/string_fortified.h:95:10: warning: '__builtin_strncpy' output truncated before terminating nul copying 6 bytes from a string of the same length [-Wstringop-truncation] 95 | return __builtin___strncpy_chk (__dest, __src, __len, | ^~~~~~~~~~~~~~~~~~~~~~~~~~~~~~~~~~~~~~~~~~~~~~ 96 | __glibc_objsize (__dest)); | ~~~~~~~~~~~~~~~~~~~~~~~~~ make[2]: Leaving directory '/tmp/B.crNwZC/BUILD/elektra-0.8.23/build' make[2]: Entering directory '/tmp/B.crNwZC/BUILD/elektra-0.8.23/build' [ 10%] Building C object src/plugins/base64/CMakeFiles/elektra-base64-objects.dir/base64.c.o cd /tmp/B.crNwZC/BUILD/elektra-0.8.23/build/src/plugins/base64 && /usr/bin/x86_64-pld-linux-gnux32-gcc -DELEKTRA_PLUGIN_NAME=\"base64\" -DELEKTRA_PLUGIN_NAME_C=base64 -DELEKTRA_STATIC -DHAVE_KDBCONFIG_H -DPLUGIN_SHORT_NAME=base64 -DREADME=readme_base64.c -I/tmp/B.crNwZC/BUILD/elektra-0.8.23/build/src/include -I/tmp/B.crNwZC/BUILD/elektra-0.8.23/src/include -I/tmp/B.crNwZC/BUILD/elektra-0.8.23/build/src/plugins/base64 -std=gnu99 -Wno-deprecated-declarations -Wstrict-prototypes -Wno-long-long -pedantic -Wno-variadic-macros -Wall -Wextra -Wno-overlength-strings -Wsign-compare -Wfloat-equal -Wformat -Wformat-security -Wshadow -Wcomments -Wtrigraphs -Wundef -Wuninitialized -Winit-self -Wmaybe-uninitialized -Wsign-compare -Wfloat-equal -O2 -fwrapv -pipe -Wformat -Werror=format-security -gdwarf-4 -fno-debug-types-section -fvar-tracking-assignments -g2 -Wp,-D_FORTIFY_SOURCE=2 -fstack-protector-strong --param=ssp-buffer-size=4 -Werror=trampolines -fPIC -mtune=generic -march=x86-64 -gdwarf-4 -fno-debug-types-section -fvar-tracking-assignments -g2 -DNDEBUG -DQT_NO_DEBUG -fPIC -o CMakeFiles/elektra-base64-objects.dir/base64.c.o -c /tmp/B.crNwZC/BUILD/elektra-0.8.23/src/plugins/base64/base64.c make[2]: Leaving directory '/tmp/B.crNwZC/BUILD/elektra-0.8.23/build' make[1]: Entering directory '/tmp/B.crNwZC/BUILD/elektra-0.8.23/build' [ 10%] Built target elektra-base64-objects make[1]: Leaving directory '/tmp/B.crNwZC/BUILD/elektra-0.8.23/build' /usr/bin/make -f src/plugins/boolean/CMakeFiles/elektra-boolean-objects.dir/build.make src/plugins/boolean/CMakeFiles/elektra-boolean-objects.dir/depend make[2]: Entering directory '/tmp/B.crNwZC/BUILD/elektra-0.8.23/build' cd /tmp/B.crNwZC/BUILD/elektra-0.8.23/build && /usr/bin/cmake -E cmake_depends "Unix Makefiles" /tmp/B.crNwZC/BUILD/elektra-0.8.23 /tmp/B.crNwZC/BUILD/elektra-0.8.23/src/plugins/boolean /tmp/B.crNwZC/BUILD/elektra-0.8.23/build /tmp/B.crNwZC/BUILD/elektra-0.8.23/build/src/plugins/boolean /tmp/B.crNwZC/BUILD/elektra-0.8.23/build/src/plugins/boolean/CMakeFiles/elektra-boolean-objects.dir/DependInfo.cmake --color= Scanning dependencies of target elektra-boolean-objects make[2]: Leaving directory '/tmp/B.crNwZC/BUILD/elektra-0.8.23/build' /usr/bin/make -f src/plugins/boolean/CMakeFiles/elektra-boolean-objects.dir/build.make src/plugins/boolean/CMakeFiles/elektra-boolean-objects.dir/build make[2]: Entering directory '/tmp/B.crNwZC/BUILD/elektra-0.8.23/build' [ 10%] Building C object src/libs/elektra/CMakeFiles/elektra-core.dir/__/loader/dl.c.o cd /tmp/B.crNwZC/BUILD/elektra-0.8.23/build/src/libs/elektra && /usr/bin/x86_64-pld-linux-gnux32-gcc -DHAVE_KDBCONFIG_H -Delektra_core_EXPORTS -I/tmp/B.crNwZC/BUILD/elektra-0.8.23/build/src/include -I/tmp/B.crNwZC/BUILD/elektra-0.8.23/src/include -I/tmp/B.crNwZC/BUILD/elektra-0.8.23/build/src/libs/elektra -std=gnu99 -Wno-deprecated-declarations -Wstrict-prototypes -Wno-long-long -pedantic -Wno-variadic-macros -Wall -Wextra -Wno-overlength-strings -Wsign-compare -Wfloat-equal -Wformat -Wformat-security -Wshadow -Wcomments -Wtrigraphs -Wundef -Wuninitialized -Winit-self -Wmaybe-uninitialized -Wsign-compare -Wfloat-equal -O2 -fwrapv -pipe -Wformat -Werror=format-security -gdwarf-4 -fno-debug-types-section -fvar-tracking-assignments -g2 -Wp,-D_FORTIFY_SOURCE=2 -fstack-protector-strong --param=ssp-buffer-size=4 -Werror=trampolines -fPIC -mtune=generic -march=x86-64 -gdwarf-4 -fno-debug-types-section -fvar-tracking-assignments -g2 -DNDEBUG -DQT_NO_DEBUG -fPIC -o CMakeFiles/elektra-core.dir/__/loader/dl.c.o -c /tmp/B.crNwZC/BUILD/elektra-0.8.23/src/libs/loader/dl.c make[2]: Leaving directory '/tmp/B.crNwZC/BUILD/elektra-0.8.23/build' make[2]: Entering directory '/tmp/B.crNwZC/BUILD/elektra-0.8.23/build' [ 7%] Building CXX object src/tools/kdb/CMakeFiles/kdb-objects.dir/complete.cpp.o cd /tmp/B.crNwZC/BUILD/elektra-0.8.23/build/src/tools/kdb && /usr/bin/x86_64-pld-linux-gnux32-g++ -I/tmp/B.crNwZC/BUILD/elektra-0.8.23/build/src/include -I/tmp/B.crNwZC/BUILD/elektra-0.8.23/src/include -I/tmp/B.crNwZC/BUILD/elektra-0.8.23/build/src/bindings/cpp/include -I/tmp/B.crNwZC/BUILD/elektra-0.8.23/src/bindings/cpp/include -I/tmp/B.crNwZC/BUILD/elektra-0.8.23/build/src/libs/tools/include -I/tmp/B.crNwZC/BUILD/elektra-0.8.23/src/libs/tools/include -I/tmp/B.crNwZC/BUILD/elektra-0.8.23/src/tools/kdb -std=c++11 -Wno-deprecated-declarations -Wold-style-cast -Wstrict-null-sentinel -D_GLIBCXX_USE_NANOSLEEP -Wno-missing-field-initializers -Woverloaded-virtual -Wsign-promo -Wno-long-long -pedantic -Wno-variadic-macros -Wall -Wextra -Wno-overlength-strings -Wsign-compare -Wfloat-equal -Wformat -Wformat-security -Wshadow -Wcomments -Wtrigraphs -Wundef -Wuninitialized -Winit-self -Wmaybe-uninitialized -O2 -fwrapv -pipe -Wformat -Werror=format-security -gdwarf-4 -fno-debug-types-section -fvar-tracking-assignments -g2 -Wp,-D_FORTIFY_SOURCE=2 -fstack-protector-strong --param=ssp-buffer-size=4 -Werror=trampolines -fPIC -mtune=generic -march=x86-64 -gdwarf-4 -fno-debug-types-section -fvar-tracking-assignments -g2 -DNDEBUG -DQT_NO_DEBUG -o CMakeFiles/kdb-objects.dir/complete.cpp.o -c /tmp/B.crNwZC/BUILD/elektra-0.8.23/src/tools/kdb/complete.cpp /tmp/B.crNwZC/BUILD/elektra-0.8.23/src/tools/kdb/complete.cpp: In member function 'void CompleteCommand::addNamespaces(std::map<kdb::Key, std::pair<int, int> >&, const Cmdline&)': /tmp/B.crNwZC/BUILD/elektra-0.8.23/src/tools/kdb/complete.cpp:320:43: warning: loop variable 'ns' creates a copy from type 'const string' {aka 'const std::__cxx11::basic_string<char>'} [-Wrange-loop-construct] 320 | for (const string ns : namespaces) | ^~ /tmp/B.crNwZC/BUILD/elektra-0.8.23/src/tools/kdb/complete.cpp:320:43: note: use reference type to prevent copying 320 | for (const string ns : namespaces) | ^~ | & /tmp/B.crNwZC/BUILD/elektra-0.8.23/src/tools/kdb/complete.cpp:331:27: warning: loop variable 'ns' creates a copy from type 'const string' {aka 'const std::__cxx11::basic_string<char>'} [-Wrange-loop-construct] 331 | for (const string ns : namespaces) | ^~ /tmp/B.crNwZC/BUILD/elektra-0.8.23/src/tools/kdb/complete.cpp:331:27: note: use reference type to prevent copying 331 | for (const string ns : namespaces) | ^~ | & make[2]: Leaving directory '/tmp/B.crNwZC/BUILD/elektra-0.8.23/build' make[1]: *** [CMakeFiles/Makefile2:15884: src/tools/kdb/CMakeFiles/kdb-objects.dir/all] Error 2 make[1]: *** Waiting for unfinished jobs.... make[2]: Entering directory '/tmp/B.crNwZC/BUILD/elektra-0.8.23/build' [ 10%] Linking C shared library ../../../lib/libelektra-core.so cd /tmp/B.crNwZC/BUILD/elektra-0.8.23/build/src/libs/elektra && /usr/bin/cmake -E cmake_link_script CMakeFiles/elektra-core.dir/link.txt --verbose=1 /usr/bin/x86_64-pld-linux-gnux32-gcc -fPIC -std=gnu99 -Wno-deprecated-declarations -Wstrict-prototypes -Wno-long-long -pedantic -Wno-variadic-macros -Wall -Wextra -Wno-overlength-strings -Wsign-compare -Wfloat-equal -Wformat -Wformat-security -Wshadow -Wcomments -Wtrigraphs -Wundef -Wuninitialized -Winit-self -Wmaybe-uninitialized -Wsign-compare -Wfloat-equal -O2 -fwrapv -pipe -Wformat -Werror=format-security -gdwarf-4 -fno-debug-types-section -fvar-tracking-assignments -g2 -Wp,-D_FORTIFY_SOURCE=2 -fstack-protector-strong --param=ssp-buffer-size=4 -Werror=trampolines -fPIC -mtune=generic -march=x86-64 -gdwarf-4 -fno-debug-types-section -fvar-tracking-assignments -g2 -DNDEBUG -DQT_NO_DEBUG -Wl,--version-script=/tmp/B.crNwZC/BUILD/elektra-0.8.23/src/libs/elektra/libelektra-symbols.map -Wl,--as-needed -Wl,--no-copy-dt-needed-entries -Wl,-z,relro -Wl,-z,combreloc -shared -Wl,-soname,libelektra-core.so.4 -o ../../../lib/libelektra-core.so.0.8.23 CMakeFiles/elektra-core.dir/global.c.o CMakeFiles/elektra-core.dir/internal.c.o CMakeFiles/elektra-core.dir/kdbenum.c.o CMakeFiles/elektra-core.dir/key.c.o CMakeFiles/elektra-core.dir/keyhelpers.c.o CMakeFiles/elektra-core.dir/keymeta.c.o CMakeFiles/elektra-core.dir/keyname.c.o CMakeFiles/elektra-core.dir/keyset.c.o CMakeFiles/elektra-core.dir/keytest.c.o CMakeFiles/elektra-core.dir/keyvalue.c.o CMakeFiles/elektra-core.dir/nolog.c.o CMakeFiles/elektra-core.dir/opmphm.c.o CMakeFiles/elektra-core.dir/owner.c.o CMakeFiles/elektra-core.dir/proposal.c.o CMakeFiles/elektra-core.dir/rand.c.o CMakeFiles/elektra-core.dir/__/loader/dl.c.o -Wl,-rpath,::::::::::::::::::: -ldl cd /tmp/B.crNwZC/BUILD/elektra-0.8.23/build/src/libs/elektra && /usr/bin/cmake -E cmake_symlink_library ../../../lib/libelektra-core.so.0.8.23 ../../../lib/libelektra-core.so.4 ../../../lib/libelektra-core.so make[2]: Leaving directory '/tmp/B.crNwZC/BUILD/elektra-0.8.23/build' make[1]: Entering directory '/tmp/B.crNwZC/BUILD/elektra-0.8.23/build' [ 10%] Built target elektra-core make[1]: Leaving directory '/tmp/B.crNwZC/BUILD/elektra-0.8.23/build' make[2]: Entering directory '/tmp/B.crNwZC/BUILD/elektra-0.8.23/build' [ 10%] Building C object src/libs/elektra/CMakeFiles/elektra.dir/backend.c.o cd /tmp/B.crNwZC/BUILD/elektra-0.8.23/build/src/libs/elektra && /usr/bin/x86_64-pld-linux-gnux32-gcc -DHAVE_KDBCONFIG_H -Delektra_EXPORTS -I/tmp/B.crNwZC/BUILD/elektra-0.8.23/build/src/include -I/tmp/B.crNwZC/BUILD/elektra-0.8.23/src/include -I/tmp/B.crNwZC/BUILD/elektra-0.8.23/build/src/libs/elektra -std=gnu99 -Wno-deprecated-declarations -Wstrict-prototypes -Wno-long-long -pedantic -Wno-variadic-macros -Wall -Wextra -Wno-overlength-strings -Wsign-compare -Wfloat-equal -Wformat -Wformat-security -Wshadow -Wcomments -Wtrigraphs -Wundef -Wuninitialized -Winit-self -Wmaybe-uninitialized -Wsign-compare -Wfloat-equal -O2 -fwrapv -pipe -Wformat -Werror=format-security -gdwarf-4 -fno-debug-types-section -fvar-tracking-assignments -g2 -Wp,-D_FORTIFY_SOURCE=2 -fstack-protector-strong --param=ssp-buffer-size=4 -Werror=trampolines -fPIC -mtune=generic -march=x86-64 -gdwarf-4 -fno-debug-types-section -fvar-tracking-assignments -g2 -DNDEBUG -DQT_NO_DEBUG -fPIC -o CMakeFiles/elektra.dir/backend.c.o -c /tmp/B.crNwZC/BUILD/elektra-0.8.23/src/libs/elektra/backend.c make[2]: Leaving directory '/tmp/B.crNwZC/BUILD/elektra-0.8.23/build' make[2]: Entering directory '/tmp/B.crNwZC/BUILD/elektra-0.8.23/build' [ 10%] Building C object src/plugins/blockresolver/CMakeFiles/elektra-blockresolver-objects.dir/blockresolver.c.o cd /tmp/B.crNwZC/BUILD/elektra-0.8.23/build/src/plugins/blockresolver && /usr/bin/x86_64-pld-linux-gnux32-gcc -DELEKTRA_STATIC -DHAVE_KDBCONFIG_H -DPLUGIN_SHORT_NAME=blockresolver -DREADME=readme_blockresolver.c -I/tmp/B.crNwZC/BUILD/elektra-0.8.23/build/src/include -I/tmp/B.crNwZC/BUILD/elektra-0.8.23/src/include -I/tmp/B.crNwZC/BUILD/elektra-0.8.23/build/src/plugins/blockresolver -std=gnu99 -Wno-deprecated-declarations -Wstrict-prototypes -Wno-long-long -pedantic -Wno-variadic-macros -Wall -Wextra -Wno-overlength-strings -Wsign-compare -Wfloat-equal -Wformat -Wformat-security -Wshadow -Wcomments -Wtrigraphs -Wundef -Wuninitialized -Winit-self -Wmaybe-uninitialized -Wsign-compare -Wfloat-equal -O2 -fwrapv -pipe -Wformat -Werror=format-security -gdwarf-4 -fno-debug-types-section -fvar-tracking-assignments -g2 -Wp,-D_FORTIFY_SOURCE=2 -fstack-protector-strong --param=ssp-buffer-size=4 -Werror=trampolines -fPIC -mtune=generic -march=x86-64 -gdwarf-4 -fno-debug-types-section -fvar-tracking-assignments -g2 -DNDEBUG -DQT_NO_DEBUG -fPIC -o CMakeFiles/elektra-blockresolver-objects.dir/blockresolver.c.o -c /tmp/B.crNwZC/BUILD/elektra-0.8.23/src/plugins/blockresolver/blockresolver.c /tmp/B.crNwZC/BUILD/elektra-0.8.23/src/plugins/blockresolver/blockresolver.c: In function 'genTempFilename': /tmp/B.crNwZC/BUILD/elektra-0.8.23/src/plugins/blockresolver/blockresolver.c:100:77: warning: format '%lu' expects argument of type 'long unsigned int', but argument 5 has type '__time_t' {aka 'long long int'} [-Wformat=] 100 | snprintf (tmpFile, strlen (tmpFilePrefix) + TV_MAX_DIGITS + 2, "%s%lu:" ELEKTRA_TIME_USEC_F, tmpFilePrefix, tv.tv_sec, tv.tv_usec); | ~~^ ~~~~~~~~~ | | | | long unsigned int __time_t {aka long long int} | %llu make[2]: Leaving directory '/tmp/B.crNwZC/BUILD/elektra-0.8.23/build' make[1]: Entering directory '/tmp/B.crNwZC/BUILD/elektra-0.8.23/build' [ 10%] Built target elektra-blockresolver-objects make[1]: Leaving directory '/tmp/B.crNwZC/BUILD/elektra-0.8.23/build' make[2]: Entering directory '/tmp/B.crNwZC/BUILD/elektra-0.8.23/build' [ 10%] Building C object src/libs/elektra/CMakeFiles/elektra.dir/global.c.o cd /tmp/B.crNwZC/BUILD/elektra-0.8.23/build/src/libs/elektra && /usr/bin/x86_64-pld-linux-gnux32-gcc -DHAVE_KDBCONFIG_H -Delektra_EXPORTS -I/tmp/B.crNwZC/BUILD/elektra-0.8.23/build/src/include -I/tmp/B.crNwZC/BUILD/elektra-0.8.23/src/include -I/tmp/B.crNwZC/BUILD/elektra-0.8.23/build/src/libs/elektra -std=gnu99 -Wno-deprecated-declarations -Wstrict-prototypes -Wno-long-long -pedantic -Wno-variadic-macros -Wall -Wextra -Wno-overlength-strings -Wsign-compare -Wfloat-equal -Wformat -Wformat-security -Wshadow -Wcomments -Wtrigraphs -Wundef -Wuninitialized -Winit-self -Wmaybe-uninitialized -Wsign-compare -Wfloat-equal -O2 -fwrapv -pipe -Wformat -Werror=format-security -gdwarf-4 -fno-debug-types-section -fvar-tracking-assignments -g2 -Wp,-D_FORTIFY_SOURCE=2 -fstack-protector-strong --param=ssp-buffer-size=4 -Werror=trampolines -fPIC -mtune=generic -march=x86-64 -gdwarf-4 -fno-debug-types-section -fvar-tracking-assignments -g2 -DNDEBUG -DQT_NO_DEBUG -fPIC -o CMakeFiles/elektra.dir/global.c.o -c /tmp/B.crNwZC/BUILD/elektra-0.8.23/src/libs/elektra/global.c make[2]: Leaving directory '/tmp/B.crNwZC/BUILD/elektra-0.8.23/build' make[2]: Entering directory '/tmp/B.crNwZC/BUILD/elektra-0.8.23/build' [ 10%] Building C object src/libs/elektra/CMakeFiles/elektra.dir/mount.c.o cd /tmp/B.crNwZC/BUILD/elektra-0.8.23/build/src/libs/elektra && /usr/bin/x86_64-pld-linux-gnux32-gcc -DHAVE_KDBCONFIG_H -Delektra_EXPORTS -I/tmp/B.crNwZC/BUILD/elektra-0.8.23/build/src/include -I/tmp/B.crNwZC/BUILD/elektra-0.8.23/src/include -I/tmp/B.crNwZC/BUILD/elektra-0.8.23/build/src/libs/elektra -std=gnu99 -Wno-deprecated-declarations -Wstrict-prototypes -Wno-long-long -pedantic -Wno-variadic-macros -Wall -Wextra -Wno-overlength-strings -Wsign-compare -Wfloat-equal -Wformat -Wformat-security -Wshadow -Wcomments -Wtrigraphs -Wundef -Wuninitialized -Winit-self -Wmaybe-uninitialized -Wsign-compare -Wfloat-equal -O2 -fwrapv -pipe -Wformat -Werror=format-security -gdwarf-4 -fno-debug-types-section -fvar-tracking-assignments -g2 -Wp,-D_FORTIFY_SOURCE=2 -fstack-protector-strong --param=ssp-buffer-size=4 -Werror=trampolines -fPIC -mtune=generic -march=x86-64 -gdwarf-4 -fno-debug-types-section -fvar-tracking-assignments -g2 -DNDEBUG -DQT_NO_DEBUG -fPIC -o CMakeFiles/elektra.dir/mount.c.o -c /tmp/B.crNwZC/BUILD/elektra-0.8.23/src/libs/elektra/mount.c make[2]: Leaving directory '/tmp/B.crNwZC/BUILD/elektra-0.8.23/build' make[2]: Entering directory '/tmp/B.crNwZC/BUILD/elektra-0.8.23/build' [ 11%] Building C object src/libs/elektra/CMakeFiles/elektra.dir/kdbenum.c.o cd /tmp/B.crNwZC/BUILD/elektra-0.8.23/build/src/libs/elektra && /usr/bin/x86_64-pld-linux-gnux32-gcc -DHAVE_KDBCONFIG_H -Delektra_EXPORTS -I/tmp/B.crNwZC/BUILD/elektra-0.8.23/build/src/include -I/tmp/B.crNwZC/BUILD/elektra-0.8.23/src/include -I/tmp/B.crNwZC/BUILD/elektra-0.8.23/build/src/libs/elektra -std=gnu99 -Wno-deprecated-declarations -Wstrict-prototypes -Wno-long-long -pedantic -Wno-variadic-macros -Wall -Wextra -Wno-overlength-strings -Wsign-compare -Wfloat-equal -Wformat -Wformat-security -Wshadow -Wcomments -Wtrigraphs -Wundef -Wuninitialized -Winit-self -Wmaybe-uninitialized -Wsign-compare -Wfloat-equal -O2 -fwrapv -pipe -Wformat -Werror=format-security -gdwarf-4 -fno-debug-types-section -fvar-tracking-assignments -g2 -Wp,-D_FORTIFY_SOURCE=2 -fstack-protector-strong --param=ssp-buffer-size=4 -Werror=trampolines -fPIC -mtune=generic -march=x86-64 -gdwarf-4 -fno-debug-types-section -fvar-tracking-assignments -g2 -DNDEBUG -DQT_NO_DEBUG -fPIC -o CMakeFiles/elektra.dir/kdbenum.c.o -c /tmp/B.crNwZC/BUILD/elektra-0.8.23/src/libs/elektra/kdbenum.c make[2]: Leaving directory '/tmp/B.crNwZC/BUILD/elektra-0.8.23/build' make[2]: Entering directory '/tmp/B.crNwZC/BUILD/elektra-0.8.23/build' [ 11%] Building C object src/libs/elektra/CMakeFiles/elektra.dir/key.c.o cd /tmp/B.crNwZC/BUILD/elektra-0.8.23/build/src/libs/elektra && /usr/bin/x86_64-pld-linux-gnux32-gcc -DHAVE_KDBCONFIG_H -Delektra_EXPORTS -I/tmp/B.crNwZC/BUILD/elektra-0.8.23/build/src/include -I/tmp/B.crNwZC/BUILD/elektra-0.8.23/src/include -I/tmp/B.crNwZC/BUILD/elektra-0.8.23/build/src/libs/elektra -std=gnu99 -Wno-deprecated-declarations -Wstrict-prototypes -Wno-long-long -pedantic -Wno-variadic-macros -Wall -Wextra -Wno-overlength-strings -Wsign-compare -Wfloat-equal -Wformat -Wformat-security -Wshadow -Wcomments -Wtrigraphs -Wundef -Wuninitialized -Winit-self -Wmaybe-uninitialized -Wsign-compare -Wfloat-equal -O2 -fwrapv -pipe -Wformat -Werror=format-security -gdwarf-4 -fno-debug-types-section -fvar-tracking-assignments -g2 -Wp,-D_FORTIFY_SOURCE=2 -fstack-protector-strong --param=ssp-buffer-size=4 -Werror=trampolines -fPIC -mtune=generic -march=x86-64 -gdwarf-4 -fno-debug-types-section -fvar-tracking-assignments -g2 -DNDEBUG -DQT_NO_DEBUG -fPIC -o CMakeFiles/elektra.dir/key.c.o -c /tmp/B.crNwZC/BUILD/elektra-0.8.23/src/libs/elektra/key.c make[2]: Leaving directory '/tmp/B.crNwZC/BUILD/elektra-0.8.23/build' make[2]: Entering directory '/tmp/B.crNwZC/BUILD/elektra-0.8.23/build' [ 10%] Building C object src/plugins/boolean/CMakeFiles/elektra-boolean-objects.dir/boolean.c.o cd /tmp/B.crNwZC/BUILD/elektra-0.8.23/build/src/plugins/boolean && /usr/bin/x86_64-pld-linux-gnux32-gcc -DELEKTRA_STATIC -DHAVE_KDBCONFIG_H -DPLUGIN_SHORT_NAME=boolean -DREADME=readme_boolean.c -I/tmp/B.crNwZC/BUILD/elektra-0.8.23/build/src/include -I/tmp/B.crNwZC/BUILD/elektra-0.8.23/src/include -I/tmp/B.crNwZC/BUILD/elektra-0.8.23/build/src/plugins/boolean -std=gnu99 -Wno-deprecated-declarations -Wstrict-prototypes -Wno-long-long -pedantic -Wno-variadic-macros -Wall -Wextra -Wno-overlength-strings -Wsign-compare -Wfloat-equal -Wformat -Wformat-security -Wshadow -Wcomments -Wtrigraphs -Wundef -Wuninitialized -Winit-self -Wmaybe-uninitialized -Wsign-compare -Wfloat-equal -O2 -fwrapv -pipe -Wformat -Werror=format-security -gdwarf-4 -fno-debug-types-section -fvar-tracking-assignments -g2 -Wp,-D_FORTIFY_SOURCE=2 -fstack-protector-strong --param=ssp-buffer-size=4 -Werror=trampolines -fPIC -mtune=generic -march=x86-64 -gdwarf-4 -fno-debug-types-section -fvar-tracking-assignments -g2 -DNDEBUG -DQT_NO_DEBUG -fPIC -o CMakeFiles/elektra-boolean-objects.dir/boolean.c.o -c /tmp/B.crNwZC/BUILD/elektra-0.8.23/src/plugins/boolean/boolean.c make[2]: Leaving directory '/tmp/B.crNwZC/BUILD/elektra-0.8.23/build' make[1]: Entering directory '/tmp/B.crNwZC/BUILD/elektra-0.8.23/build' [ 11%] Built target elektra-boolean-objects make[1]: Leaving directory '/tmp/B.crNwZC/BUILD/elektra-0.8.23/build' make[2]: Entering directory '/tmp/B.crNwZC/BUILD/elektra-0.8.23/build' [ 11%] Building C object src/libs/elektra/CMakeFiles/elektra.dir/keyhelpers.c.o cd /tmp/B.crNwZC/BUILD/elektra-0.8.23/build/src/libs/elektra && /usr/bin/x86_64-pld-linux-gnux32-gcc -DHAVE_KDBCONFIG_H -Delektra_EXPORTS -I/tmp/B.crNwZC/BUILD/elektra-0.8.23/build/src/include -I/tmp/B.crNwZC/BUILD/elektra-0.8.23/src/include -I/tmp/B.crNwZC/BUILD/elektra-0.8.23/build/src/libs/elektra -std=gnu99 -Wno-deprecated-declarations -Wstrict-prototypes -Wno-long-long -pedantic -Wno-variadic-macros -Wall -Wextra -Wno-overlength-strings -Wsign-compare -Wfloat-equal -Wformat -Wformat-security -Wshadow -Wcomments -Wtrigraphs -Wundef -Wuninitialized -Winit-self -Wmaybe-uninitialized -Wsign-compare -Wfloat-equal -O2 -fwrapv -pipe -Wformat -Werror=format-security -gdwarf-4 -fno-debug-types-section -fvar-tracking-assignments -g2 -Wp,-D_FORTIFY_SOURCE=2 -fstack-protector-strong --param=ssp-buffer-size=4 -Werror=trampolines -fPIC -mtune=generic -march=x86-64 -gdwarf-4 -fno-debug-types-section -fvar-tracking-assignments -g2 -DNDEBUG -DQT_NO_DEBUG -fPIC -o CMakeFiles/elektra.dir/keyhelpers.c.o -c /tmp/B.crNwZC/BUILD/elektra-0.8.23/src/libs/elektra/keyhelpers.c make[2]: Leaving directory '/tmp/B.crNwZC/BUILD/elektra-0.8.23/build' make[2]: Entering directory '/tmp/B.crNwZC/BUILD/elektra-0.8.23/build' [ 11%] Building C object src/libs/elektra/CMakeFiles/elektra.dir/keymeta.c.o cd /tmp/B.crNwZC/BUILD/elektra-0.8.23/build/src/libs/elektra && /usr/bin/x86_64-pld-linux-gnux32-gcc -DHAVE_KDBCONFIG_H -Delektra_EXPORTS -I/tmp/B.crNwZC/BUILD/elektra-0.8.23/build/src/include -I/tmp/B.crNwZC/BUILD/elektra-0.8.23/src/include -I/tmp/B.crNwZC/BUILD/elektra-0.8.23/build/src/libs/elektra -std=gnu99 -Wno-deprecated-declarations -Wstrict-prototypes -Wno-long-long -pedantic -Wno-variadic-macros -Wall -Wextra -Wno-overlength-strings -Wsign-compare -Wfloat-equal -Wformat -Wformat-security -Wshadow -Wcomments -Wtrigraphs -Wundef -Wuninitialized -Winit-self -Wmaybe-uninitialized -Wsign-compare -Wfloat-equal -O2 -fwrapv -pipe -Wformat -Werror=format-security -gdwarf-4 -fno-debug-types-section -fvar-tracking-assignments -g2 -Wp,-D_FORTIFY_SOURCE=2 -fstack-protector-strong --param=ssp-buffer-size=4 -Werror=trampolines -fPIC -mtune=generic -march=x86-64 -gdwarf-4 -fno-debug-types-section -fvar-tracking-assignments -g2 -DNDEBUG -DQT_NO_DEBUG -fPIC -o CMakeFiles/elektra.dir/keymeta.c.o -c /tmp/B.crNwZC/BUILD/elektra-0.8.23/src/libs/elektra/keymeta.c make[2]: Leaving directory '/tmp/B.crNwZC/BUILD/elektra-0.8.23/build' make[2]: Entering directory '/tmp/B.crNwZC/BUILD/elektra-0.8.23/build' [ 10%] Building C object src/libs/elektra/CMakeFiles/elektra.dir/kdb.c.o cd /tmp/B.crNwZC/BUILD/elektra-0.8.23/build/src/libs/elektra && /usr/bin/x86_64-pld-linux-gnux32-gcc -DHAVE_KDBCONFIG_H -Delektra_EXPORTS -I/tmp/B.crNwZC/BUILD/elektra-0.8.23/build/src/include -I/tmp/B.crNwZC/BUILD/elektra-0.8.23/src/include -I/tmp/B.crNwZC/BUILD/elektra-0.8.23/build/src/libs/elektra -std=gnu99 -Wno-deprecated-declarations -Wstrict-prototypes -Wno-long-long -pedantic -Wno-variadic-macros -Wall -Wextra -Wno-overlength-strings -Wsign-compare -Wfloat-equal -Wformat -Wformat-security -Wshadow -Wcomments -Wtrigraphs -Wundef -Wuninitialized -Winit-self -Wmaybe-uninitialized -Wsign-compare -Wfloat-equal -O2 -fwrapv -pipe -Wformat -Werror=format-security -gdwarf-4 -fno-debug-types-section -fvar-tracking-assignments -g2 -Wp,-D_FORTIFY_SOURCE=2 -fstack-protector-strong --param=ssp-buffer-size=4 -Werror=trampolines -fPIC -mtune=generic -march=x86-64 -gdwarf-4 -fno-debug-types-section -fvar-tracking-assignments -g2 -DNDEBUG -DQT_NO_DEBUG -fPIC -o CMakeFiles/elektra.dir/kdb.c.o -c /tmp/B.crNwZC/BUILD/elektra-0.8.23/src/libs/elektra/kdb.c make[2]: Leaving directory '/tmp/B.crNwZC/BUILD/elektra-0.8.23/build' make[2]: Entering directory '/tmp/B.crNwZC/BUILD/elektra-0.8.23/build' [ 10%] Building C object src/libs/elektra/CMakeFiles/elektra.dir/split.c.o cd /tmp/B.crNwZC/BUILD/elektra-0.8.23/build/src/libs/elektra && /usr/bin/x86_64-pld-linux-gnux32-gcc -DHAVE_KDBCONFIG_H -Delektra_EXPORTS -I/tmp/B.crNwZC/BUILD/elektra-0.8.23/build/src/include -I/tmp/B.crNwZC/BUILD/elektra-0.8.23/src/include -I/tmp/B.crNwZC/BUILD/elektra-0.8.23/build/src/libs/elektra -std=gnu99 -Wno-deprecated-declarations -Wstrict-prototypes -Wno-long-long -pedantic -Wno-variadic-macros -Wall -Wextra -Wno-overlength-strings -Wsign-compare -Wfloat-equal -Wformat -Wformat-security -Wshadow -Wcomments -Wtrigraphs -Wundef -Wuninitialized -Winit-self -Wmaybe-uninitialized -Wsign-compare -Wfloat-equal -O2 -fwrapv -pipe -Wformat -Werror=format-security -gdwarf-4 -fno-debug-types-section -fvar-tracking-assignments -g2 -Wp,-D_FORTIFY_SOURCE=2 -fstack-protector-strong --param=ssp-buffer-size=4 -Werror=trampolines -fPIC -mtune=generic -march=x86-64 -gdwarf-4 -fno-debug-types-section -fvar-tracking-assignments -g2 -DNDEBUG -DQT_NO_DEBUG -fPIC -o CMakeFiles/elektra.dir/split.c.o -c /tmp/B.crNwZC/BUILD/elektra-0.8.23/src/libs/elektra/split.c make[2]: Leaving directory '/tmp/B.crNwZC/BUILD/elektra-0.8.23/build' make[2]: Entering directory '/tmp/B.crNwZC/BUILD/elektra-0.8.23/build' [ 10%] Building C object src/libs/elektra/CMakeFiles/elektra.dir/trie.c.o cd /tmp/B.crNwZC/BUILD/elektra-0.8.23/build/src/libs/elektra && /usr/bin/x86_64-pld-linux-gnux32-gcc -DHAVE_KDBCONFIG_H -Delektra_EXPORTS -I/tmp/B.crNwZC/BUILD/elektra-0.8.23/build/src/include -I/tmp/B.crNwZC/BUILD/elektra-0.8.23/src/include -I/tmp/B.crNwZC/BUILD/elektra-0.8.23/build/src/libs/elektra -std=gnu99 -Wno-deprecated-declarations -Wstrict-prototypes -Wno-long-long -pedantic -Wno-variadic-macros -Wall -Wextra -Wno-overlength-strings -Wsign-compare -Wfloat-equal -Wformat -Wformat-security -Wshadow -Wcomments -Wtrigraphs -Wundef -Wuninitialized -Winit-self -Wmaybe-uninitialized -Wsign-compare -Wfloat-equal -O2 -fwrapv -pipe -Wformat -Werror=format-security -gdwarf-4 -fno-debug-types-section -fvar-tracking-assignments -g2 -Wp,-D_FORTIFY_SOURCE=2 -fstack-protector-strong --param=ssp-buffer-size=4 -Werror=trampolines -fPIC -mtune=generic -march=x86-64 -gdwarf-4 -fno-debug-types-section -fvar-tracking-assignments -g2 -DNDEBUG -DQT_NO_DEBUG -fPIC -o CMakeFiles/elektra.dir/trie.c.o -c /tmp/B.crNwZC/BUILD/elektra-0.8.23/src/libs/elektra/trie.c make[2]: Leaving directory '/tmp/B.crNwZC/BUILD/elektra-0.8.23/build' make[2]: Entering directory '/tmp/B.crNwZC/BUILD/elektra-0.8.23/build' [ 10%] Building C object src/libs/elektra/CMakeFiles/elektra.dir/plugin.c.o cd /tmp/B.crNwZC/BUILD/elektra-0.8.23/build/src/libs/elektra && /usr/bin/x86_64-pld-linux-gnux32-gcc -DHAVE_KDBCONFIG_H -Delektra_EXPORTS -I/tmp/B.crNwZC/BUILD/elektra-0.8.23/build/src/include -I/tmp/B.crNwZC/BUILD/elektra-0.8.23/src/include -I/tmp/B.crNwZC/BUILD/elektra-0.8.23/build/src/libs/elektra -std=gnu99 -Wno-deprecated-declarations -Wstrict-prototypes -Wno-long-long -pedantic -Wno-variadic-macros -Wall -Wextra -Wno-overlength-strings -Wsign-compare -Wfloat-equal -Wformat -Wformat-security -Wshadow -Wcomments -Wtrigraphs -Wundef -Wuninitialized -Winit-self -Wmaybe-uninitialized -Wsign-compare -Wfloat-equal -O2 -fwrapv -pipe -Wformat -Werror=format-security -gdwarf-4 -fno-debug-types-section -fvar-tracking-assignments -g2 -Wp,-D_FORTIFY_SOURCE=2 -fstack-protector-strong --param=ssp-buffer-size=4 -Werror=trampolines -fPIC -mtune=generic -march=x86-64 -gdwarf-4 -fno-debug-types-section -fvar-tracking-assignments -g2 -DNDEBUG -DQT_NO_DEBUG -fPIC -o CMakeFiles/elektra.dir/plugin.c.o -c /tmp/B.crNwZC/BUILD/elektra-0.8.23/src/libs/elektra/plugin.c make[2]: Leaving directory '/tmp/B.crNwZC/BUILD/elektra-0.8.23/build' make[2]: Entering directory '/tmp/B.crNwZC/BUILD/elektra-0.8.23/build' [ 11%] Building C object src/libs/elektra/CMakeFiles/elektra.dir/keyvalue.c.o cd /tmp/B.crNwZC/BUILD/elektra-0.8.23/build/src/libs/elektra && /usr/bin/x86_64-pld-linux-gnux32-gcc -DHAVE_KDBCONFIG_H -Delektra_EXPORTS -I/tmp/B.crNwZC/BUILD/elektra-0.8.23/build/src/include -I/tmp/B.crNwZC/BUILD/elektra-0.8.23/src/include -I/tmp/B.crNwZC/BUILD/elektra-0.8.23/build/src/libs/elektra -std=gnu99 -Wno-deprecated-declarations -Wstrict-prototypes -Wno-long-long -pedantic -Wno-variadic-macros -Wall -Wextra -Wno-overlength-strings -Wsign-compare -Wfloat-equal -Wformat -Wformat-security -Wshadow -Wcomments -Wtrigraphs -Wundef -Wuninitialized -Winit-self -Wmaybe-uninitialized -Wsign-compare -Wfloat-equal -O2 -fwrapv -pipe -Wformat -Werror=format-security -gdwarf-4 -fno-debug-types-section -fvar-tracking-assignments -g2 -Wp,-D_FORTIFY_SOURCE=2 -fstack-protector-strong --param=ssp-buffer-size=4 -Werror=trampolines -fPIC -mtune=generic -march=x86-64 -gdwarf-4 -fno-debug-types-section -fvar-tracking-assignments -g2 -DNDEBUG -DQT_NO_DEBUG -fPIC -o CMakeFiles/elektra.dir/keyvalue.c.o -c /tmp/B.crNwZC/BUILD/elektra-0.8.23/src/libs/elektra/keyvalue.c make[2]: Leaving directory '/tmp/B.crNwZC/BUILD/elektra-0.8.23/build' make[2]: Entering directory '/tmp/B.crNwZC/BUILD/elektra-0.8.23/build' [ 11%] Building C object src/libs/elektra/CMakeFiles/elektra.dir/nolog.c.o cd /tmp/B.crNwZC/BUILD/elektra-0.8.23/build/src/libs/elektra && /usr/bin/x86_64-pld-linux-gnux32-gcc -DHAVE_KDBCONFIG_H -Delektra_EXPORTS -I/tmp/B.crNwZC/BUILD/elektra-0.8.23/build/src/include -I/tmp/B.crNwZC/BUILD/elektra-0.8.23/src/include -I/tmp/B.crNwZC/BUILD/elektra-0.8.23/build/src/libs/elektra -std=gnu99 -Wno-deprecated-declarations -Wstrict-prototypes -Wno-long-long -pedantic -Wno-variadic-macros -Wall -Wextra -Wno-overlength-strings -Wsign-compare -Wfloat-equal -Wformat -Wformat-security -Wshadow -Wcomments -Wtrigraphs -Wundef -Wuninitialized -Winit-self -Wmaybe-uninitialized -Wsign-compare -Wfloat-equal -O2 -fwrapv -pipe -Wformat -Werror=format-security -gdwarf-4 -fno-debug-types-section -fvar-tracking-assignments -g2 -Wp,-D_FORTIFY_SOURCE=2 -fstack-protector-strong --param=ssp-buffer-size=4 -Werror=trampolines -fPIC -mtune=generic -march=x86-64 -gdwarf-4 -fno-debug-types-section -fvar-tracking-assignments -g2 -DNDEBUG -DQT_NO_DEBUG -fPIC -o CMakeFiles/elektra.dir/nolog.c.o -c /tmp/B.crNwZC/BUILD/elektra-0.8.23/src/libs/elektra/nolog.c make[2]: Leaving directory '/tmp/B.crNwZC/BUILD/elektra-0.8.23/build' make[2]: Entering directory '/tmp/B.crNwZC/BUILD/elektra-0.8.23/build' [ 11%] Building C object src/libs/elektra/CMakeFiles/elektra.dir/owner.c.o cd /tmp/B.crNwZC/BUILD/elektra-0.8.23/build/src/libs/elektra && /usr/bin/x86_64-pld-linux-gnux32-gcc -DHAVE_KDBCONFIG_H -Delektra_EXPORTS -I/tmp/B.crNwZC/BUILD/elektra-0.8.23/build/src/include -I/tmp/B.crNwZC/BUILD/elektra-0.8.23/src/include -I/tmp/B.crNwZC/BUILD/elektra-0.8.23/build/src/libs/elektra -std=gnu99 -Wno-deprecated-declarations -Wstrict-prototypes -Wno-long-long -pedantic -Wno-variadic-macros -Wall -Wextra -Wno-overlength-strings -Wsign-compare -Wfloat-equal -Wformat -Wformat-security -Wshadow -Wcomments -Wtrigraphs -Wundef -Wuninitialized -Winit-self -Wmaybe-uninitialized -Wsign-compare -Wfloat-equal -O2 -fwrapv -pipe -Wformat -Werror=format-security -gdwarf-4 -fno-debug-types-section -fvar-tracking-assignments -g2 -Wp,-D_FORTIFY_SOURCE=2 -fstack-protector-strong --param=ssp-buffer-size=4 -Werror=trampolines -fPIC -mtune=generic -march=x86-64 -gdwarf-4 -fno-debug-types-section -fvar-tracking-assignments -g2 -DNDEBUG -DQT_NO_DEBUG -fPIC -o CMakeFiles/elektra.dir/owner.c.o -c /tmp/B.crNwZC/BUILD/elektra-0.8.23/src/libs/elektra/owner.c make[2]: Leaving directory '/tmp/B.crNwZC/BUILD/elektra-0.8.23/build' make[2]: Entering directory '/tmp/B.crNwZC/BUILD/elektra-0.8.23/build' [ 12%] Building C object src/libs/elektra/CMakeFiles/elektra.dir/proposal.c.o cd /tmp/B.crNwZC/BUILD/elektra-0.8.23/build/src/libs/elektra && /usr/bin/x86_64-pld-linux-gnux32-gcc -DHAVE_KDBCONFIG_H -Delektra_EXPORTS -I/tmp/B.crNwZC/BUILD/elektra-0.8.23/build/src/include -I/tmp/B.crNwZC/BUILD/elektra-0.8.23/src/include -I/tmp/B.crNwZC/BUILD/elektra-0.8.23/build/src/libs/elektra -std=gnu99 -Wno-deprecated-declarations -Wstrict-prototypes -Wno-long-long -pedantic -Wno-variadic-macros -Wall -Wextra -Wno-overlength-strings -Wsign-compare -Wfloat-equal -Wformat -Wformat-security -Wshadow -Wcomments -Wtrigraphs -Wundef -Wuninitialized -Winit-self -Wmaybe-uninitialized -Wsign-compare -Wfloat-equal -O2 -fwrapv -pipe -Wformat -Werror=format-security -gdwarf-4 -fno-debug-types-section -fvar-tracking-assignments -g2 -Wp,-D_FORTIFY_SOURCE=2 -fstack-protector-strong --param=ssp-buffer-size=4 -Werror=trampolines -fPIC -mtune=generic -march=x86-64 -gdwarf-4 -fno-debug-types-section -fvar-tracking-assignments -g2 -DNDEBUG -DQT_NO_DEBUG -fPIC -o CMakeFiles/elektra.dir/proposal.c.o -c /tmp/B.crNwZC/BUILD/elektra-0.8.23/src/libs/elektra/proposal.c make[2]: Leaving directory '/tmp/B.crNwZC/BUILD/elektra-0.8.23/build' make[2]: Entering directory '/tmp/B.crNwZC/BUILD/elektra-0.8.23/build' [ 10%] Building C object src/libs/elektra/CMakeFiles/elektra.dir/internal.c.o cd /tmp/B.crNwZC/BUILD/elektra-0.8.23/build/src/libs/elektra && /usr/bin/x86_64-pld-linux-gnux32-gcc -DHAVE_KDBCONFIG_H -Delektra_EXPORTS -I/tmp/B.crNwZC/BUILD/elektra-0.8.23/build/src/include -I/tmp/B.crNwZC/BUILD/elektra-0.8.23/src/include -I/tmp/B.crNwZC/BUILD/elektra-0.8.23/build/src/libs/elektra -std=gnu99 -Wno-deprecated-declarations -Wstrict-prototypes -Wno-long-long -pedantic -Wno-variadic-macros -Wall -Wextra -Wno-overlength-strings -Wsign-compare -Wfloat-equal -Wformat -Wformat-security -Wshadow -Wcomments -Wtrigraphs -Wundef -Wuninitialized -Winit-self -Wmaybe-uninitialized -Wsign-compare -Wfloat-equal -O2 -fwrapv -pipe -Wformat -Werror=format-security -gdwarf-4 -fno-debug-types-section -fvar-tracking-assignments -g2 -Wp,-D_FORTIFY_SOURCE=2 -fstack-protector-strong --param=ssp-buffer-size=4 -Werror=trampolines -fPIC -mtune=generic -march=x86-64 -gdwarf-4 -fno-debug-types-section -fvar-tracking-assignments -g2 -DNDEBUG -DQT_NO_DEBUG -fPIC -o CMakeFiles/elektra.dir/internal.c.o -c /tmp/B.crNwZC/BUILD/elektra-0.8.23/src/libs/elektra/internal.c make[2]: Leaving directory '/tmp/B.crNwZC/BUILD/elektra-0.8.23/build' make[2]: Entering directory '/tmp/B.crNwZC/BUILD/elektra-0.8.23/build' [ 12%] Building C object src/libs/elektra/CMakeFiles/elektra.dir/rand.c.o cd /tmp/B.crNwZC/BUILD/elektra-0.8.23/build/src/libs/elektra && /usr/bin/x86_64-pld-linux-gnux32-gcc -DHAVE_KDBCONFIG_H -Delektra_EXPORTS -I/tmp/B.crNwZC/BUILD/elektra-0.8.23/build/src/include -I/tmp/B.crNwZC/BUILD/elektra-0.8.23/src/include -I/tmp/B.crNwZC/BUILD/elektra-0.8.23/build/src/libs/elektra -std=gnu99 -Wno-deprecated-declarations -Wstrict-prototypes -Wno-long-long -pedantic -Wno-variadic-macros -Wall -Wextra -Wno-overlength-strings -Wsign-compare -Wfloat-equal -Wformat -Wformat-security -Wshadow -Wcomments -Wtrigraphs -Wundef -Wuninitialized -Winit-self -Wmaybe-uninitialized -Wsign-compare -Wfloat-equal -O2 -fwrapv -pipe -Wformat -Werror=format-security -gdwarf-4 -fno-debug-types-section -fvar-tracking-assignments -g2 -Wp,-D_FORTIFY_SOURCE=2 -fstack-protector-strong --param=ssp-buffer-size=4 -Werror=trampolines -fPIC -mtune=generic -march=x86-64 -gdwarf-4 -fno-debug-types-section -fvar-tracking-assignments -g2 -DNDEBUG -DQT_NO_DEBUG -fPIC -o CMakeFiles/elektra.dir/rand.c.o -c /tmp/B.crNwZC/BUILD/elektra-0.8.23/src/libs/elektra/rand.c make[2]: Leaving directory '/tmp/B.crNwZC/BUILD/elektra-0.8.23/build' make[2]: Entering directory '/tmp/B.crNwZC/BUILD/elektra-0.8.23/build' [ 11%] Building C object src/libs/elektra/CMakeFiles/elektra.dir/opmphm.c.o cd /tmp/B.crNwZC/BUILD/elektra-0.8.23/build/src/libs/elektra && /usr/bin/x86_64-pld-linux-gnux32-gcc -DHAVE_KDBCONFIG_H -Delektra_EXPORTS -I/tmp/B.crNwZC/BUILD/elektra-0.8.23/build/src/include -I/tmp/B.crNwZC/BUILD/elektra-0.8.23/src/include -I/tmp/B.crNwZC/BUILD/elektra-0.8.23/build/src/libs/elektra -std=gnu99 -Wno-deprecated-declarations -Wstrict-prototypes -Wno-long-long -pedantic -Wno-variadic-macros -Wall -Wextra -Wno-overlength-strings -Wsign-compare -Wfloat-equal -Wformat -Wformat-security -Wshadow -Wcomments -Wtrigraphs -Wundef -Wuninitialized -Winit-self -Wmaybe-uninitialized -Wsign-compare -Wfloat-equal -O2 -fwrapv -pipe -Wformat -Werror=format-security -gdwarf-4 -fno-debug-types-section -fvar-tracking-assignments -g2 -Wp,-D_FORTIFY_SOURCE=2 -fstack-protector-strong --param=ssp-buffer-size=4 -Werror=trampolines -fPIC -mtune=generic -march=x86-64 -gdwarf-4 -fno-debug-types-section -fvar-tracking-assignments -g2 -DNDEBUG -DQT_NO_DEBUG -fPIC -o CMakeFiles/elektra.dir/opmphm.c.o -c /tmp/B.crNwZC/BUILD/elektra-0.8.23/src/libs/elektra/opmphm.c make[2]: Leaving directory '/tmp/B.crNwZC/BUILD/elektra-0.8.23/build' make[2]: Entering directory '/tmp/B.crNwZC/BUILD/elektra-0.8.23/build' [ 11%] Building C object src/libs/elektra/CMakeFiles/elektra.dir/keyname.c.o cd /tmp/B.crNwZC/BUILD/elektra-0.8.23/build/src/libs/elektra && /usr/bin/x86_64-pld-linux-gnux32-gcc -DHAVE_KDBCONFIG_H -Delektra_EXPORTS -I/tmp/B.crNwZC/BUILD/elektra-0.8.23/build/src/include -I/tmp/B.crNwZC/BUILD/elektra-0.8.23/src/include -I/tmp/B.crNwZC/BUILD/elektra-0.8.23/build/src/libs/elektra -std=gnu99 -Wno-deprecated-declarations -Wstrict-prototypes -Wno-long-long -pedantic -Wno-variadic-macros -Wall -Wextra -Wno-overlength-strings -Wsign-compare -Wfloat-equal -Wformat -Wformat-security -Wshadow -Wcomments -Wtrigraphs -Wundef -Wuninitialized -Winit-self -Wmaybe-uninitialized -Wsign-compare -Wfloat-equal -O2 -fwrapv -pipe -Wformat -Werror=format-security -gdwarf-4 -fno-debug-types-section -fvar-tracking-assignments -g2 -Wp,-D_FORTIFY_SOURCE=2 -fstack-protector-strong --param=ssp-buffer-size=4 -Werror=trampolines -fPIC -mtune=generic -march=x86-64 -gdwarf-4 -fno-debug-types-section -fvar-tracking-assignments -g2 -DNDEBUG -DQT_NO_DEBUG -fPIC -o CMakeFiles/elektra.dir/keyname.c.o -c /tmp/B.crNwZC/BUILD/elektra-0.8.23/src/libs/elektra/keyname.c make[2]: Leaving directory '/tmp/B.crNwZC/BUILD/elektra-0.8.23/build' make[2]: Entering directory '/tmp/B.crNwZC/BUILD/elektra-0.8.23/build' [ 11%] Building C object src/libs/elektra/CMakeFiles/elektra.dir/keytest.c.o cd /tmp/B.crNwZC/BUILD/elektra-0.8.23/build/src/libs/elektra && /usr/bin/x86_64-pld-linux-gnux32-gcc -DHAVE_KDBCONFIG_H -Delektra_EXPORTS -I/tmp/B.crNwZC/BUILD/elektra-0.8.23/build/src/include -I/tmp/B.crNwZC/BUILD/elektra-0.8.23/src/include -I/tmp/B.crNwZC/BUILD/elektra-0.8.23/build/src/libs/elektra -std=gnu99 -Wno-deprecated-declarations -Wstrict-prototypes -Wno-long-long -pedantic -Wno-variadic-macros -Wall -Wextra -Wno-overlength-strings -Wsign-compare -Wfloat-equal -Wformat -Wformat-security -Wshadow -Wcomments -Wtrigraphs -Wundef -Wuninitialized -Winit-self -Wmaybe-uninitialized -Wsign-compare -Wfloat-equal -O2 -fwrapv -pipe -Wformat -Werror=format-security -gdwarf-4 -fno-debug-types-section -fvar-tracking-assignments -g2 -Wp,-D_FORTIFY_SOURCE=2 -fstack-protector-strong --param=ssp-buffer-size=4 -Werror=trampolines -fPIC -mtune=generic -march=x86-64 -gdwarf-4 -fno-debug-types-section -fvar-tracking-assignments -g2 -DNDEBUG -DQT_NO_DEBUG -fPIC -o CMakeFiles/elektra.dir/keytest.c.o -c /tmp/B.crNwZC/BUILD/elektra-0.8.23/src/libs/elektra/keytest.c make[2]: Leaving directory '/tmp/B.crNwZC/BUILD/elektra-0.8.23/build' make[2]: Entering directory '/tmp/B.crNwZC/BUILD/elektra-0.8.23/build' [ 11%] Building C object src/libs/elektra/CMakeFiles/elektra.dir/keyset.c.o cd /tmp/B.crNwZC/BUILD/elektra-0.8.23/build/src/libs/elektra && /usr/bin/x86_64-pld-linux-gnux32-gcc -DHAVE_KDBCONFIG_H -Delektra_EXPORTS -I/tmp/B.crNwZC/BUILD/elektra-0.8.23/build/src/include -I/tmp/B.crNwZC/BUILD/elektra-0.8.23/src/include -I/tmp/B.crNwZC/BUILD/elektra-0.8.23/build/src/libs/elektra -std=gnu99 -Wno-deprecated-declarations -Wstrict-prototypes -Wno-long-long -pedantic -Wno-variadic-macros -Wall -Wextra -Wno-overlength-strings -Wsign-compare -Wfloat-equal -Wformat -Wformat-security -Wshadow -Wcomments -Wtrigraphs -Wundef -Wuninitialized -Winit-self -Wmaybe-uninitialized -Wsign-compare -Wfloat-equal -O2 -fwrapv -pipe -Wformat -Werror=format-security -gdwarf-4 -fno-debug-types-section -fvar-tracking-assignments -g2 -Wp,-D_FORTIFY_SOURCE=2 -fstack-protector-strong --param=ssp-buffer-size=4 -Werror=trampolines -fPIC -mtune=generic -march=x86-64 -gdwarf-4 -fno-debug-types-section -fvar-tracking-assignments -g2 -DNDEBUG -DQT_NO_DEBUG -fPIC -o CMakeFiles/elektra.dir/keyset.c.o -c /tmp/B.crNwZC/BUILD/elektra-0.8.23/src/libs/elektra/keyset.c In file included from /usr/include/string.h:519, from /tmp/B.crNwZC/BUILD/elektra-0.8.23/src/libs/elektra/keyset.c:26: In function 'strncpy', inlined from 'elektraLookupByCascading' at /tmp/B.crNwZC/BUILD/elektra-0.8.23/src/libs/elektra/keyset.c:1801:3: /usr/include/bits/string_fortified.h:95:10: warning: '__builtin_strncpy' output truncated before terminating nul copying 4 bytes from a string of the same length [-Wstringop-truncation] 95 | return __builtin___strncpy_chk (__dest, __src, __len, | ^~~~~~~~~~~~~~~~~~~~~~~~~~~~~~~~~~~~~~~~~~~~~~ 96 | __glibc_objsize (__dest)); | ~~~~~~~~~~~~~~~~~~~~~~~~~ In function 'strncpy', inlined from 'elektraLookupByCascading' at /tmp/B.crNwZC/BUILD/elektra-0.8.23/src/libs/elektra/keyset.c:1832:2: /usr/include/bits/string_fortified.h:95:10: warning: '__builtin_strncpy' output truncated before terminating nul copying 4 bytes from a string of the same length [-Wstringop-truncation] 95 | return __builtin___strncpy_chk (__dest, __src, __len, | ^~~~~~~~~~~~~~~~~~~~~~~~~~~~~~~~~~~~~~~~~~~~~~ 96 | __glibc_objsize (__dest)); | ~~~~~~~~~~~~~~~~~~~~~~~~~ In function 'strncpy', inlined from 'elektraLookupByCascading' at /tmp/B.crNwZC/BUILD/elektra-0.8.23/src/libs/elektra/keyset.c:1851:3: /usr/include/bits/string_fortified.h:95:10: warning: '__builtin_strncpy' output truncated before terminating nul copying 4 bytes from a string of the same length [-Wstringop-truncation] 95 | return __builtin___strncpy_chk (__dest, __src, __len, | ^~~~~~~~~~~~~~~~~~~~~~~~~~~~~~~~~~~~~~~~~~~~~~ 96 | __glibc_objsize (__dest)); | ~~~~~~~~~~~~~~~~~~~~~~~~~ In function 'strncpy', inlined from 'elektraLookupByCascading' at /tmp/B.crNwZC/BUILD/elektra-0.8.23/src/libs/elektra/keyset.c:1841:3: /usr/include/bits/string_fortified.h:95:10: warning: '__builtin_strncpy' output truncated before terminating nul copying 3 bytes from a string of the same length [-Wstringop-truncation] 95 | return __builtin___strncpy_chk (__dest, __src, __len, | ^~~~~~~~~~~~~~~~~~~~~~~~~~~~~~~~~~~~~~~~~~~~~~ 96 | __glibc_objsize (__dest)); | ~~~~~~~~~~~~~~~~~~~~~~~~~ In function 'strncpy', inlined from 'elektraLookupByCascading' at /tmp/B.crNwZC/BUILD/elektra-0.8.23/src/libs/elektra/keyset.c:1861:3: /usr/include/bits/string_fortified.h:95:10: warning: '__builtin_strncpy' output truncated before terminating nul copying 6 bytes from a string of the same length [-Wstringop-truncation] 95 | return __builtin___strncpy_chk (__dest, __src, __len, | ^~~~~~~~~~~~~~~~~~~~~~~~~~~~~~~~~~~~~~~~~~~~~~ 96 | __glibc_objsize (__dest)); | ~~~~~~~~~~~~~~~~~~~~~~~~~ In function 'strncpy', inlined from 'ksCut' at /tmp/B.crNwZC/BUILD/elektra-0.8.23/src/libs/elektra/keyset.c:1089:5: /usr/include/bits/string_fortified.h:95:10: warning: '__builtin_strncpy' output truncated before terminating nul copying 4 bytes from a string of the same length [-Wstringop-truncation] 95 | return __builtin___strncpy_chk (__dest, __src, __len, | ^~~~~~~~~~~~~~~~~~~~~~~~~~~~~~~~~~~~~~~~~~~~~~ 96 | __glibc_objsize (__dest)); | ~~~~~~~~~~~~~~~~~~~~~~~~~ In function 'strncpy', inlined from 'ksCut' at /tmp/B.crNwZC/BUILD/elektra-0.8.23/src/libs/elektra/keyset.c:1097:5: /usr/include/bits/string_fortified.h:95:10: warning: '__builtin_strncpy' output truncated before terminating nul copying 4 bytes from a string of the same length [-Wstringop-truncation] 95 | return __builtin___strncpy_chk (__dest, __src, __len, | ^~~~~~~~~~~~~~~~~~~~~~~~~~~~~~~~~~~~~~~~~~~~~~ 96 | __glibc_objsize (__dest)); | ~~~~~~~~~~~~~~~~~~~~~~~~~ In function 'strncpy', inlined from 'ksCut' at /tmp/B.crNwZC/BUILD/elektra-0.8.23/src/libs/elektra/keyset.c:1105:5: /usr/include/bits/string_fortified.h:95:10: warning: '__builtin_strncpy' output truncated before terminating nul copying 3 bytes from a string of the same length [-Wstringop-truncation] 95 | return __builtin___strncpy_chk (__dest, __src, __len, | ^~~~~~~~~~~~~~~~~~~~~~~~~~~~~~~~~~~~~~~~~~~~~~ 96 | __glibc_objsize (__dest)); | ~~~~~~~~~~~~~~~~~~~~~~~~~ In function 'strncpy', inlined from 'ksCut' at /tmp/B.crNwZC/BUILD/elektra-0.8.23/src/libs/elektra/keyset.c:1113:5: /usr/include/bits/string_fortified.h:95:10: warning: '__builtin_strncpy' output truncated before terminating nul copying 4 bytes from a string of the same length [-Wstringop-truncation] 95 | return __builtin___strncpy_chk (__dest, __src, __len, | ^~~~~~~~~~~~~~~~~~~~~~~~~~~~~~~~~~~~~~~~~~~~~~ 96 | __glibc_objsize (__dest)); | ~~~~~~~~~~~~~~~~~~~~~~~~~ In function 'strncpy', inlined from 'ksCut' at /tmp/B.crNwZC/BUILD/elektra-0.8.23/src/libs/elektra/keyset.c:1121:5: /usr/include/bits/string_fortified.h:95:10: warning: '__builtin_strncpy' output truncated before terminating nul copying 6 bytes from a string of the same length [-Wstringop-truncation] 95 | return __builtin___strncpy_chk (__dest, __src, __len, | ^~~~~~~~~~~~~~~~~~~~~~~~~~~~~~~~~~~~~~~~~~~~~~ 96 | __glibc_objsize (__dest)); | ~~~~~~~~~~~~~~~~~~~~~~~~~ make[2]: Leaving directory '/tmp/B.crNwZC/BUILD/elektra-0.8.23/build' make[2]: Entering directory '/tmp/B.crNwZC/BUILD/elektra-0.8.23/build' [ 12%] Building C object src/libs/elektra/CMakeFiles/elektra.dir/__/loader/dl.c.o cd /tmp/B.crNwZC/BUILD/elektra-0.8.23/build/src/libs/elektra && /usr/bin/x86_64-pld-linux-gnux32-gcc -DHAVE_KDBCONFIG_H -Delektra_EXPORTS -I/tmp/B.crNwZC/BUILD/elektra-0.8.23/build/src/include -I/tmp/B.crNwZC/BUILD/elektra-0.8.23/src/include -I/tmp/B.crNwZC/BUILD/elektra-0.8.23/build/src/libs/elektra -std=gnu99 -Wno-deprecated-declarations -Wstrict-prototypes -Wno-long-long -pedantic -Wno-variadic-macros -Wall -Wextra -Wno-overlength-strings -Wsign-compare -Wfloat-equal -Wformat -Wformat-security -Wshadow -Wcomments -Wtrigraphs -Wundef -Wuninitialized -Winit-self -Wmaybe-uninitialized -Wsign-compare -Wfloat-equal -O2 -fwrapv -pipe -Wformat -Werror=format-security -gdwarf-4 -fno-debug-types-section -fvar-tracking-assignments -g2 -Wp,-D_FORTIFY_SOURCE=2 -fstack-protector-strong --param=ssp-buffer-size=4 -Werror=trampolines -fPIC -mtune=generic -march=x86-64 -gdwarf-4 -fno-debug-types-section -fvar-tracking-assignments -g2 -DNDEBUG -DQT_NO_DEBUG -fPIC -o CMakeFiles/elektra.dir/__/loader/dl.c.o -c /tmp/B.crNwZC/BUILD/elektra-0.8.23/src/libs/loader/dl.c make[2]: Leaving directory '/tmp/B.crNwZC/BUILD/elektra-0.8.23/build' make[2]: Entering directory '/tmp/B.crNwZC/BUILD/elektra-0.8.23/build' [ 12%] Linking C shared library ../../../lib/libelektra.so cd /tmp/B.crNwZC/BUILD/elektra-0.8.23/build/src/libs/elektra && /usr/bin/cmake -E cmake_link_script CMakeFiles/elektra.dir/link.txt --verbose=1 /usr/bin/x86_64-pld-linux-gnux32-gcc -fPIC -std=gnu99 -Wno-deprecated-declarations -Wstrict-prototypes -Wno-long-long -pedantic -Wno-variadic-macros -Wall -Wextra -Wno-overlength-strings -Wsign-compare -Wfloat-equal -Wformat -Wformat-security -Wshadow -Wcomments -Wtrigraphs -Wundef -Wuninitialized -Winit-self -Wmaybe-uninitialized -Wsign-compare -Wfloat-equal -O2 -fwrapv -pipe -Wformat -Werror=format-security -gdwarf-4 -fno-debug-types-section -fvar-tracking-assignments -g2 -Wp,-D_FORTIFY_SOURCE=2 -fstack-protector-strong --param=ssp-buffer-size=4 -Werror=trampolines -fPIC -mtune=generic -march=x86-64 -gdwarf-4 -fno-debug-types-section -fvar-tracking-assignments -g2 -DNDEBUG -DQT_NO_DEBUG -Wl,--version-script=/tmp/B.crNwZC/BUILD/elektra-0.8.23/src/libs/elektra/libelektra-symbols.map -Wl,--as-needed -Wl,--no-copy-dt-needed-entries -Wl,-z,relro -Wl,-z,combreloc -shared -Wl,-soname,libelektra.so.4 -o ../../../lib/libelektra.so.0.8.23 CMakeFiles/elektra.dir/backend.c.o CMakeFiles/elektra.dir/kdb.c.o CMakeFiles/elektra.dir/mount.c.o CMakeFiles/elektra.dir/plugin.c.o CMakeFiles/elektra.dir/split.c.o CMakeFiles/elektra.dir/trie.c.o CMakeFiles/elektra.dir/global.c.o CMakeFiles/elektra.dir/internal.c.o CMakeFiles/elektra.dir/kdbenum.c.o CMakeFiles/elektra.dir/key.c.o CMakeFiles/elektra.dir/keyhelpers.c.o CMakeFiles/elektra.dir/keymeta.c.o CMakeFiles/elektra.dir/keyname.c.o CMakeFiles/elektra.dir/keyset.c.o CMakeFiles/elektra.dir/keytest.c.o CMakeFiles/elektra.dir/keyvalue.c.o CMakeFiles/elektra.dir/nolog.c.o CMakeFiles/elektra.dir/opmphm.c.o CMakeFiles/elektra.dir/owner.c.o CMakeFiles/elektra.dir/proposal.c.o CMakeFiles/elektra.dir/rand.c.o CMakeFiles/elektra.dir/__/loader/dl.c.o -Wl,-rpath,::::::::::::::::::: -ldl cd /tmp/B.crNwZC/BUILD/elektra-0.8.23/build/src/libs/elektra && /usr/bin/cmake -E cmake_symlink_library ../../../lib/libelektra.so.0.8.23 ../../../lib/libelektra.so.4 ../../../lib/libelektra.so make[2]: Leaving directory '/tmp/B.crNwZC/BUILD/elektra-0.8.23/build' make[1]: Entering directory '/tmp/B.crNwZC/BUILD/elektra-0.8.23/build' [ 12%] Built target elektra make[1]: Leaving directory '/tmp/B.crNwZC/BUILD/elektra-0.8.23/build' make[2]: Entering directory '/tmp/B.crNwZC/BUILD/elektra-0.8.23/build' [ 7%] Generating html/index.html, man/man3elektra/kdb.3elektra /usr/bin/doxygen /tmp/B.crNwZC/BUILD/elektra-0.8.23/build/doc/Doxyfile warning: Tag `CLANG_ASSISTED_PARSING' at line 1046 of file `/tmp/B.crNwZC/BUILD/elektra-0.8.23/build/doc/Doxyfile' belongs to an option that was not enabled at compile time. To avoid this warning please remove this line from your configuration file or upgrade it using "doxygen -u", or recompile doxygen with this feature enabled. warning: Tag `CLANG_OPTIONS' at line 1054 of file `/tmp/B.crNwZC/BUILD/elektra-0.8.23/build/doc/Doxyfile' belongs to an option that was not enabled at compile time. To avoid this warning please remove this line from your configuration file or upgrade it using "doxygen -u", or recompile doxygen with this feature enabled. ASSERT: "0" in /tmp/B.Zt_gRQ/BUILD/doxygen-1.8.10/src/docparser.cpp (5676) make[2]: Leaving directory '/tmp/B.crNwZC/BUILD/elektra-0.8.23/build' make[1]: Entering directory '/tmp/B.crNwZC/BUILD/elektra-0.8.23/build' [ 12%] Built target html make[1]: Leaving directory '/tmp/B.crNwZC/BUILD/elektra-0.8.23/build' make[2]: Entering directory '/tmp/B.crNwZC/BUILD/elektra-0.8.23/build' [ 6%] Building CXX object gtest/CMakeFiles/gtest.dir/src/gtest-all.cc.o cd /tmp/B.crNwZC/BUILD/elektra-0.8.23/build/gtest && /usr/bin/x86_64-pld-linux-gnux32-g++ -DGTEST_HAS_PTHREAD=1 -I/tmp/B.crNwZC/BUILD/elektra-0.8.23/tests/gtest-1.7.0/include -I/tmp/B.crNwZC/BUILD/elektra-0.8.23/tests/gtest-1.7.0 -std=c++11 -Wno-deprecated-declarations -Wold-style-cast -Wstrict-null-sentinel -D_GLIBCXX_USE_NANOSLEEP -Wno-missing-field-initializers -Woverloaded-virtual -Wsign-promo -Wno-long-long -pedantic -Wno-variadic-macros -Wall -Wextra -Wno-overlength-strings -Wsign-compare -Wfloat-equal -Wformat -Wformat-security -Wshadow -Wcomments -Wtrigraphs -Wundef -Wuninitialized -Winit-self -Wmaybe-uninitialized -O2 -fwrapv -pipe -Wformat -Werror=format-security -gdwarf-4 -fno-debug-types-section -fvar-tracking-assignments -g2 -Wp,-D_FORTIFY_SOURCE=2 -fstack-protector-strong --param=ssp-buffer-size=4 -Werror=trampolines -fPIC -mtune=generic -march=x86-64 -gdwarf-4 -fno-debug-types-section -fvar-tracking-assignments -g2 -DNDEBUG -DQT_NO_DEBUG -w -o CMakeFiles/gtest.dir/src/gtest-all.cc.o -c /tmp/B.crNwZC/BUILD/elektra-0.8.23/tests/gtest-1.7.0/src/gtest-all.cc make[2]: Leaving directory '/tmp/B.crNwZC/BUILD/elektra-0.8.23/build' make[2]: Entering directory '/tmp/B.crNwZC/BUILD/elektra-0.8.23/build' [ 12%] Linking CXX static library ../lib/libgtest.a cd /tmp/B.crNwZC/BUILD/elektra-0.8.23/build/gtest && /usr/bin/cmake -P CMakeFiles/gtest.dir/cmake_clean_target.cmake cd /tmp/B.crNwZC/BUILD/elektra-0.8.23/build/gtest && /usr/bin/cmake -E cmake_link_script CMakeFiles/gtest.dir/link.txt --verbose=1 /usr/bin/ar qc ../lib/libgtest.a CMakeFiles/gtest.dir/src/gtest-all.cc.o /usr/bin/ranlib ../lib/libgtest.a make[2]: Leaving directory '/tmp/B.crNwZC/BUILD/elektra-0.8.23/build' make[1]: Entering directory '/tmp/B.crNwZC/BUILD/elektra-0.8.23/build' [ 12%] Built target gtest make[1]: Leaving directory '/tmp/B.crNwZC/BUILD/elektra-0.8.23/build' make: *** [Makefile:186: all] Error 2 error: Bad exit status from /tmp/B.crNwZC/BUILD/tmp/rpm-tmp.Q1IEZo (%build) RPM build errors: line 103: It's not recommended to have unversioned Obsoletes: Obsoletes: registry Macro expanded in comment on line 626: %{_libdir}/elektra/libelektra-crypto_botan.so Could not canonicalize hostname: naiad Bad exit status from /tmp/B.crNwZC/BUILD/tmp/rpm-tmp.Q1IEZo (%build) ended at: Thu May 27 17:41:11 2021, done in 0:00:32.779736 error: No files produced. + chmod -R u+rwX /tmp/B.crNwZC/BUILD + rm -rf /tmp/B.crNwZC/tmp /tmp/B.crNwZC/BUILD + rm -rf /tmp/B.crNwZC Begin-PLD-Builder-Info Build-Time: user:121.33s sys:22.98s real:35.86s (faults io:317 non-io:2379786) End-PLD-Builder-Info
[Back to list of logs] [View rpm -qa of builder]