FailedOk

th/SRPMS[OK]
th/x32[OK]
th/i686[OK]
th/x86_64[OK]

ac/SRPMS[OK]
ac/i386[OK]
ac/i586[OK]
ac/i686[OK]
ac/alpha[OK]
ac/amd64[OK]
ac/athlon[OK]
ac/ppc[OK]
ac/sparc[OK]
ac/sparc64[OK]

Advanced Search
main()
Powered by PLD Linux
(c) 2002-2024 PLD Team
$Revision: 1.37 $
Powered by The Golden Path.
Your IP: 44.211.26.178

3DLDF 1e799a7a-71da-4f7c-a755-908d15364525

Status:Failed
Source URL:https://buildlogs.pld-linux.org/pld/th/x86_64/FAIL/3DLDF,1e799a7a-71da-4f7c-a755-908d15364525.bz2
text/plain URL:View!
rpm -qa of builder:View!
Date:2013/11/23 08:08:27
Runtime:0:00:44.126995

Toc:

  • error 1
  • rpm: error: Failed build dependencies:
  • error 2
  • rpm: error: Failed build dependencies:
  • prep
  • Executing(%prep): /bin/sh -e /tmp/B.8ccc11e2-e06d-4183-8de9-6a8489806e25/BUILD/tmp/rpm-tmp.53009
  • build
  • Executing(%build): /bin/sh -e /tmp/B.8ccc11e2-e06d-4183-8de9-6a8489806e25/BUILD/tmp/rpm-tmp.77667
  • error 3
  • ./deftfncs.web:127:22: fatal error: parser.h++: No such file or directory
  • error 4
  • compilation terminated.
  • error 5
  • make[2]: *** [deftfncs.lo] Error 1
  • error 6
  • make[1]: *** [all-recursive] Error 1
  • error 7
  • error: Bad exit status from /tmp/B.8ccc11e2-e06d-4183-8de9-6a8489806e25/BUILD/tmp/rpm-tmp.77667 (%build)
  • error 8
  • RPM build errors:
  • error 9
  • error: No files produced.

Content:

request from: qboosh
checking if we should skip the build
started at: Sat Nov 23 08:06:17 2013
fetching http://src.th.pld-linux.org//srpms/1e799a7a-71da-4f7c-a755-908d15364525/3DLDF-2.0.2-1.src.rpm
fetched 279277209 bytes, 5349.5 K/s
installing srpm: 3DLDF-2.0.2-1.src.rpm
Can't find java virtual machine, aborting.
mesg: ttyname failed: Inappropriate ioctl for device
+ install -d /tmp/B.8ccc11e2-e06d-4183-8de9-6a8489806e25/BUILD /tmp/B.8ccc11e2-e06d-4183-8de9-6a8489806e25/RPMS
+ rpm -Uhv --nodeps --define '_topdir /tmp/B.8ccc11e2-e06d-4183-8de9-6a8489806e25' --define '_specdir %{_topdir}' --define '_sourcedir %{_specdir}' --define '_rpmdir %{_topdir}/RPMS' --define '_builddir %{_topdir}/BUILD' 3DLDF-2.0.2-1.src.rpm
Preparing...                ##################################################
3DLDF                       ##################################################
+ rm -f 3DLDF-2.0.2-1.src.rpm
Can't find java virtual machine, aborting.
mesg: ttyname failed: Inappropriate ioctl for device
+ install -m 700 -d /tmp/B.8ccc11e2-e06d-4183-8de9-6a8489806e25/BUILD/tmp
Can't find java virtual machine, aborting.
mesg: ttyname failed: Inappropriate ioctl for device
+ TMPDIR=/tmp/B.8ccc11e2-e06d-4183-8de9-6a8489806e25/BUILD/tmp
+ exec nice -n 0 rpmbuild -bp --short-circuit --nodeps --define '_topdir /tmp/B.8ccc11e2-e06d-4183-8de9-6a8489806e25' --define '_specdir %{_topdir}' --define '_sourcedir %{_specdir}' --define '_rpmdir %{_topdir}/RPMS' --define '_builddir %{_topdir}/BUILD' --target x86_64-pld-linux --define 'prep exit 0' /tmp/B.8ccc11e2-e06d-4183-8de9-6a8489806e25/3DLDF.spec
Building target platforms: x86_64-pld-linux
checking BuildConflict-ing packages
no BuildConflicts found
checking BR
rpm: error: Failed build dependencies:
rpm: 	texlive-fonts-type1-hoekwater is needed by 3DLDF-2.0.2-1.src
rpm: Building target platforms: x86_64-pld-linux
updating poldek cache...
Can't find java virtual machine, aborting.

ready is up to date

Retrieving th-i686::packages.ndir.md...
th-i686 is up to date

Retrieving th::packages.ndir.md...
th is up to date

Retrieving th::packages.ndir.md...
th is up to date

Retrieving th-ready-i686::packages.ndir.md...
th-ready-i686 is up to date

Retrieving th-ready::packages.ndir.md...
th-ready is up to date

Retrieving th-ready::packages.ndir.md...
th-ready is up to date

Retrieving th-test-i686::packages.ndir.md...
Retrieving th-test-i686::packages.ndir.diff.toc.gz...

Retrieving diff::packages.ndir.2013.11.23-01.33.01.gz...
..............................done
Retrieving diff::packages.ndir.dscr.2013.11.23-01.33.01.gz...
Loading [pndir]th-test-i686...
Applying packages.ndir.2013.11.23-01.33.01.gz...

Retrieving diff::packages.ndir.2013.11.23-01.35.01.gz...
Retrieving diff::packages.ndir.dscr.2013.11.23-01.35.01.gz...
Applying packages.ndir.2013.11.23-01.35.01.gz...

Retrieving diff::packages.ndir.2013.11.23-01.36.01.gz...
Retrieving diff::packages.ndir.dscr.2013.11.23-01.36.01.gz...
Applying packages.ndir.2013.11.23-01.36.01.gz...

Writing /root/.poldek-cache/[...]/packages.ndir.gz...

Retrieving th-test::packages.ndir.md...
Retrieving th-test::packages.ndir.diff.toc.gz...

Retrieving diff::packages.ndir.2013.11.22-09.52.02.gz...
Loading [pndir]th-test...
Applying packages.ndir.2013.11.22-09.52.02.gz...

Writing /root/.poldek-cache/[...]/packages.ndir.gz...

Retrieving th-test::packages.ndir.md...
Retrieving th-test::packages.ndir.diff.toc.gz...

Retrieving diff::packages.ndir.2013.11.23-00.58.01.gz...
..............................done
Retrieving diff::packages.ndir.dscr.2013.11.23-00.58.01.gz...
Loading [pndir]th-test...
Applying packages.ndir.2013.11.23-00.58.01.gz...

Retrieving diff::packages.ndir.2013.11.23-01.36.01.gz...
..............................done
Retrieving diff::packages.ndir.dscr.2013.11.23-01.36.01.gz...
..............................done
Applying packages.ndir.2013.11.23-01.36.01.gz...

Retrieving diff::packages.ndir.2013.11.23-01.49.01.gz...
..............................done
Retrieving diff::packages.ndir.dscr.2013.11.23-01.49.01.gz...
Applying packages.ndir.2013.11.23-01.49.01.gz...

Retrieving diff::packages.ndir.2013.11.23-02.03.01.gz...
..............................done
Retrieving diff::packages.ndir.dscr.2013.11.23-02.03.01.gz...
Applying packages.ndir.2013.11.23-02.03.01.gz...

Writing /root/.poldek-cache/[...]/packages.ndir.gz...
checking conflicting packages in BRed packages
poldek: Loading [pndir]ready...
poldek: Loading [pndir]th-test...
poldek: Loading [pndir]th-test...
poldek: Loading [pndir]th-ready...
poldek: Loading [pndir]th-ready...
poldek: Loading [pndir]th...
poldek: Loading [pndir]th...
poldek: 23157 packages read
poldek: Removed 1699 duplicate packages from available set
poldek: Processing dependencies...
poldek: There are 1 package to install:
poldek: I texlive-fonts-type1-hoekwater-20080816-22.x86_64
poldek: This operation will use 278.1KB of disk space.
poldek: Need to get 234.6KB of archives (234.6KB to download).
poldek: 
poldek: Retrieving th::texlive-fonts-type1-hoekwater-20080816-22.x86_64.rpm...
poldek: ..............................done
poldek: Executing rpm --upgrade -vh --test --root / --define _check_dirname_deps 1...
poldek: Preparing...                ##################################################
no conflicts found
checking BR
rpm: error: Failed build dependencies:
rpm: 	texlive-fonts-type1-hoekwater is needed by 3DLDF-2.0.2-1.src
rpm: Building target platforms: x86_64-pld-linux
installing BR: texlive\-fonts\-type1\-hoekwater
Can't find java virtual machine, aborting.
Loading [pndir]ready...
Loading [pndir]th-test...
Loading [pndir]th-test...
Loading [pndir]th-ready...
Loading [pndir]th-ready...
Loading [pndir]th...
Loading [pndir]th...
23157 packages read
Removed 1699 duplicate packages from available set
Processing dependencies...
There are 1 package to install:
I texlive-fonts-type1-hoekwater-20080816-22.x86_64
This operation will use 278.1KB of disk space.
Need to get 234.6KB of archives. 
Executing rpm --upgrade -vh --root / --define _check_dirname_deps 1...
Preparing...                ##################################################
texlive-fonts-type1-hoekwate##################################################
building RPM using: set -ex; : build-id: 1e799a7a-71da-4f7c-a755-908d15364525; TMPDIR=/tmp/B.8ccc11e2-e06d-4183-8de9-6a8489806e25/BUILD/tmp exec nice -n 0 rpmbuild -bb --define '_smp_mflags -j5' --define '_pld_builder 1' --define '_topdir /tmp/B.8ccc11e2-e06d-4183-8de9-6a8489806e25' --define '_specdir %{_topdir}' --define '_sourcedir %{_specdir}' --define '_rpmdir %{_topdir}/RPMS' --define '_builddir %{_topdir}/BUILD'  --target x86_64-pld-linux /tmp/B.8ccc11e2-e06d-4183-8de9-6a8489806e25/3DLDF.spec
Can't find java virtual machine, aborting.
mesg: ttyname failed: Inappropriate ioctl for device
+ : build-id: 1e799a7a-71da-4f7c-a755-908d15364525
+ TMPDIR=/tmp/B.8ccc11e2-e06d-4183-8de9-6a8489806e25/BUILD/tmp
+ exec nice -n 0 rpmbuild -bb --define '_smp_mflags -j5' --define '_pld_builder 1' --define '_topdir /tmp/B.8ccc11e2-e06d-4183-8de9-6a8489806e25' --define '_specdir %{_topdir}' --define '_sourcedir %{_specdir}' --define '_rpmdir %{_topdir}/RPMS' --define '_builddir %{_topdir}/BUILD' --target x86_64-pld-linux /tmp/B.8ccc11e2-e06d-4183-8de9-6a8489806e25/3DLDF.spec
Building target platforms: x86_64-pld-linux
Executing(%prep): /bin/sh -e /tmp/B.8ccc11e2-e06d-4183-8de9-6a8489806e25/BUILD/tmp/rpm-tmp.53009
+ umask 022
+ cd /tmp/B.8ccc11e2-e06d-4183-8de9-6a8489806e25/BUILD
+ cd /tmp/B.8ccc11e2-e06d-4183-8de9-6a8489806e25/BUILD
+ rm -rf 3DLDF-2.0.2
+ /usr/bin/gzip -dc /tmp/B.8ccc11e2-e06d-4183-8de9-6a8489806e25/3DLDF-2.0.2.tar.gz
+ /bin/tar -xf -
+ STATUS=0 
+ '[' 0 -ne 0 ']'
+ cd 3DLDF-2.0.2
+ /bin/id -u
+ '[' 1000 '=' 0 ']'
+ /bin/id -u
+ '[' 1000 '=' 0 ']'
+ /bin/chmod -Rf a+rX,u+w,g-w,o-w .
+ echo 'Patch #0 (3DLDF-info.patch):'
Patch #0 (3DLDF-info.patch):
+ '[' -f /tmp/B.8ccc11e2-e06d-4183-8de9-6a8489806e25/3DLDF-info.patch ']'
+ /bin/cat /tmp/B.8ccc11e2-e06d-4183-8de9-6a8489806e25/3DLDF-info.patch
+ /usr/bin/patch -s -p1
+ echo 'Patch #1 (3DLDF-bison.patch):'
Patch #1 (3DLDF-bison.patch):
+ '[' -f /tmp/B.8ccc11e2-e06d-4183-8de9-6a8489806e25/3DLDF-bison.patch ']'
+ /bin/cat /tmp/B.8ccc11e2-e06d-4183-8de9-6a8489806e25/3DLDF-bison.patch
+ /usr/bin/patch -s -p1
+ echo 'Patch #2 (3DLDF-texinfo.patch):'
Patch #2 (3DLDF-texinfo.patch):
+ '[' -f /tmp/B.8ccc11e2-e06d-4183-8de9-6a8489806e25/3DLDF-texinfo.patch ']'
+ /bin/cat /tmp/B.8ccc11e2-e06d-4183-8de9-6a8489806e25/3DLDF-texinfo.patch
+ /usr/bin/patch -s -p1
+ exit 0
Executing(%build): /bin/sh -e /tmp/B.8ccc11e2-e06d-4183-8de9-6a8489806e25/BUILD/tmp/rpm-tmp.77667
+ umask 022
+ cd /tmp/B.8ccc11e2-e06d-4183-8de9-6a8489806e25/BUILD
+ cd 3DLDF-2.0.2
+ ./configure 'LDFLAGS=-Wl,--as-needed -Wl,--no-copy-dt-needed-entries -Wl,-z,relro -Wl,-z,combreloc ' 'CFLAGS=-O2 -fwrapv -pipe -Wformat -Werror=format-security -gdwarf-4 -fno-debug-types-section -fvar-tracking-assignments -g2 -Wp,-D_FORTIFY_SOURCE=2 -fstack-protector --param=ssp-buffer-size=4 -fPIC -march=x86-64 -gdwarf-4 -fno-debug-types-section -fvar-tracking-assignments -g2 ' 'CXXFLAGS=-O2 -fwrapv -pipe -Wformat -Werror=format-security -gdwarf-4 -fno-debug-types-section -fvar-tracking-assignments -g2 -Wp,-D_FORTIFY_SOURCE=2 -fstack-protector --param=ssp-buffer-size=4 -fPIC -march=x86-64 -gdwarf-4 -fno-debug-types-section -fvar-tracking-assignments -g2 ' 'FFLAGS=-O2 -fwrapv -pipe -Wformat -Werror=format-security -gdwarf-4 -fno-debug-types-section -fvar-tracking-assignments -g2 -Wp,-D_FORTIFY_SOURCE=2 -fstack-protector --param=ssp-buffer-size=4 -fPIC -march=x86-64 -gdwarf-4 -fno-debug-types-section -fvar-tracking-assignments -g2 ' 'FCFLAGS=-O2 -fwrapv -pipe -Wformat -Werror=format-security -gdwarf-4 -fno-debug-types-section -fvar-tracking-assignments -g2 -Wp,-D_FORTIFY_SOURCE=2 -fstack-protector --param=ssp-buffer-size=4 -fPIC -march=x86-64 -gdwarf-4 -fno-debug-types-section -fvar-tracking-assignments -g2 ' 'CPPFLAGS=' 'CC=x86_64-pld-linux-gcc' 'CXX=x86_64-pld-linux-g++' '--host=x86_64-pld-linux' '--build=x86_64-pld-linux' '--prefix=/usr' '--exec-prefix=/usr' '--bindir=/usr/bin' '--sbindir=/usr/sbin' '--sysconfdir=/etc' '--datadir=/usr/share' '--includedir=/usr/include' '--libdir=/usr/lib64' '--libexecdir=/usr/lib64' '--localstatedir=/var' '--sharedstatedir=/var/lib' '--mandir=/usr/share/man' '--infodir=/usr/share/info' '--x-libraries=/usr/lib64' --disable-shared
checking for a BSD-compatible install... /usr/bin/install -c
checking whether build environment is sane... yes
/tmp/B.8ccc11e2-e06d-4183-8de9-6a8489806e25/BUILD/3DLDF-2.0.2/missing: Unknown `--is-lightweight' option
Try `/tmp/B.8ccc11e2-e06d-4183-8de9-6a8489806e25/BUILD/3DLDF-2.0.2/missing --help' for more information
configure: WARNING: 'missing' script is too old or missing
checking for a thread-safe mkdir -p... /bin/mkdir -p
checking for gawk... gawk
checking whether make sets $(MAKE)... yes
checking whether make supports nested variables... yes
checking build system type... x86_64-pld-linux-gnu
checking host system type... x86_64-pld-linux-gnu
checking how to print strings... print -r
checking for style of include used by make... GNU
checking for x86_64-pld-linux-gcc... x86_64-pld-linux-gcc
checking whether the C compiler works... yes
checking for C compiler default output file name... a.out
checking for suffix of executables... 
checking whether we are cross compiling... no
checking for suffix of object files... o
checking whether we are using the GNU C compiler... yes
checking whether x86_64-pld-linux-gcc accepts -g... yes
checking for x86_64-pld-linux-gcc option to accept ISO C89... none needed
checking whether x86_64-pld-linux-gcc understands -c and -o together... yes
checking dependency style of x86_64-pld-linux-gcc... gcc3
checking for a sed that does not truncate output... /bin/sed
checking for grep that handles long lines and -e... /bin/grep
checking for egrep... /bin/grep -E
checking for fgrep... /bin/grep -F
checking for ld used by x86_64-pld-linux-gcc... /usr/bin/ld
checking if the linker (/usr/bin/ld) is GNU ld... yes
checking for BSD- or MS-compatible name lister (nm)... /usr/bin/nm -B
checking the name lister (/usr/bin/nm -B) interface... BSD nm
checking whether ln -s works... yes
checking the maximum length of command line arguments... 1572864
checking whether the shell understands some XSI constructs... yes
checking whether the shell understands "+="... yes
checking how to convert x86_64-pld-linux-gnu file names to x86_64-pld-linux-gnu format... func_convert_file_noop
checking how to convert x86_64-pld-linux-gnu file names to toolchain format... func_convert_file_noop
checking for /usr/bin/ld option to reload object files... -r
checking for x86_64-pld-linux-objdump... no
checking for objdump... objdump
checking how to recognize dependent libraries... pass_all
checking for x86_64-pld-linux-dlltool... no
checking for dlltool... no
checking how to associate runtime and link libraries... print -r --
checking for x86_64-pld-linux-ar... no
checking for ar... ar
checking for archiver @FILE support... @
checking for x86_64-pld-linux-strip... no
checking for strip... strip
checking for x86_64-pld-linux-ranlib... no
checking for ranlib... ranlib
checking command to parse /usr/bin/nm -B output from x86_64-pld-linux-gcc object... ok
checking for sysroot... no
checking for x86_64-pld-linux-mt... no
checking for mt... no
checking if : is a manifest tool... no
checking how to run the C preprocessor... x86_64-pld-linux-gcc -E
checking for ANSI C header files... yes
checking for sys/types.h... yes
checking for sys/stat.h... yes
checking for stdlib.h... yes
checking for string.h... yes
checking for memory.h... yes
checking for strings.h... yes
checking for inttypes.h... yes
checking for stdint.h... yes
checking for unistd.h... yes
checking for dlfcn.h... yes
checking for objdir... .libs
checking if x86_64-pld-linux-gcc supports -fno-rtti -fno-exceptions... no
checking for x86_64-pld-linux-gcc option to produce PIC... -fPIC -DPIC
checking if x86_64-pld-linux-gcc PIC flag -fPIC -DPIC works... yes
checking if x86_64-pld-linux-gcc static flag -static works... yes
checking if x86_64-pld-linux-gcc supports -c -o file.o... yes
checking if x86_64-pld-linux-gcc supports -c -o file.o... (cached) yes
checking whether the x86_64-pld-linux-gcc linker (/usr/bin/ld -m elf_x86_64) supports shared libraries... yes
checking dynamic linker characteristics... GNU/Linux ld.so
checking how to hardcode library paths into programs... immediate
checking whether stripping libraries is possible... yes
checking if libtool supports shared libraries... yes
checking whether to build shared libraries... no
checking whether to build static libraries... yes
checking whether we are using the GNU C++ compiler... yes
checking whether x86_64-pld-linux-g++ accepts -g... yes
checking dependency style of x86_64-pld-linux-g++... gcc3
checking how to run the C++ preprocessor... x86_64-pld-linux-g++ -E
checking for ld used by x86_64-pld-linux-g++... /usr/bin/ld -m elf_x86_64
checking if the linker (/usr/bin/ld -m elf_x86_64) is GNU ld... yes
checking whether the x86_64-pld-linux-g++ linker (/usr/bin/ld -m elf_x86_64) supports shared libraries... yes
checking for x86_64-pld-linux-g++ option to produce PIC... -fPIC -DPIC
checking if x86_64-pld-linux-g++ PIC flag -fPIC -DPIC works... yes
checking if x86_64-pld-linux-g++ static flag -static works... yes
checking if x86_64-pld-linux-g++ supports -c -o file.o... yes
checking if x86_64-pld-linux-g++ supports -c -o file.o... (cached) yes
checking whether the x86_64-pld-linux-g++ linker (/usr/bin/ld -m elf_x86_64) supports shared libraries... yes
checking dynamic linker characteristics... (cached) GNU/Linux ld.so
checking how to hardcode library paths into programs... immediate
checking for x86_64-pld-linux-gcc... (cached) x86_64-pld-linux-gcc
checking whether we are using the GNU C compiler... (cached) yes
checking whether x86_64-pld-linux-gcc accepts -g... (cached) yes
checking for x86_64-pld-linux-gcc option to accept ISO C89... (cached) none needed
checking whether x86_64-pld-linux-gcc understands -c and -o together... (cached) yes
checking dependency style of x86_64-pld-linux-gcc... (cached) gcc3
checking whether make sets $(MAKE)... (cached) yes
checking for bison... bison -y
checking for flex... flex
checking lex output file root... lex.yy
checking lex library... -lfl
checking whether yytext is a pointer... yes
checking for sha224sum... 1
checking for sha1sum... 1
checking for md5sum... 1
checking for cksum... 1
checking for gzip... 1
checking for gsl_matrix_alloc in -lgsl... yes
checking for ANSI C header files... (cached) yes
checking errno.h usability... yes
checking errno.h presence... yes
checking for errno.h... yes
checking float.h usability... yes
checking float.h presence... yes
checking for float.h... yes
checking limits.h usability... yes
checking limits.h presence... yes
checking for limits.h... yes
checking for stdlib.h... (cached) yes
checking for unistd.h... (cached) yes
checking pthread.h usability... yes
checking pthread.h presence... yes
checking for pthread.h... yes
checking gsl/gsl_complex.h usability... yes
checking gsl/gsl_complex.h presence... yes
checking for gsl/gsl_complex.h... yes
checking gsl/gsl_complex_math.h usability... yes
checking gsl/gsl_complex_math.h presence... yes
checking for gsl/gsl_complex_math.h... yes
checking gsl/gsl_matrix.h usability... yes
checking gsl/gsl_matrix.h presence... yes
checking for gsl/gsl_matrix.h... yes
checking for unsigned long long... yes
checking for unsigned long... yes
checking for unsigned int... yes
checking for library containing trunc... -lm
checking for floor... yes
checking for sqrt... yes
checking for trunc... yes
checking whether byte ordering is bigendian... no
Enabling conditional compilation of debugging output
checking that generated files are newer than configure... done
configure: creating ./config.status
config.status: creating Makefile
config.status: creating src/Makefile
config.status: creating doc/Makefile
config.status: creating doc/old_doc/Makefile
config.status: creating examples/Makefile
config.status: creating config.h
config.status: executing depfiles commands
config.status: executing libtool commands
+ /usr/bin/make -j5
Makefile:881: warning: overriding recipe for target `info-recursive'
Makefile:451: warning: ignoring old recipe for target `info-recursive'
/usr/bin/make  all-recursive
make[1]: Entering directory `/tmp/B.8ccc11e2-e06d-4183-8de9-6a8489806e25/BUILD/3DLDF-2.0.2'
Makefile:881: warning: overriding recipe for target `info-recursive'
Makefile:451: warning: ignoring old recipe for target `info-recursive'
Making all in src
make[2]: Entering directory `/tmp/B.8ccc11e2-e06d-4183-8de9-6a8489806e25/BUILD/3DLDF-2.0.2/src'
ctangle arc.web
ctangle circles.web
ctangle cncsctlt.web
ctangle colors.web
ctangle complex.web
This is CTANGLE, Version 3.64 (Web2C 7.5.7)
*1*3*4*6*8*9*10*12*14*16*18*19*20*21*22*24*25*26*28*29*31*32*34*35*37*38*40*42*44*45*47*48*49*50*52*54*56*58
Writing the output files: (complex.c).....500....
(complex.h).
Done.
(No errors were found.)
complex.c++ does not exist
complex.h++ does not exist
ctangle cones.web
This is CTANGLE, Version 3.64 (Web2C 7.5.7)
*1*3*4*5*6*8*18*20*21*22*23*24*26*27*28*30*32*33*34*36*37*39*41*43*45*46*48*50*51*53*55*56*58*60*62*63*64*65*66*68*70*72
Writing the output files: (cones.c).....500.This is CTANGLE, Version 3.64 (Web2C 7.5.7)
*1..*3*4.*5.1000*7*8..*10*12*13*14*15*16*17*19
(cones.h)*21*23.*24*25.*27
Done.
(No errors were found.)
*29*31*41*42*43*44*45*51*53*58*59*61*62*64*66cones.c++ does not exist
This is CTANGLE, Version 3.64 (Web2C 7.5.7)
*1*3*4*6*7*9*11*12*13*14*15*17*20*21*22*23*24*25*26*27*28*38*39*41*43*44*45*48*50*54*55*57*60This is CTANGLE, Version 3.64 (Web2C 7.5.7)
*1*3*4*5*6*8*10*11*13*15*16*17*18*19*21*23*25*28*30*32*34*35*37*39*41*43*45*46*47*48*49*50*52*54*55cones.h++ does not exist
ctangle conicsct.web
This is CTANGLE, Version 3.64 (Web2C 7.5.7)
*1*3*4*5*6*8*10*12*13*14*15*16*18*19*20*21*22*24*25*27*29*31*33*34*36*38*39*41*43*44*46*48*50*52*53*54*55*56*58*60*62
Writing the output files: (arc.c).....500.
(arc.h)..
Done.
(No errors were found.)
*64*66*67*73*78*79*81*83*85*87*88arc.c++ does not exist
*104*106*110*111*112*113*114*116*117*118*119*121*123*125
Writing the output files: (cncsctlt.c).....500.....1000.....1500.....2000.....2500.....3000...arc.h++ does not exist

(cncsctlt.h)...
Done.
(No errors were found.)
*83*85*86*87*88*89*90
Writing the output files: (circles.c).....500.....1000.....1500.
(circles.h)..
Done.
(No errors were found.)
*56*57*58
Writing the output files: (colors.c).....500...
(colors.h)..
Done.
(No errors were found.)
cncsctlt.c++ does not exist
colors.c++ does not exist
circles.c++ does not exist
ctangle crclslc.web
This is CTANGLE, Version 3.64 (Web2C 7.5.7)
*1*3*4*5*7*8*10*11*12*21*26*27*41*43*44*46*47*48*49*51*53*54*55*56*58*62*64*65*67*69
Writing the output files: (conicsct.c).....500.....1000....
(conicsct.h)..
Done.
(No errors were found.)
circles.h++ does not exist
conicsct.c++ does not exist
colors.h++ does not exist
ctangle creatnew.web
cncsctlt.h++ does not exist
ctangle cuboid.web
conicsct.h++ does not exist
This is CTANGLE, Version 3.64 (Web2C 7.5.7)
*1*3*4*5*6*8*9*10*11*13*15*17
Writing the output files: (crclslc.c).
(crclslc.h)
Done.
(No errors were found.)
This is CTANGLE, Version 3.64 (Web2C 7.5.7)
*1*3*4*8*12
Writing the output files: (creatnew.c).
(creatnew.h).
Done.
(No errors were found.)
This is CTANGLE, Version 3.64 (Web2C 7.5.7)
*1*3*4*5*7*9*11*12*13*14*16*18*20*21*22*23*25*26*28*31
Writing the output files: (cuboid.c).....500..
(cuboid.h).
Done.
(No errors were found.)
crclslc.c++ does not exist
creatnew.c++ does not exist
ctangle curves.web
cuboid.c++ does not exist
crclslc.h++ does not exist
creatnew.h++ does not exist
cuboid.h++ does not exist
ctangle cylinder.web
ctangle dashptrn.web
ctangle ddchdrn.web
ctangle deftfncs.web
This is CTANGLE, Version 3.64 (Web2C 7.5.7)
*1*3*4*15*20*21*23*25*26This is CTANGLE, Version 3.64 (Web2C 7.5.7)
*1*3*4*5*6*7*37*39*40*50*54
Writing the output files: (curves.c).....500.....1000....
(curves.h).
Done.
(No errors were found.)
This is CTANGLE, Version 3.64 (Web2C 7.5.7)
*1*2*9*10*13*15*16*17*18*19*21*23*24*3*5*6*8*10*11*12*13*15*17*19*20*21*22*23*26*27
Writing the output files: (dashptrn.c)..*39*41
(dashptrn.h)
Done.
(No errors were found.)

Writing the output files: (ddchdrn.c).....500...This is CTANGLE, Version 3.64 (Web2C 7.5.7)
*1..1000*3.*4*5.*7..
(ddchdrn.h).
Done.
(No errors were found.)
*16*18*19*20*21*22*24*25*26*28*30*32*33*34*36*37*39*41*43*45*46*48*50*51*53*55*56*58*60*62*64*65*66*67*68*70*72*74
Writing the output files: (cylinder.c).....500.....1000.
(cylinder.h)..
Done.
(No errors were found.)
curves.c++ does not exist
cylinder.c++ does not exist
ddchdrn.c++ does not exist
dashptrn.c++ does not exist
dashptrn.h++ does not exist
cylinder.h++ does not exist
ddchdrn.h++ does not exist
curves.h++ does not exist
This is CTANGLE, Version 3.64 (Web2C 7.5.7)
*1*2*3*6
Writing the output files: (deftfncs.c).
(deftfncs.h)
Done.
(No errors were found.)
ctangle ellipses.web
ctangle ellpsoid.web
ctangle ellpsslc.web
This is CTANGLE, Version 3.64 (Web2C 7.5.7)
*1*3*4*5*6*8*17*19*20*21*22*23*25*26*27*29*31*32*33*35*36*38*40*42*44*45*47*49*50*52*54*55*57*59*61*62*64*69*71*72*74*76*77*78*79*80*82*84*86
Writing the output files: (ellpsoid.c).....500.....1000.....1500.....2000.....2500.
(ellpsoid.h)..
Done.
(No errors were found.)
This is CTANGLE, Version 3.64 (Web2C 7.5.7)
*1*3*5*6*8*9*11*13*15*16*17*18*19*21*23*33*42*43*45*46*47*48*49*50*55*57*58*63*68*73*75*77*79*81*83*84*89*94*96*98*100*101*103*105*108*124*125*126*129*131*135*152*154*156*161*163*165*166*167*168*169*170*171
Writing the output files: (ellipses.c).....500.....1000.....1500.....2000.....2500.....3000.....3500
(ellipses.h)....
Done.
(No errors were found.)
This is CTANGLE, Version 3.64 (Web2C 7.5.7)
*1*3*4*5*6*8*9*10*11*13*15*17
Writing the output files: (ellpsslc.c).
(ellpsslc.h)
Done.
(No errors were found.)
ctangle figures.web
deftfncs.c++ does not exist
ellipses.c++ does not exist
ellpsoid.c++ does not exist
ellpsoid.h++ does not exist
ellipses.h++ does not exist
ellpsslc.c++ does not exist
deftfncs.h++ does not exist
ctangle glyphs.web
This is CTANGLE, Version 3.64 (Web2C 7.5.7)
*1*3*6
Writing the output files: (figures.c).
(figures.h)
Done.
(No errors were found.)
ctangle gsltmplt.web
figures.c++ does not exist
ellpsslc.h++ does not exist
ctangle helices.web
figures.h++ does not exist
This is CTANGLE, Version 3.64 (Web2C 7.5.7)
*1*3*4*5*7*9*10*11*12*13*15*16*17*19*21*23*25*26*28*30*31*33*35*36*38*40*42*43*44*45*46*48*50*52
Writing the output files: (glyphs.c)....
(glyphs.h).
Done.
(No errors were found.)
This is CTANGLE, Version 3.64 (Web2C 7.5.7)
*1
Writing the output files: (gsltmplt.c)...
(gsltmplt.h)...
Done.
(No errors were found.)
glyphs.c++ does not exist
ctangle hyprbola.web
gsltmplt.c++ does not exist
This is CTANGLE, Version 3.64 (Web2C 7.5.7)
*1*3*5*6*8*10*12*13*14*15*16*18*19*20*21*22*24*25*27*29*31*33*34*36*38*39*41*43*44*46*48*50*51*52*53*54*56*58*60
Writing the output files: (helices.c).....500..
(helices.h)..
Done.
(No errors were found.)
ctangle imetfncs.web
helices.c++ does not exist
gsltmplt.h++ does not exist
glyphs.h++ does not exist
ctangle io.web
This is CTANGLE, Version 3.64 (Web2C 7.5.7)
*1*3*4*5*6*8*13*15*16*17*18*19*21*22*23*27*28*30*40*41*43*45*49*50*51*53*55*56*58*60*62*64*65*67*69*70*72*74*75*77*79*85*87*88*96*98*100*101*102*103*104*106*108*110
Writing the output files: (hyprbola.c).....500.....1000This is CTANGLE, Version 3.64 (Web2C 7.5.7)
*1.*2..*3*4..1500.
(hyprbola.h)..
Done.
(No errors were found.)
*12*13*14*54helices.h++ does not exist
*61*62*76*92*103*109*110*116*117*118*119*120*121*122This is CTANGLE, Version 3.64 (Web2C 7.5.7)
*1*3*4*5*6*7*9*11*12*13*16
Writing the output files: (imetfncs.c)..*23*24*25*27..*29.500.*31*32..*35..1000*37*38*39...*45.*46*47.1500*48.*49*50*51*52*53.*54*55*56.*57*58*60*61*62*63.*64*65*66.2000*67*68*69*70.*71*72*73.*74*75..*76.2500*77*78.*79*80...*82.3000*83.*85*86.*87.*88*89.*90*92.3500*94*95.*96.*97*98*99..*101*103.4000*105.*106*107*108*109..*110.*111.4500*112*113*114*115*116*117
(imetfncs.h)*118*119*120*121
Done.
(No errors were found.)
*122*123*125*126*128*130*131*133*135*137*138*139*141*143*144*146*147*148*149*150*151*152*153*154*155*157*169*170*171*172*173*175*176*177*178*179*180*181*182*183*184*189*190*191*192*193*194*195*196*197*198*200*201*202*203*204*205
Writing the output files: (io.c).....500.....1000.....1500.....2000.....2500.....3000.....3500.....4000.....4500...
(io.h).....500.....1000.....1500.....2000.....2500.....3000.....3500
Done.
(No errors were found.)
hyprbola.c++ does not exist
ctangle lines.web
io.c++ does not exist
imetfncs.c++ does not exist
ctangle loader.web
hyprbola.h++ does not exist
imetfncs.h++ does not exist
ctangle matrices.web
This is CTANGLE, Version 3.64 (Web2C 7.5.7)
*1*3
Writing the output files: (loader.c)
(loader.h).
Done.
(No errors were found.)
loader.c++ does not exist
io.h++ does not exist
This is CTANGLE, Version 3.64 (Web2C 7.5.7)
*1*3*4*5*6*8*10*12*13*15*16*18*20*21*23*25*26*27*34*35*36
Writing the output files: (lines.c).....500.
(lines.h)
Done.
(No errors were found.)
This is CTANGLE, Version 3.64 (Web2C 7.5.7)
*1*3*4*6*8*9*10*12*16*23*25*26*28*29*36*39*42*45*48*49*55*56*58*60*62*64*66*67*68*72*74*80*81*82*83*85*87*89*93
Writing the output files: (matrices.c).....500.....1000.....1500.....2000.....2500.....3000.....3500...
(matrices.h)..
Done.
(No errors were found.)
lines.c++ does not exist
matrices.c++ does not exist
ctangle nurbs.web
loader.h++ does not exist
lines.h++ does not exist
matrices.h++ does not exist
ctangle origami.web
ctangle parabola.web
ctangle parabold.web
ctangle paraellp.web
This is CTANGLE, Version 3.64 (Web2C 7.5.7)
*1*3*5*6*7*9*11*12*14*15*16*17*18*19*20*21*22*23*24*25*26*27*28*29*30*31*32*33*34*35*36*37*38*39*40*41*42*43*44*45*46*47*48*49*50*51*52*53*54*56*57*58*59*60*61*62*63*65*67*69*70*72*74*75*76*78*80*82*84This is CTANGLE, Version 3.64 (Web2C 7.5.7)
*1*3*4*5*6*8
Writing the output files: (origami.c)
(origami.h)
Done.
(No errors were found.)
*86*88*90*92*94*96
Writing the output files: (nurbs.c).....500.....1000....
(nurbs.h).....500..
Done.
(No errors were found.)
This is CTANGLE, Version 3.64 (Web2C 7.5.7)
*1*3*4*5*6*8*10*12*13*14*15*16*18*19*20*21*23*25*26*27*29*30*32*34*36*38*39*41*43*44*46*48*49*51*53*55*56*58*59*60*61*62*64*66*68
Writing the output files: (parabold.c).....500..
(parabold.h)..
Done.
(No errors were found.)
origami.c++ does not exist
nurbs.c++ does not exist
parabold.c++ does not exist
origami.h++ does not exist
nurbs.h++ does not exist
parabold.h++ does not exist
ctangle parahypr.web
ctangle paths.web
This is CTANGLE, Version 3.64 (Web2C 7.5.7)
*1*3*4*5*6*8This is CTANGLE, Version 3.64 (Web2C 7.5.7)
*1*3*4*5*6*8*10*12*13*14*15*16*17*19*21*22*23*25*27*28
Writing the output files: (paraellp.c)...
(paraellp.h).
Done.
(No errors were found.)
*17*19*20*21*22*23*25*26*27*30*33*34*36*37*39*41*42*44*46*48*50*51*53*55*56*58*60*61*63*65*67*68*70*78*79*80*82*84*85*86*87*88*90*92*94
Writing the output files: (parabola.c).....500.....1000....
(parabola.h)..
Done.
(No errors were found.)
paraellp.c++ does not exist
parabola.c++ does not exist
ctangle pctfncs0.web
paraellp.h++ does not exist
This is CTANGLE, Version 3.64 (Web2C 7.5.7)
*1*3*6*7*14*15*16*18*19*21*23*24*26*28*29*31*35*37*38*41*43*44*46*48*49*51*53*55*57*59*61*63*65*66*68*69*70*71*72*73*74*75*76*77*78*79*80*81*82*83*84*85*86*87*88*89*90*91*92*93*94*95*96*97*98*99*100*101*102*103*104*105*106*107*108*109*110*137*139*141*152*163*164*165*166*168*170*172*173*174*176*178*180*182*186*187*188*193*195*200*201*204*205*206*215*216parabola.h++ does not exist
This is CTANGLE, Version 3.64 (Web2C 7.5.7)
*1*3*4*5*6*8*10*12*13*14*15*16*17*19*21*22*23*25*27*28
Writing the output files: (parahypr.c)...
(parahypr.h).
Done.
(No errors were found.)
*217*219*220*221*223*224*230*236*237*243*244*250*256*257*262*263*264*266*271*276*281*283*285*287*288*290*292*294*296*298*300*302*304*306*308*310*312*314*319*322*328*336*339*342*344*345*346*349*351*352*353*355*357*361*368*370*372*374*375*376*377*378*379*386*387*389*395*396*398*400*402*404*405*410*411*416*417*419*423*425*427*429*430*435*437*439*440*442*444*445*457*458*459*460*461*462*463*464*465*473*475*477*478*480*481*484*485*486
Writing the output files: (paths.c).....500.....1000.....1500.....2000.....2500.....3000...ctangle pens.web
parahypr.c++ does not exist
This is CTANGLE, Version 3.64 (Web2C 7.5.7)
*1..3500*3*4.....4000.....4500.....5000.....5500....*28
Writing the output files: (pctfncs0.c).6000........6500...500........7000...
(pctfncs0.h).
Done.
(No errors were found.)
.7500.....8000.....8500.....9000.....9500...
(paths.h).....500.....1000...
Done.
(No errors were found.)
paths.c++ does not exist
pctfncs0.c++ does not exist
ctangle pictures.web
parahypr.h++ does not exist
This is CTANGLE, Version 3.64 (Web2C 7.5.7)
*1*2*3*4*5*6*7*9*11*12*13*14*16*18*20*22*23*24*25*26*29*30*32*34
Writing the output files: (pens.c)paths.h++ does not exist
...
(pens.h).
Done.
(No errors were found.)
pctfncs0.h++ does not exist
ctangle planes.web
pens.c++ does not exist
This is CTANGLE, Version 3.64 (Web2C 7.5.7)
*1*3*4*5*6*7*9*10*11*12*16*17*20*22*23*24*25*27*29*33*41*43*44*48*53*58
Writing the output files: (pictures.c)....
(pictures.h)..
Done.
(No errors were found.)
ctangle plyhdslc.web
pictures.c++ does not exist
pens.h++ does not exist
ctangle pntrvcf0.web
This is CTANGLE, Version 3.64 (Web2C 7.5.7)
*1*3*4*5*7*9*11*13*14*16*18*19*21*23*24*25*28*29*30*31*39*40*54*55*56*59*60*65*67*69
Writing the output files: (planes.c).....500....
(planes.h).
Done.
(No errors were found.)
planes.c++ does not exist
pictures.h++ does not exist
ctangle pntrvctr.web
This is CTANGLE, Version 3.64 (Web2C 7.5.7)
*1*3*4*5*6*8*9*10*11*13*15*17
Writing the output files: (plyhdslc.c).
(plyhdslc.h)
Done.
(No errors were found.)
plyhdslc.c++ does not exist
planes.h++ does not exist
ctangle points.web
plyhdslc.h++ does not exist
This is CTANGLE, Version 3.64 (Web2C 7.5.7)
*1*2*3*11*18
Writing the output files: (pntrvcf0.c).....500...
(pntrvcf0.h)
Done.
(No errors were found.)
This is CTANGLE, Version 3.64 (Web2C 7.5.7)
*1*2*3*4*5*6*8*10*11*12*18*20*22*23*25*27*29*30*32*34*36*38*39*41*43*45*46*48*50*52*54*55*56*58
Writing the output files: (pntrvctr.c).....500....
(pntrvctr.h).....500....
Done.
(No errors were found.)
pntrvcf0.c++ does not exist
pntrvcf0.h++ does not exist
ctangle polygons.web
pntrvctr.c++ does not exist
ctangle polyhed.web
pntrvctr.h++ does not exist
ctangle predctes.web
This is CTANGLE, Version 3.64 (Web2C 7.5.7)
*1*3*5*6*7*8*9*12*14*16*17*19*21*23*25*27*29*31*33*36*38*39*41*43*45*47*48*49*50*52*53*55*57*59*61*63*64*65*66*68*79*113*114*117*119*120*122*123*124*125*126*127*128*129*130*131*133*135*137*139*141*142*143*144*145*146*147*148*149*150*151*152*153*154*155*156*157*158*159*160*161*162*163*164*165*166*167*168*169*170*171*172*173*174*175*176*177*178*179*180*181*182*201*212*213*220*229*233*234*240*242*243*244*245*246*247*251*252*254*258*260*261*262*263*265*267*269*271*273*275*277*279*281*283*285*287*289*291*293*294*295*296*297*298*299*301*302*304*305*307*309*310*314*321*322*323*326*328*329*331*333*334*335*336*337*338*340*341*343*345*347*349*351*352*354*356*358*360*362*364*366*370*371*377*378*379*380*381*382*383*384*392*394*395*397*399*401*402*403*416*417*418*420*422*424*426*427*428*431*432*433*434*435*436*437*438*439*441*443*444*445*447*449*450*452*453*454*455*457*459*460*461*467*469*471*472*473*474*475*476This is CTANGLE, Version 3.64 (Web2C 7.5.7)
*1*477*479*480*482*3*484*485*4*486*5*487*489*7
Writing the output files: (points.c).*17*18..*22..500.*26..*28*29*30.*35*36.1000..*42.*44*45*46*47.*49.1500..*51...2000*61*62.*63*64*65*67.*68...2500.*79.*81*82*83*84.*86..3000.*96*97*98*99*100.*102*103...3500*105*107*108.*109*110..*112..4000.*114...*124*125*126*127*128*129*130.4500*132*133.....5000.....5500.....6000.....6500.....7000This is CTANGLE, Version 3.64 (Web2C 7.5.7)
*1.*3*4*6*8*10*11*12*13*14
(points.h)*18..*20*21...500*24*25.....1000.....1500...
Done.
(No errors were found.)
*37*39*44*78*87*88*93*94*118*119*122*123*124*125*127*128*130*131*134*138*139*140*141*142*144*145*146*147*149*160*161*162*163*164*165
Writing the output files: (polygons.c).....500.....1000.....1500.....2000.....2500.....3000.....3500
(polygons.h)...
Done.
(No errors were found.)
*137*139*140*141*142*144*145*146*147*148*149*151*152*173*175*176*177*178*180*181*182*184*186
Writing the output files: (polyhed.c).....500.....1000.....1500.....2000.....2500.....3000.....3500.....4000.
(polyhed.h)....
Done.
(No errors were found.)
points.c++ does not exist
ctangle primes.web
polyhed.c++ does not exist
polygons.c++ does not exist
polygons.h++ does not exist
This is CTANGLE, Version 3.64 (Web2C 7.5.7)
*1ctangle prrfnc0.web
*3*4*6*7*8*10*11*13*14*16*17*18*20*21*23
Writing the output files: (predctes.c)..
(predctes.h)
Done.
(No errors were found.)
points.h++ does not exist
This is CTANGLE, Version 3.64 (Web2C 7.5.7)
*1*3*5*6*8*10*12*14
Writing the output files: (primes.c).....500.
(primes.h)
Done.
(No errors were found.)
predctes.c++ does not exist
polyhed.h++ does not exist
ctangle rectangs.web
predctes.h++ does not exist
ctangle rhtchdrn.web
ctangle scan.web
primes.c++ does not exist
This is CTANGLE, Version 3.64 (Web2C 7.5.7)
*1*3*4*5*6*7*8*9*10*11*12*13*14*15*16*17*18*19*20*21*22*23*24*25*27*28*29*30*31*32*33*34*35*36*37*38*39*40*41*42*43*44*45*46*48*49*50*51*52*53*54*55*56*74*75*76*77*78*80*81*82*83*84*85*86*87*88*89*90*91*92*93*94*95*96*97*98*99*100*101*102*103*104*105*107*109*110*111*112*113*114*115*119
Writing the output files: (prrfnc0.c).....500.....1000.....1500.....2000.....2500.....3000.....3500.....4000....
(prrfnc0.h)
Done.
(No errors were found.)
This is CTANGLE, Version 3.64 (Web2C 7.5.7)
*1*3*4*5*7*8*12*13*15*17*18*19*20*21*23*25*26*36*37*38*39*41*43*44*46*48*49*50*51*52*53*54*55*59*60
Writing the output files: (rectangs.c).....500....
(rectangs.h).
Done.
(No errors were found.)
prrfnc0.c++ does not exist
rectangs.c++ does not exist
primes.h++ does not exist
prrfnc0.h++ does not exist
rectangs.h++ does not exist
ctangle scanprse.web
ctangle scanprsf.web
This is CTANGLE, Version 3.64 (Web2C 7.5.7)
*1*3*4*5*6*7*9*11*13*14*15*16*20*21*29*30*33
Writing the output files: (rhtchdrn.c).....500.....1000.....1500.
(rhtchdrn.h).
Done.
(No errors were found.)
rhtchdrn.c++ does not exist
This is CTANGLE, Version 3.64 (Web2C 7.5.7)
*1*3*14*20*27*78*80
Writing the output files: (scan.c).....500.....1000.....1500.....2000....
(scan.h)
Done.
(No errors were found.)
ctangle sctpcrt.web
This is CTANGLE, Version 3.64 (Web2C 7.5.7)
*1*3*4*5*7*8*9*11*12*22*36This is CTANGLE, Version 3.64 (Web2C 7.5.7)
*1*3*4*5*9*59*22*85*35*87*89*90*98*99*57*106*107*122*138*107*145*147*154*166*129*170*206*207*221*222*238*240*241*251*252*253*254*267*268*282*283*287*288*291*292*293*294*304*305*306*307*311*312*313*314*315*316*317*318*319*320*321*322*323*324*325*326*327*328*330*331*332*333*334*335*336*337*339*340*341*342*343*344*345*346*347*348*349*350
Writing the output files: (scanprse.c).....500.....1000.....1500.....2000.....2500.....3000.....3500.....4000..*160*178*194*211*215*220*232*237*250*251*269*274*275*290*292*307*309*321*322rhtchdrn.h++ does not exist
This is CTANGLE, Version 3.64 (Web2C 7.5.7)
*1*3*4*5*11*14*15*16*17*18*19*20*22*23*24*25*26*27...4500.....5000.....5500*358.....6000.....6500...*389..7000*390.....7500*396.....8000.....8500.*406....9000..*410...9500...*414
(scanprse.h).*419....500..*422..*425*426.1000.*427.*428..*432.1500...*438..2000.*443..*444..2500..*449...3000.*454..*455..3500..*459*460*461...4000.....4500*480....*481*482.5000.....5500
Done.
(No errors were found.)
*494
Writing the output files: (scanprsf.c).....500.....1000.....1500.....2000.scan.c++ does not exist
....2500.....3000.....3500.....4000.....4500.....5000.....5500.....6000.....6500.....7000.....7500.....8000.....8500.....9000.....9500.....10000.....10500.....11000.....11500.....12000.....12500.....13000.....13500.....14000.....14500.....15000.....15500.....16000.....16500.....17000.....17500....*29*30*31*32*33scanprse.c++ does not exist
*34.18000..*35*36.*37.*38.18500*39....*40*41
(scanprsf.h)*42
Done.
(No errors were found.)
*43*44ctangle sctpfncs.web
*45*46*47*48*49*50*51*52*53*54*55*56*57scan.h++ does not exist
*58*59*60*61*62*63*64*65*66*67*68*69*73*74*76*88*89*93*95*97*99*100*103*104*105*106*107*108*109*119*129*134
Writing the output files: (sctpcrt.c).....500.....1000.....1500.....2000.....2500..scanprsf.c++ does not exist
...3000.....3500.....4000..
(sctpcrt.h)
Done.
(No errors were found.)
scanprse.h++ does not exist
sctpcrt.c++ does not exist
scanprsf.h++ does not exist
sctpcrt.h++ does not exist
ctangle shapes.web
ctangle solfaced.web
This is CTANGLE, Version 3.64 (Web2C 7.5.7)
*1*3*8*16*20*29*31*37*43*53*98
Writing the output files: (sctpfncs.c).....500.....1000.....1500.....2000.....2500.....3000.
(sctpfncs.h)
Done.
(No errors were found.)
ctangle solids.web
sctpfncs.c++ does not exist
ctangle spheres.web
This is CTANGLE, Version 3.64 (Web2C 7.5.7)
*1*2*3*5*7*11*15*21*22*24
Writing the output files: (shapes.c).....500
(shapes.h)...
Done.
(No errors were found.)
shapes.c++ does not exist
shapes.h++ does not exist
ctangle sphrdevl.web
This is CTANGLE, Version 3.64 (Web2C 7.5.7)
*1*3*4*5This is CTANGLE, Version 3.64 (Web2C 7.5.7)
*1*6*8*3*5*6*8*10*11*12*13*15*19*21*21*22*22*23*23*24*25*25*27*28*27*28*29*31*32*34*35*37*38*40*42*43*45*30*47*49*32*51*34*52*54*36*56*57*38*59*40*61*62*42*64*44*45*66*68*69*47*71*55*56*57*58*59*60*61*73*62*63*64*65*66*75*67*68*77*69*78*70*71*72*73*74*75*76*77*78*79*80*81*81*82*82*83*84*85*83*84*86*85*87*88*89*87*90*91*89*92*93*91*94*95*96*97*98*93*99*100*101*102*103
Writing the output files: (spheres.c)*104*105*106*107*108*110.*111*112*114.*116*118.*120.*122.500...*124..1000.*126*127.*129..*131*133.1500*135*136*138*140*142*144*145
(spheres.h)..
Done.
(No errors were found.)
*196*208*209*211*213*215*217*219*221*223*224*225*226*228*230*232*234*236*238*240*248*250*251*252*258*265This is CTANGLE, Version 3.64 (Web2C 7.5.7)
*1*3*4*5
Writing the output files: (solfaced.c)..
(solfaced.h)
Done.
(No errors were found.)
*272*273*279*280*286*287*293*294*295*296*297*298*299*300*301*303*305
Writing the output files: (solids.c)sctpfncs.h++ does not exist
.....500.....1000.....1500.....2000.....2500.....3000.....3500.....4000.....4500.....5000.....5500.....6000.....6500...
(solids.h).....500.....1000spheres.c++ does not exist
.
Done.
(No errors were found.)
solfaced.c++ does not exist
This is CTANGLE, Version 3.64 (Web2C 7.5.7)
*1*3*4*5*6*7*9*11*13*14*16*19*20*26*27*29*31*33*35*36*38*40*41*43*45*47*48*49*50*51*53*55*57*59
Writing the output files: (sphrdevl.c).....500....
(sphrdevl.h).
Done.
(No errors were found.)
solfaced.h++ does not exist
solids.c++ does not exist
ctangle transfor.web
spheres.h++ does not exist
solids.h++ does not exist
ctangle triangle.web
ctangle utility.web
sphrdevl.c++ does not exist
This is CTANGLE, Version 3.64 (Web2C 7.5.7)
*1*3*4*5*6*8*10*12*13*14*16*17*19*21*22*24*26*28*30*32*34*37*39*40*42*44*45*47*49*50*52*53*55*60*61*62*63*64*65*66*68ctangle main.web
sphrdevl.h++ does not exist
*75*76*82*84*85*87*89
Writing the output files: (transfor.c).....500....
(transfor.h)..
Done.
(No errors were found.)
This is CTANGLE, Version 3.64 (Web2C 7.5.7)
*1*3*4*5*6*7*9*10*12*17*19*21*22*23*25*27
Writing the output files: (triangle.c)....
(triangle.h).
Done.
(No errors were found.)
This is CTANGLE, Version 3.64 (Web2C 7.5.7)
*1*3*4*14
Writing the output files: (utility.c)
(utility.h)
Done.
(No errors were found.)
This is CTANGLE, Version 3.64 (Web2C 7.5.7)
*1*3*4*7*8*9*10*12*26
Writing the output files: (main.c).....500.....1000.
(main.h)
Done.
(No errors were found.)
transfor.c++ does not exist
utility.c++ does not exist
triangle.c++ does not exist
main.c++ does not exist
ctangle pspglb.web
transfor.h++ does not exist
This is CTANGLE, Version 3.64 (Web2C 7.5.7)
*1*3*4*5utility.h++ does not exist
*11triangle.h++ does not exist
*16*20*36*60*81*82*83*93*96*101*102*103*115*117*119*133*134*135*136*137*138*141*143*174*179
Writing the output files: (pspglb.c).....500.....1000.....1500.....2000.....2500...
(pspglb.h).....500.....1000.....1500....
Done.
(No errors were found.)
main.h++ does not exist
x86_64-pld-linux-g++ -DHAVE_CONFIG_H -I. -I..     -O2 -fwrapv -pipe -Wformat -Werror=format-security -gdwarf-4 -fno-debug-types-section -fvar-tracking-assignments -g2 -Wp,-D_FORTIFY_SOURCE=2 -fstack-protector --param=ssp-buffer-size=4 -fPIC -march=x86-64 -gdwarf-4 -fno-debug-types-section -fvar-tracking-assignments -g2  -o prbsnflx prbsnflx.c++
pspglb.c++ does not exist
/bin/sh ../libtool  --tag=CXX   --mode=compile x86_64-pld-linux-g++ -DHAVE_CONFIG_H -I. -I..     -O2 -fwrapv -pipe -Wformat -Werror=format-security -gdwarf-4 -fno-debug-types-section -fvar-tracking-assignments -g2 -Wp,-D_FORTIFY_SOURCE=2 -fstack-protector --param=ssp-buffer-size=4 -fPIC -march=x86-64 -gdwarf-4 -fno-debug-types-section -fvar-tracking-assignments -g2  -MT arc.lo -MD -MP -MF .deps/arc.Tpo -c -o arc.lo arc.c++
/bin/sh ../libtool  --tag=CXX   --mode=compile x86_64-pld-linux-g++ -DHAVE_CONFIG_H -I. -I..     -O2 -fwrapv -pipe -Wformat -Werror=format-security -gdwarf-4 -fno-debug-types-section -fvar-tracking-assignments -g2 -Wp,-D_FORTIFY_SOURCE=2 -fstack-protector --param=ssp-buffer-size=4 -fPIC -march=x86-64 -gdwarf-4 -fno-debug-types-section -fvar-tracking-assignments -g2  -MT circles.lo -MD -MP -MF .deps/circles.Tpo -c -o circles.lo circles.c++
pspglb.h++ does not exist
/bin/sh ../libtool  --tag=CXX   --mode=compile x86_64-pld-linux-g++ -DHAVE_CONFIG_H -I. -I..     -O2 -fwrapv -pipe -Wformat -Werror=format-security -gdwarf-4 -fno-debug-types-section -fvar-tracking-assignments -g2 -Wp,-D_FORTIFY_SOURCE=2 -fstack-protector --param=ssp-buffer-size=4 -fPIC -march=x86-64 -gdwarf-4 -fno-debug-types-section -fvar-tracking-assignments -g2  -MT cncsctlt.lo -MD -MP -MF .deps/cncsctlt.Tpo -c -o cncsctlt.lo cncsctlt.c++
/bin/sh ../libtool  --tag=CXX   --mode=compile x86_64-pld-linux-g++ -DHAVE_CONFIG_H -I. -I..     -O2 -fwrapv -pipe -Wformat -Werror=format-security -gdwarf-4 -fno-debug-types-section -fvar-tracking-assignments -g2 -Wp,-D_FORTIFY_SOURCE=2 -fstack-protector --param=ssp-buffer-size=4 -fPIC -march=x86-64 -gdwarf-4 -fno-debug-types-section -fvar-tracking-assignments -g2  -MT colors.lo -MD -MP -MF .deps/colors.Tpo -c -o colors.lo colors.c++
libtool: compile:  x86_64-pld-linux-g++ -DHAVE_CONFIG_H -I. -I.. -O2 -fwrapv -pipe -Wformat -Werror=format-security -gdwarf-4 -fno-debug-types-section -fvar-tracking-assignments -g2 -Wp,-D_FORTIFY_SOURCE=2 -fstack-protector --param=ssp-buffer-size=4 -fPIC -march=x86-64 -gdwarf-4 -fno-debug-types-section -fvar-tracking-assignments -g2 -MT circles.lo -MD -MP -MF .deps/circles.Tpo -c circles.c++ -o circles.o
libtool: compile:  x86_64-pld-linux-g++ -DHAVE_CONFIG_H -I. -I.. -O2 -fwrapv -pipe -Wformat -Werror=format-security -gdwarf-4 -fno-debug-types-section -fvar-tracking-assignments -g2 -Wp,-D_FORTIFY_SOURCE=2 -fstack-protector --param=ssp-buffer-size=4 -fPIC -march=x86-64 -gdwarf-4 -fno-debug-types-section -fvar-tracking-assignments -g2 -MT cncsctlt.lo -MD -MP -MF .deps/cncsctlt.Tpo -c cncsctlt.c++ -o cncsctlt.o
libtool: compile:  x86_64-pld-linux-g++ -DHAVE_CONFIG_H -I. -I.. -O2 -fwrapv -pipe -Wformat -Werror=format-security -gdwarf-4 -fno-debug-types-section -fvar-tracking-assignments -g2 -Wp,-D_FORTIFY_SOURCE=2 -fstack-protector --param=ssp-buffer-size=4 -fPIC -march=x86-64 -gdwarf-4 -fno-debug-types-section -fvar-tracking-assignments -g2 -MT arc.lo -MD -MP -MF .deps/arc.Tpo -c arc.c++ -o arc.o
libtool: compile:  x86_64-pld-linux-g++ -DHAVE_CONFIG_H -I. -I.. -O2 -fwrapv -pipe -Wformat -Werror=format-security -gdwarf-4 -fno-debug-types-section -fvar-tracking-assignments -g2 -Wp,-D_FORTIFY_SOURCE=2 -fstack-protector --param=ssp-buffer-size=4 -fPIC -march=x86-64 -gdwarf-4 -fno-debug-types-section -fvar-tracking-assignments -g2 -MT colors.lo -MD -MP -MF .deps/colors.Tpo -c colors.c++ -o colors.o
/bin/sh ../libtool  --tag=CXX   --mode=compile x86_64-pld-linux-g++ -DHAVE_CONFIG_H -I. -I..     -O2 -fwrapv -pipe -Wformat -Werror=format-security -gdwarf-4 -fno-debug-types-section -fvar-tracking-assignments -g2 -Wp,-D_FORTIFY_SOURCE=2 -fstack-protector --param=ssp-buffer-size=4 -fPIC -march=x86-64 -gdwarf-4 -fno-debug-types-section -fvar-tracking-assignments -g2  -MT complex.lo -MD -MP -MF .deps/complex.Tpo -c -o complex.lo complex.c++
libtool: compile:  x86_64-pld-linux-g++ -DHAVE_CONFIG_H -I. -I.. -O2 -fwrapv -pipe -Wformat -Werror=format-security -gdwarf-4 -fno-debug-types-section -fvar-tracking-assignments -g2 -Wp,-D_FORTIFY_SOURCE=2 -fstack-protector --param=ssp-buffer-size=4 -fPIC -march=x86-64 -gdwarf-4 -fno-debug-types-section -fvar-tracking-assignments -g2 -MT complex.lo -MD -MP -MF .deps/complex.Tpo -c complex.c++ -o complex.o
mv -f .deps/complex.Tpo .deps/complex.Plo
/bin/sh ../libtool  --tag=CXX   --mode=compile x86_64-pld-linux-g++ -DHAVE_CONFIG_H -I. -I..     -O2 -fwrapv -pipe -Wformat -Werror=format-security -gdwarf-4 -fno-debug-types-section -fvar-tracking-assignments -g2 -Wp,-D_FORTIFY_SOURCE=2 -fstack-protector --param=ssp-buffer-size=4 -fPIC -march=x86-64 -gdwarf-4 -fno-debug-types-section -fvar-tracking-assignments -g2  -MT cones.lo -MD -MP -MF .deps/cones.Tpo -c -o cones.lo cones.c++
libtool: compile:  x86_64-pld-linux-g++ -DHAVE_CONFIG_H -I. -I.. -O2 -fwrapv -pipe -Wformat -Werror=format-security -gdwarf-4 -fno-debug-types-section -fvar-tracking-assignments -g2 -Wp,-D_FORTIFY_SOURCE=2 -fstack-protector --param=ssp-buffer-size=4 -fPIC -march=x86-64 -gdwarf-4 -fno-debug-types-section -fvar-tracking-assignments -g2 -MT cones.lo -MD -MP -MF .deps/cones.Tpo -c cones.c++ -o cones.o
mv -f .deps/colors.Tpo .deps/colors.Plo
/bin/sh ../libtool  --tag=CXX   --mode=compile x86_64-pld-linux-g++ -DHAVE_CONFIG_H -I. -I..     -O2 -fwrapv -pipe -Wformat -Werror=format-security -gdwarf-4 -fno-debug-types-section -fvar-tracking-assignments -g2 -Wp,-D_FORTIFY_SOURCE=2 -fstack-protector --param=ssp-buffer-size=4 -fPIC -march=x86-64 -gdwarf-4 -fno-debug-types-section -fvar-tracking-assignments -g2  -MT conicsct.lo -MD -MP -MF .deps/conicsct.Tpo -c -o conicsct.lo conicsct.c++
mv -f .deps/arc.Tpo .deps/arc.Plo
/bin/sh ../libtool  --tag=CXX   --mode=compile x86_64-pld-linux-g++ -DHAVE_CONFIG_H -I. -I..     -O2 -fwrapv -pipe -Wformat -Werror=format-security -gdwarf-4 -fno-debug-types-section -fvar-tracking-assignments -g2 -Wp,-D_FORTIFY_SOURCE=2 -fstack-protector --param=ssp-buffer-size=4 -fPIC -march=x86-64 -gdwarf-4 -fno-debug-types-section -fvar-tracking-assignments -g2  -MT crclslc.lo -MD -MP -MF .deps/crclslc.Tpo -c -o crclslc.lo crclslc.c++
libtool: compile:  x86_64-pld-linux-g++ -DHAVE_CONFIG_H -I. -I.. -O2 -fwrapv -pipe -Wformat -Werror=format-security -gdwarf-4 -fno-debug-types-section -fvar-tracking-assignments -g2 -Wp,-D_FORTIFY_SOURCE=2 -fstack-protector --param=ssp-buffer-size=4 -fPIC -march=x86-64 -gdwarf-4 -fno-debug-types-section -fvar-tracking-assignments -g2 -MT crclslc.lo -MD -MP -MF .deps/crclslc.Tpo -c crclslc.c++ -o crclslc.o
libtool: compile:  x86_64-pld-linux-g++ -DHAVE_CONFIG_H -I. -I.. -O2 -fwrapv -pipe -Wformat -Werror=format-security -gdwarf-4 -fno-debug-types-section -fvar-tracking-assignments -g2 -Wp,-D_FORTIFY_SOURCE=2 -fstack-protector --param=ssp-buffer-size=4 -fPIC -march=x86-64 -gdwarf-4 -fno-debug-types-section -fvar-tracking-assignments -g2 -MT conicsct.lo -MD -MP -MF .deps/conicsct.Tpo -c conicsct.c++ -o conicsct.o
mv -f .deps/circles.Tpo .deps/circles.Plo
/bin/sh ../libtool  --tag=CXX   --mode=compile x86_64-pld-linux-g++ -DHAVE_CONFIG_H -I. -I..     -O2 -fwrapv -pipe -Wformat -Werror=format-security -gdwarf-4 -fno-debug-types-section -fvar-tracking-assignments -g2 -Wp,-D_FORTIFY_SOURCE=2 -fstack-protector --param=ssp-buffer-size=4 -fPIC -march=x86-64 -gdwarf-4 -fno-debug-types-section -fvar-tracking-assignments -g2  -MT creatnew.lo -MD -MP -MF .deps/creatnew.Tpo -c -o creatnew.lo creatnew.c++
libtool: compile:  x86_64-pld-linux-g++ -DHAVE_CONFIG_H -I. -I.. -O2 -fwrapv -pipe -Wformat -Werror=format-security -gdwarf-4 -fno-debug-types-section -fvar-tracking-assignments -g2 -Wp,-D_FORTIFY_SOURCE=2 -fstack-protector --param=ssp-buffer-size=4 -fPIC -march=x86-64 -gdwarf-4 -fno-debug-types-section -fvar-tracking-assignments -g2 -MT creatnew.lo -MD -MP -MF .deps/creatnew.Tpo -c creatnew.c++ -o creatnew.o
mv -f .deps/crclslc.Tpo .deps/crclslc.Plo
/bin/sh ../libtool  --tag=CXX   --mode=compile x86_64-pld-linux-g++ -DHAVE_CONFIG_H -I. -I..     -O2 -fwrapv -pipe -Wformat -Werror=format-security -gdwarf-4 -fno-debug-types-section -fvar-tracking-assignments -g2 -Wp,-D_FORTIFY_SOURCE=2 -fstack-protector --param=ssp-buffer-size=4 -fPIC -march=x86-64 -gdwarf-4 -fno-debug-types-section -fvar-tracking-assignments -g2  -MT cuboid.lo -MD -MP -MF .deps/cuboid.Tpo -c -o cuboid.lo cuboid.c++
libtool: compile:  x86_64-pld-linux-g++ -DHAVE_CONFIG_H -I. -I.. -O2 -fwrapv -pipe -Wformat -Werror=format-security -gdwarf-4 -fno-debug-types-section -fvar-tracking-assignments -g2 -Wp,-D_FORTIFY_SOURCE=2 -fstack-protector --param=ssp-buffer-size=4 -fPIC -march=x86-64 -gdwarf-4 -fno-debug-types-section -fvar-tracking-assignments -g2 -MT cuboid.lo -MD -MP -MF .deps/cuboid.Tpo -c cuboid.c++ -o cuboid.o
mv -f .deps/creatnew.Tpo .deps/creatnew.Plo
/bin/sh ../libtool  --tag=CXX   --mode=compile x86_64-pld-linux-g++ -DHAVE_CONFIG_H -I. -I..     -O2 -fwrapv -pipe -Wformat -Werror=format-security -gdwarf-4 -fno-debug-types-section -fvar-tracking-assignments -g2 -Wp,-D_FORTIFY_SOURCE=2 -fstack-protector --param=ssp-buffer-size=4 -fPIC -march=x86-64 -gdwarf-4 -fno-debug-types-section -fvar-tracking-assignments -g2  -MT curves.lo -MD -MP -MF .deps/curves.Tpo -c -o curves.lo curves.c++
libtool: compile:  x86_64-pld-linux-g++ -DHAVE_CONFIG_H -I. -I.. -O2 -fwrapv -pipe -Wformat -Werror=format-security -gdwarf-4 -fno-debug-types-section -fvar-tracking-assignments -g2 -Wp,-D_FORTIFY_SOURCE=2 -fstack-protector --param=ssp-buffer-size=4 -fPIC -march=x86-64 -gdwarf-4 -fno-debug-types-section -fvar-tracking-assignments -g2 -MT curves.lo -MD -MP -MF .deps/curves.Tpo -c curves.c++ -o curves.o
mv -f .deps/cones.Tpo .deps/cones.Plo
/bin/sh ../libtool  --tag=CXX   --mode=compile x86_64-pld-linux-g++ -DHAVE_CONFIG_H -I. -I..     -O2 -fwrapv -pipe -Wformat -Werror=format-security -gdwarf-4 -fno-debug-types-section -fvar-tracking-assignments -g2 -Wp,-D_FORTIFY_SOURCE=2 -fstack-protector --param=ssp-buffer-size=4 -fPIC -march=x86-64 -gdwarf-4 -fno-debug-types-section -fvar-tracking-assignments -g2  -MT cylinder.lo -MD -MP -MF .deps/cylinder.Tpo -c -o cylinder.lo cylinder.c++
libtool: compile:  x86_64-pld-linux-g++ -DHAVE_CONFIG_H -I. -I.. -O2 -fwrapv -pipe -Wformat -Werror=format-security -gdwarf-4 -fno-debug-types-section -fvar-tracking-assignments -g2 -Wp,-D_FORTIFY_SOURCE=2 -fstack-protector --param=ssp-buffer-size=4 -fPIC -march=x86-64 -gdwarf-4 -fno-debug-types-section -fvar-tracking-assignments -g2 -MT cylinder.lo -MD -MP -MF .deps/cylinder.Tpo -c cylinder.c++ -o cylinder.o
mv -f .deps/conicsct.Tpo .deps/conicsct.Plo
/bin/sh ../libtool  --tag=CXX   --mode=compile x86_64-pld-linux-g++ -DHAVE_CONFIG_H -I. -I..     -O2 -fwrapv -pipe -Wformat -Werror=format-security -gdwarf-4 -fno-debug-types-section -fvar-tracking-assignments -g2 -Wp,-D_FORTIFY_SOURCE=2 -fstack-protector --param=ssp-buffer-size=4 -fPIC -march=x86-64 -gdwarf-4 -fno-debug-types-section -fvar-tracking-assignments -g2  -MT dashptrn.lo -MD -MP -MF .deps/dashptrn.Tpo -c -o dashptrn.lo dashptrn.c++
libtool: compile:  x86_64-pld-linux-g++ -DHAVE_CONFIG_H -I. -I.. -O2 -fwrapv -pipe -Wformat -Werror=format-security -gdwarf-4 -fno-debug-types-section -fvar-tracking-assignments -g2 -Wp,-D_FORTIFY_SOURCE=2 -fstack-protector --param=ssp-buffer-size=4 -fPIC -march=x86-64 -gdwarf-4 -fno-debug-types-section -fvar-tracking-assignments -g2 -MT dashptrn.lo -MD -MP -MF .deps/dashptrn.Tpo -c dashptrn.c++ -o dashptrn.o
mv -f .deps/cncsctlt.Tpo .deps/cncsctlt.Plo
/bin/sh ../libtool  --tag=CXX   --mode=compile x86_64-pld-linux-g++ -DHAVE_CONFIG_H -I. -I..     -O2 -fwrapv -pipe -Wformat -Werror=format-security -gdwarf-4 -fno-debug-types-section -fvar-tracking-assignments -g2 -Wp,-D_FORTIFY_SOURCE=2 -fstack-protector --param=ssp-buffer-size=4 -fPIC -march=x86-64 -gdwarf-4 -fno-debug-types-section -fvar-tracking-assignments -g2  -MT ddchdrn.lo -MD -MP -MF .deps/ddchdrn.Tpo -c -o ddchdrn.lo ddchdrn.c++
libtool: compile:  x86_64-pld-linux-g++ -DHAVE_CONFIG_H -I. -I.. -O2 -fwrapv -pipe -Wformat -Werror=format-security -gdwarf-4 -fno-debug-types-section -fvar-tracking-assignments -g2 -Wp,-D_FORTIFY_SOURCE=2 -fstack-protector --param=ssp-buffer-size=4 -fPIC -march=x86-64 -gdwarf-4 -fno-debug-types-section -fvar-tracking-assignments -g2 -MT ddchdrn.lo -MD -MP -MF .deps/ddchdrn.Tpo -c ddchdrn.c++ -o ddchdrn.o
mv -f .deps/dashptrn.Tpo .deps/dashptrn.Plo
/bin/sh ../libtool  --tag=CXX   --mode=compile x86_64-pld-linux-g++ -DHAVE_CONFIG_H -I. -I..     -O2 -fwrapv -pipe -Wformat -Werror=format-security -gdwarf-4 -fno-debug-types-section -fvar-tracking-assignments -g2 -Wp,-D_FORTIFY_SOURCE=2 -fstack-protector --param=ssp-buffer-size=4 -fPIC -march=x86-64 -gdwarf-4 -fno-debug-types-section -fvar-tracking-assignments -g2  -MT deftfncs.lo -MD -MP -MF .deps/deftfncs.Tpo -c -o deftfncs.lo deftfncs.c++
libtool: compile:  x86_64-pld-linux-g++ -DHAVE_CONFIG_H -I. -I.. -O2 -fwrapv -pipe -Wformat -Werror=format-security -gdwarf-4 -fno-debug-types-section -fvar-tracking-assignments -g2 -Wp,-D_FORTIFY_SOURCE=2 -fstack-protector --param=ssp-buffer-size=4 -fPIC -march=x86-64 -gdwarf-4 -fno-debug-types-section -fvar-tracking-assignments -g2 -MT deftfncs.lo -MD -MP -MF .deps/deftfncs.Tpo -c deftfncs.c++ -o deftfncs.o
mv -f .deps/cuboid.Tpo .deps/cuboid.Plo
/bin/sh ../libtool  --tag=CXX   --mode=compile x86_64-pld-linux-g++ -DHAVE_CONFIG_H -I. -I..     -O2 -fwrapv -pipe -Wformat -Werror=format-security -gdwarf-4 -fno-debug-types-section -fvar-tracking-assignments -g2 -Wp,-D_FORTIFY_SOURCE=2 -fstack-protector --param=ssp-buffer-size=4 -fPIC -march=x86-64 -gdwarf-4 -fno-debug-types-section -fvar-tracking-assignments -g2  -MT ellipses.lo -MD -MP -MF .deps/ellipses.Tpo -c -o ellipses.lo ellipses.c++
libtool: compile:  x86_64-pld-linux-g++ -DHAVE_CONFIG_H -I. -I.. -O2 -fwrapv -pipe -Wformat -Werror=format-security -gdwarf-4 -fno-debug-types-section -fvar-tracking-assignments -g2 -Wp,-D_FORTIFY_SOURCE=2 -fstack-protector --param=ssp-buffer-size=4 -fPIC -march=x86-64 -gdwarf-4 -fno-debug-types-section -fvar-tracking-assignments -g2 -MT ellipses.lo -MD -MP -MF .deps/ellipses.Tpo -c ellipses.c++ -o ellipses.o
./deftfncs.web:127:22: fatal error: parser.h++: No such file or directory
 #include "parser.h++"   
                      ^
compilation terminated.
make[2]: *** [deftfncs.lo] Error 1
make[2]: *** Waiting for unfinished jobs....
mv -f .deps/curves.Tpo .deps/curves.Plo
mv -f .deps/cylinder.Tpo .deps/cylinder.Plo
mv -f .deps/ddchdrn.Tpo .deps/ddchdrn.Plo
mv -f .deps/ellipses.Tpo .deps/ellipses.Plo
make[2]: Leaving directory `/tmp/B.8ccc11e2-e06d-4183-8de9-6a8489806e25/BUILD/3DLDF-2.0.2/src'
make[1]: *** [all-recursive] Error 1
make[1]: Leaving directory `/tmp/B.8ccc11e2-e06d-4183-8de9-6a8489806e25/BUILD/3DLDF-2.0.2'
make: *** [all] Error 2
error: Bad exit status from /tmp/B.8ccc11e2-e06d-4183-8de9-6a8489806e25/BUILD/tmp/rpm-tmp.77667 (%build)


RPM build errors:
    Bad exit status from /tmp/B.8ccc11e2-e06d-4183-8de9-6a8489806e25/BUILD/tmp/rpm-tmp.77667 (%build)
ended at: Sat Nov 23 08:08:26 2013, done in 0:00:44.126995
error: No files produced.
Can't find java virtual machine, aborting.
mesg: ttyname failed: Inappropriate ioctl for device
+ chmod -R u+rwX /tmp/B.8ccc11e2-e06d-4183-8de9-6a8489806e25/BUILD
+ rm -rf /tmp/B.8ccc11e2-e06d-4183-8de9-6a8489806e25/tmp /tmp/B.8ccc11e2-e06d-4183-8de9-6a8489806e25/BUILD
Can't find java virtual machine, aborting.
mesg: ttyname failed: Inappropriate ioctl for device
+ rm -rf /tmp/B.8ccc11e2-e06d-4183-8de9-6a8489806e25
Begin-PLD-Builder-Info
Build-Time: user:34.38s sys:5.00s real:129.99s (faults io:28 non-io:1943539)

End-PLD-Builder-Info
[Back to list of logs] [View rpm -qa of builder]