FailedOk

th/SRPMS[OK]
th/x32[OK]
th/i686[OK]
th/x86_64[OK]

ac/SRPMS[OK]
ac/i386[OK]
ac/i586[OK]
ac/i686[OK]
ac/alpha[OK]
ac/amd64[OK]
ac/athlon[OK]
ac/ppc[OK]
ac/sparc[OK]
ac/sparc64[OK]

Advanced Search
main()
Powered by PLD Linux
(c) 2002-2024 PLD Team
$Revision: 1.37 $
Powered by foobar.
Your IP: 35.172.230.21

ApacheDirectoryStudio 8c590e68-25f2-43ef-a6b8-183377a1f10d

Status:Failed
Source URL:https://buildlogs.pld-linux.org/pld/th/x86_64/FAIL/ApacheDirectoryStudio,8c590e68-25f2-43ef-a6b8-183377a1f10d.bz2
text/plain URL:View!
rpm -qa of builder:View!
Date:2009/02/20 10:30:02

Toc:

  • error 1
  • rpm: error: Failed build dependencies:
  • error 2
  • poldek: error: java-gcj-compat = 1.0.78-5 is required by installed java-gcj-compat-devel-1.0.78-5.x86_64
  • error 3
  • poldek: error: java-sun-jre-1.6.0.11-1.x86_64 (cap java-sun-jre = 1.6.0.11-1) conflicts with installed java-gcj-compat-devel-1.0.78-5.x86_64 (java-sun-jre)
  • error 4
  • poldek: error: 1 unresolved dependency, 1 conflicts
  • prep
  • Executing(%prep): env -i PATH=/home/users/builder/GNUstep/Tools:/usr/local/bin:/usr/bin:/bin:/usr/bin:/usr/local/bin:/usr/X11R6/bin:/home/users/builder/bin HOME=/home/users/builder TMP=/home/users/builder/tmp TMPDIR=/tmp/B.e214dd /bin/sh -e /tmp/B.e214dd/rpm-tmp.37720
  • build
  • Executing(%build): env -i PATH=/home/users/builder/GNUstep/Tools:/usr/local/bin:/usr/bin:/bin:/usr/bin:/usr/local/bin:/usr/X11R6/bin:/home/users/builder/bin HOME=/home/users/builder TMP=/home/users/builder/tmp TMPDIR=/tmp/B.e214dd /bin/sh -e /tmp/B.e214dd/rpm-tmp.67235
  • error 5
  • Tests run: 18, Failures: 0, Errors: 0, Skipped: 0, Time elapsed: 0.494 sec
  • error 6
  • Tests run: 95, Failures: 0, Errors: 0, Skipped: 0, Time elapsed: 0.884 sec
  • error 7
  • Tests run: 18, Failures: 0, Errors: 0, Skipped: 0, Time elapsed: 0.145 sec
  • error 8
  • Tests run: 14, Failures: 0, Errors: 0, Skipped: 0, Time elapsed: 0.024 sec
  • error 9
  • Tests run: 21, Failures: 0, Errors: 0, Skipped: 0, Time elapsed: 0.154 sec
  • error 10
  • Tests run: 17, Failures: 0, Errors: 0, Skipped: 0, Time elapsed: 0.039 sec
  • error 11
  • Tests run: 11, Failures: 0, Errors: 0, Skipped: 0, Time elapsed: 0.029 sec
  • error 12
  • Tests run: 18, Failures: 0, Errors: 0, Skipped: 0, Time elapsed: 0.038 sec
  • error 13
  • Tests run: 17, Failures: 0, Errors: 0, Skipped: 0, Time elapsed: 0.035 sec
  • error 14
  • Tests run: 21, Failures: 0, Errors: 0, Skipped: 0, Time elapsed: 0.071 sec
  • error 15
  • Tests run: 10, Failures: 0, Errors: 0, Skipped: 0, Time elapsed: 0.019 sec
  • error 16
  • Tests run: 14, Failures: 0, Errors: 0, Skipped: 0, Time elapsed: 0.038 sec
  • error 17
  • Tests run: 10, Failures: 0, Errors: 0, Skipped: 0, Time elapsed: 0.018 sec
  • error 18
  • Tests run: 17, Failures: 0, Errors: 0, Skipped: 0, Time elapsed: 0.083 sec
  • error 19
  • Tests run: 18, Failures: 0, Errors: 0, Skipped: 0, Time elapsed: 0.033 sec
  • error 20
  • Tests run: 18, Failures: 0, Errors: 0, Skipped: 0, Time elapsed: 0.113 sec
  • error 21
  • Tests run: 18, Failures: 0, Errors: 0, Skipped: 0, Time elapsed: 0.055 sec
  • error 22
  • Tests run: 18, Failures: 0, Errors: 0, Skipped: 0, Time elapsed: 0.028 sec
  • error 23
  • Tests run: 18, Failures: 0, Errors: 0, Skipped: 0, Time elapsed: 0.029 sec
  • error 24
  • Tests run: 12, Failures: 0, Errors: 0, Skipped: 0, Time elapsed: 0.08 sec
  • error 25
  • Tests run: 10, Failures: 0, Errors: 0, Skipped: 0, Time elapsed: 0.02 sec
  • error 26
  • Tests run: 25, Failures: 0, Errors: 0, Skipped: 0, Time elapsed: 0.035 sec
  • error 27
  • Tests run: 22, Failures: 0, Errors: 0, Skipped: 0, Time elapsed: 0.037 sec
  • error 28
  • Tests run: 460, Failures: 0, Errors: 0, Skipped: 0
  • error 29
  • Tests run: 5, Failures: 0, Errors: 0, Skipped: 0, Time elapsed: 0.048 sec
  • error 30
  • Tests run: 5, Failures: 0, Errors: 0, Skipped: 0, Time elapsed: 0.074 sec
  • error 31
  • Tests run: 1, Failures: 0, Errors: 0, Skipped: 0, Time elapsed: 0.045 sec
  • error 32
  • Tests run: 11, Failures: 0, Errors: 0, Skipped: 0
  • error 33
  • Failure executing javac, but could not parse the error:
  • error 34
  • java.lang.OutOfMemoryError: Java heap space
  • error 35
  • Failure executing javac, but could not parse the error:
  • error 36
  • java.lang.OutOfMemoryError: Java heap space
  • error 37
  • error: Bad exit status from /tmp/B.e214dd/rpm-tmp.67235 (%build)
  • error 38
  • RPM build errors:
  • error 39
  • error: No files produced.

Content:

request from: paszczus
started at: Fri Feb 20 10:08:47 2009
fetching http://ep09.pld-linux.org/~builderth//srpms/8c590e68-25f2-43ef-a6b8-183377a1f10d/ApacheDirectoryStudio-1.4.0-0.745477.1.src.rpm
fetched 170265685 bytes, 191.8 K/s
installing srpm: ApacheDirectoryStudio-1.4.0-0.745477.1.src.rpm
Building target platforms: x86_64-pld-linux
checking BuildConflict-ing packages
no BuildConflicts found
checking BR
rpm: error: Failed build dependencies:
rpm: 	java-sun-jre is needed by ApacheDirectoryStudio-1.4.0-0.745477.1.src
rpm: 	maven is needed by ApacheDirectoryStudio-1.4.0-0.745477.1.src
updating poldek cache...
warn: removed duplicated source ready -- /spools/ready/

local is up to date

Retrieving th-i686::packages.ndir.md...
th-i686 is up to date

Retrieving th::packages.ndir.md...
th is up to date

Retrieving th::packages.ndir.md...
th is up to date

Retrieving th-ready-i686::packages.ndir.md...
th-ready-i686 is up to date

Retrieving th-ready::packages.ndir.md...
th-ready is up to date

Retrieving th-ready::packages.ndir.md...
th-ready is up to date

Retrieving th-test-i686::packages.ndir.md...
Retrieving th-test-i686::packages.ndir.diff.toc.gz...
..............................done

Retrieving diff::packages.ndir.2009.02.19-22.24.00.gz...
..............................done
Retrieving diff::packages.ndir.dscr.2009.02.19-22.24.00.gz...
Loading [pndir]th-test-i686...
Applying packages.ndir.2009.02.19-22.24.00.gz...

Retrieving diff::packages.ndir.2009.02.19-22.53.00.gz...
..............................done
Retrieving diff::packages.ndir.dscr.2009.02.19-22.53.00.gz...
Applying packages.ndir.2009.02.19-22.53.00.gz...

Retrieving diff::packages.ndir.2009.02.19-23.01.00.gz...
Applying packages.ndir.2009.02.19-23.01.00.gz...

Writing /root/.poldek-cache/[...]/packages.ndir.gz...

Retrieving th-test::packages.ndir.md...
th-test is up to date

Retrieving th-test::packages.ndir.md...
Retrieving th-test::packages.ndir.diff.toc.gz...
..............................done

Retrieving diff::packages.ndir.2009.02.19-22.24.00.gz...
..............................done
Retrieving diff::packages.ndir.dscr.2009.02.19-22.24.00.gz...
Loading [pndir]th-test...
Applying packages.ndir.2009.02.19-22.24.00.gz...

Retrieving diff::packages.ndir.2009.02.19-22.53.00.gz...
..............................done
Retrieving diff::packages.ndir.dscr.2009.02.19-22.53.00.gz...
Applying packages.ndir.2009.02.19-22.53.00.gz...

Retrieving diff::packages.ndir.2009.02.19-23.03.00.gz...
Applying packages.ndir.2009.02.19-23.03.00.gz...

Writing /root/.poldek-cache/[...]/packages.ndir.gz...
checking conflicting packages in BRed packages
poldek: warn: removed duplicated source ready -- /spools/ready/
poldek: Loading [pndir]local...
poldek: Loading [pndir]th-test...
poldek: Loading [pndir]th-test...
poldek: Loading [pndir]th-ready...
poldek: Loading [pndir]th-ready...
poldek: Loading [pndir]th...
poldek: Loading [pndir]th...
poldek: 19225 packages read
poldek: Removed 1377 duplicate packages from available set
poldek: Processing dependencies...
poldek: java-gcj-compat-1.0.78-5.x86_64 obsoleted by java-sun-jre-1.6.0.11-1.x86_64
poldek: error: java-gcj-compat = 1.0.78-5 is required by installed java-gcj-compat-devel-1.0.78-5.x86_64
poldek: error: java-sun-jre-1.6.0.11-1.x86_64 (cap java-sun-jre = 1.6.0.11-1) conflicts with installed java-gcj-compat-devel-1.0.78-5.x86_64 (java-sun-jre)
poldek: There are 2 packages to install, 1 to remove:
poldek: I java-sun-jre-1.6.0.11-1.x86_64, maven-2.0.9-1.noarch
poldek: R java-gcj-compat-1.0.78-5.x86_64
poldek: Need to get 17.7MB of archives (17.7MB to download).
poldek: After unpacking 74.1MB will be used.
poldek: error: 1 unresolved dependency, 1 conflicts
uninstalling conflicting packages
removing ant java-gcj-compat-devel
warn: removed duplicated source ready -- /spools/ready/
mark ant-1.7.1-4.noarch
mark java-gcj-compat-devel-1.0.78-5.x86_64
Processing dependencies...
There are 2 packages to remove:
R ant-1.7.1-4.noarch, java-gcj-compat-devel-1.0.78-5.x86_64
Running rpm --erase --root / --noorder...
installing BR: maven java\-sun\-jre
warn: removed duplicated source ready -- /spools/ready/
Loading [pndir]local...
Loading [pndir]th-test...
Loading [pndir]th-test...
Loading [pndir]th-ready...
Loading [pndir]th-ready...
Loading [pndir]th...
Loading [pndir]th...
19225 packages read
Removed 1377 duplicate packages from available set
Processing dependencies...
java-gcj-compat-1.0.78-5.x86_64 obsoleted by java-sun-jre-1.6.0.11-1.x86_64
java-sun-jre-1.6.0.11-1.x86_64 marks java-sun-tools-1.6.0.11-1.x86_64 (cap java-jre-tools)
There are 2 packages to install (1 marked by dependencies), 1 to remove:
I java-sun-jre-1.6.0.11-1.x86_64
D java-sun-tools-1.6.0.11-1.x86_64
R java-gcj-compat-1.0.78-5.x86_64
Need to get 15.8MB of archives (15.8MB to download).
After unpacking 72.1MB will be used.
Retrieving th::java-sun-tools-1.6.0.11-1.x86_64.rpm...
..............................done
Retrieving th::java-sun-jre-1.6.0.11-1.x86_64.rpm...
..............................done
Executing rpm --upgrade -vh --root /...
warning: /root/.poldek-cache/ftp_ep09.pld-linux.org.dists.th.PLD.x86.64.RPMS/java-sun-tools-1.6.0.11-1.x86_64.rpm: Header V4 DSA signature: NOKEY, key ID e4f1bc2d
Preparing...                ##################################################
java-sun-jre                ##################################################
java-sun-tools              ##################################################
Installing set #2
Processing dependencies...
maven-2.0.9-1.noarch marks java-sun-1.6.0.11-1.x86_64 (cap jdk)
There are 2 packages to install (1 marked by dependencies):
I maven-2.0.9-1.noarch
D java-sun-1.6.0.11-1.x86_64
Need to get 7.9MB of archives (7.9MB to download).
After unpacking 32.3MB will be used.
Retrieving th::java-sun-1.6.0.11-1.x86_64.rpm...
..............................done
Retrieving th-test::maven-2.0.9-1.noarch.rpm...
..............................done
Executing rpm --upgrade -vh --root /...
warning: /root/.poldek-cache/ftp_ep09.pld-linux.org.dists.th.PLD.x86.64.RPMS/java-sun-1.6.0.11-1.x86_64.rpm: Header V4 DSA signature: NOKEY, key ID e4f1bc2d
Preparing...                ##################################################
java-sun                    ##################################################
maven                       ##################################################
building RPM using: cd rpm/SPECS; TMPDIR=/tmp/B.e214dd nice -n 0 rpmbuild -bb  --target x86_64-pld-linux   ApacheDirectoryStudio.spec
Building target platforms: x86_64-pld-linux
Executing(%prep): env -i PATH=/home/users/builder/GNUstep/Tools:/usr/local/bin:/usr/bin:/bin:/usr/bin:/usr/local/bin:/usr/X11R6/bin:/home/users/builder/bin HOME=/home/users/builder TMP=/home/users/builder/tmp TMPDIR=/tmp/B.e214dd  /bin/sh -e /tmp/B.e214dd/rpm-tmp.37720
+ umask 022
+ cd /home/users/builder/rpm/BUILD
+ cd /home/users/builder/rpm/BUILD
+ rm -rf studio
+ /usr/bin/bzip2 -dc /home/users/builder/rpm/SOURCES/ApacheDirectoryStudio-1.4.0-745477.tar.bz2
+ tar -xf -
+ STATUS=0
+ [ 0 -ne 0 ]
+ cd studio
+ /bin/id -u
+ [ 1000 = 0 ]
+ true .
+ /bin/chmod -Rf -Rf a+rX,u+w,g-w,o-w .
+ exit 0
Executing(%build): env -i PATH=/home/users/builder/GNUstep/Tools:/usr/local/bin:/usr/bin:/bin:/usr/bin:/usr/local/bin:/usr/X11R6/bin:/home/users/builder/bin HOME=/home/users/builder TMP=/home/users/builder/tmp TMPDIR=/tmp/B.e214dd  /bin/sh -e /tmp/B.e214dd/rpm-tmp.67235
+ umask 022
+ cd /home/users/builder/rpm/BUILD
+ cd studio
+ export M2_HOME=/usr/share/maven
+ export JAVA_HOME=/usr/lib64/jvm/java
+ mvn clean install
[INFO] Scanning for projects...
[INFO] Reactor build order: 
[INFO]   Apache Directory Studio
[INFO]   Apache Directory Studio Repository
[INFO]   Apache Directory Studio DSML Parser
[INFO]   Apache Directory Studio Jars
[INFO]   Apache Directory Studio LDIF Parser
[INFO]   Apache Directory Studio Connection Core
[INFO]   Apache Directory Studio LDAP Browser Core
[INFO]   Apache Directory Studio Connection UI
[INFO]   Apache Directory Studio LDAP Browser Common
[INFO]   Apache Directory Studio Value Editors
[INFO]   Apache Directory Studio ACI Item Editor
[INFO]   Apache Directory Studio Schema Editor
[INFO]   Apache Directory Studio Schema Editor Feature
[INFO]   Apache Directory Studio RCP
[INFO]   Apache Directory Studio RCP Feature
[INFO]   Apache Directory Studio LDIF Editor
[INFO]   Apache Directory Studio LDIF Editor Feature
[INFO]   Apache Directory Studio LDAP Browser UI
[INFO]   Apache Directory Studio LDAP Browser Feature
[INFO]   Apache Directory Studio Apache DS Configuration
[INFO]   Apache Directory Studio Apache DS Configuration Feature
[INFO]   Apache Directory Studio Apache DS Launcher
[INFO]   Apache Directory Studio Apache DS
[INFO]   Apache Directory Studio Apache DS Feature
[INFO]   Apache Directory Studio Core Integration Tests
[INFO]   Apache Directory Studio UI Integration Tests
[INFO]   Apache Directory Studio Schema Editor Help
[INFO]   Apache Directory Studio LDIF Editor Help
[INFO]   Apache Directory Studio LDAP Browser Help
[INFO]   Apache Directory Studio Apache DS Configuration Help
[INFO]   Apache Directory Studio RCP Help
[INFO]   Apache Directory Studio Apache DS Help
[INFO]   Apache Directory Studio Update Site
[INFO]   Apache Directory Studio Build
[INFO] ------------------------------------------------------------------------
[INFO] Building Apache Directory Studio
[INFO]    task-segment: [clean, install]
[INFO] ------------------------------------------------------------------------
[INFO] snapshot org.apache.directory.studio:studio-maven-plugin:1.0.2-SNAPSHOT: checking for updates from apache.directory.plugins
[INFO] snapshot org.apache.directory.studio:studio-maven-plugin:1.0.2-SNAPSHOT: checking for updates from apache.directory.snapshot.repo
[INFO] snapshot org.apache.directory.studio:studio-maven-plugin:1.0.2-SNAPSHOT: checking for updates from apache.snapshots
[INFO] [clean:clean]
[INFO] Setting property: classpath.resource.loader.class => 'org.codehaus.plexus.velocity.ContextClassLoaderResourceLoader'.
[INFO] Setting property: velocimacro.messages.on => 'false'.
[INFO] Setting property: resource.loader => 'classpath'.
[INFO] Setting property: resource.manager.logwhenfound => 'false'.
[INFO] [remote-resources:process {execution: default}]
[INFO] [site:attach-descriptor]
[INFO] Unable to load parent project from a relative path: Could not find the model file '/home/users/builder/rpm/BUILD/pom.xml'. for project unknown
[INFO] Parent project loaded from repository.
[INFO] [tools:verify-legal-files {execution: verify-legal-files}]
[INFO] [install:install]
[INFO] Installing /home/users/builder/rpm/BUILD/studio/pom.xml to /home/users/builder/.m2/repository/org/apache/directory/studio/parent/1.4.0-SNAPSHOT/parent-1.4.0-SNAPSHOT.pom
[INFO] ------------------------------------------------------------------------
[INFO] Building Apache Directory Studio Repository
[INFO]    task-segment: [clean, install]
[INFO] ------------------------------------------------------------------------
[INFO] [clean:clean]
[INFO] [remote-resources:process {execution: default}]
[INFO] [site:attach-descriptor]
[INFO] [tools:verify-legal-files {execution: verify-legal-files}]
[INFO] [install:install]
[INFO] Installing /home/users/builder/rpm/BUILD/studio/repository/pom.xml to /home/users/builder/.m2/repository/org/apache/directory/studio/repository/1.4.0-SNAPSHOT/repository-1.4.0-SNAPSHOT.pom
[INFO] ------------------------------------------------------------------------
[INFO] Building Apache Directory Studio DSML Parser
[INFO]    task-segment: [clean, install]
[INFO] ------------------------------------------------------------------------
[INFO] [clean:clean]
[INFO] snapshot org.apache.directory.shared:shared-ldap:0.9.14-SNAPSHOT: checking for updates from apache.directory.snapshot.repo
[INFO] snapshot org.apache.directory.shared:shared-ldap:0.9.14-SNAPSHOT: checking for updates from apache.snapshots
[INFO] snapshot org.apache.directory.shared:shared-parent:0.9.14-SNAPSHOT: checking for updates from apache.directory.snapshot.repo
[INFO] snapshot org.apache.directory.shared:shared-parent:0.9.14-SNAPSHOT: checking for updates from apache.snapshots
[INFO] snapshot org.apache.directory.shared:shared-asn1:0.9.14-SNAPSHOT: checking for updates from apache.directory.snapshot.repo
[INFO] snapshot org.apache.directory.shared:shared-asn1:0.9.14-SNAPSHOT: checking for updates from apache.snapshots
[INFO] snapshot org.apache.directory.shared:shared-ldap-constants:0.9.14-SNAPSHOT: checking for updates from apache.directory.snapshot.repo
[INFO] snapshot org.apache.directory.shared:shared-ldap-constants:0.9.14-SNAPSHOT: checking for updates from apache.snapshots
[INFO] [remote-resources:process {execution: default}]
[INFO] [resources:resources]
[INFO] Using default encoding to copy filtered resources.
[INFO] [compiler:compile]
[INFO] Compiling 49 source files to /home/users/builder/rpm/BUILD/studio/studio-dsml-parser/target/classes
[INFO] [resources:testResources]
[INFO] Using default encoding to copy filtered resources.
[INFO] [compiler:testCompile]
[INFO] Compiling 26 source files to /home/users/builder/rpm/BUILD/studio/studio-dsml-parser/target/test-classes
[WARNING] /home/users/builder/rpm/BUILD/studio/studio-dsml-parser/src/test/java/org/apache/directory/studio/dsmlv2/compareResponse/CompareResponseTest.java:[36,24] com.sun.jndi.ldap.LdapURL is Sun proprietary API and may be removed in a future release

[WARNING] /home/users/builder/rpm/BUILD/studio/studio-dsml-parser/src/test/java/org/apache/directory/studio/dsmlv2/modifyResponse/ModifyResponseTest.java:[36,24] com.sun.jndi.ldap.LdapURL is Sun proprietary API and may be removed in a future release

[WARNING] /home/users/builder/rpm/BUILD/studio/studio-dsml-parser/src/test/java/org/apache/directory/studio/dsmlv2/searchResponse/searchResultDone/SearchResultDoneTest.java:[37,24] com.sun.jndi.ldap.LdapURL is Sun proprietary API and may be removed in a future release

[WARNING] /home/users/builder/rpm/BUILD/studio/studio-dsml-parser/src/test/java/org/apache/directory/studio/dsmlv2/authResponse/AuthResponseTest.java:[36,24] com.sun.jndi.ldap.LdapURL is Sun proprietary API and may be removed in a future release

[WARNING] /home/users/builder/rpm/BUILD/studio/studio-dsml-parser/src/test/java/org/apache/directory/studio/dsmlv2/extendedResponse/ExtendedResponseTest.java:[38,24] com.sun.jndi.ldap.LdapURL is Sun proprietary API and may be removed in a future release

[WARNING] /home/users/builder/rpm/BUILD/studio/studio-dsml-parser/src/test/java/org/apache/directory/studio/dsmlv2/modDNResponse/ModifyDNResponseTest.java:[36,24] com.sun.jndi.ldap.LdapURL is Sun proprietary API and may be removed in a future release

[WARNING] /home/users/builder/rpm/BUILD/studio/studio-dsml-parser/src/test/java/org/apache/directory/studio/dsmlv2/addResponse/AddResponseTest.java:[36,24] com.sun.jndi.ldap.LdapURL is Sun proprietary API and may be removed in a future release

[WARNING] /home/users/builder/rpm/BUILD/studio/studio-dsml-parser/src/test/java/org/apache/directory/studio/dsmlv2/delResponse/DelResponseTest.java:[36,24] com.sun.jndi.ldap.LdapURL is Sun proprietary API and may be removed in a future release

[WARNING] /home/users/builder/rpm/BUILD/studio/studio-dsml-parser/src/test/java/org/apache/directory/studio/dsmlv2/compareResponse/CompareResponseTest.java:[350,30] com.sun.jndi.ldap.LdapURL is Sun proprietary API and may be removed in a future release

[WARNING] /home/users/builder/rpm/BUILD/studio/studio-dsml-parser/src/test/java/org/apache/directory/studio/dsmlv2/compareResponse/CompareResponseTest.java:[421,30] com.sun.jndi.ldap.LdapURL is Sun proprietary API and may be removed in a future release

[WARNING] /home/users/builder/rpm/BUILD/studio/studio-dsml-parser/src/test/java/org/apache/directory/studio/dsmlv2/compareResponse/CompareResponseTest.java:[432,30] com.sun.jndi.ldap.LdapURL is Sun proprietary API and may be removed in a future release

[WARNING] /home/users/builder/rpm/BUILD/studio/studio-dsml-parser/src/test/java/org/apache/directory/studio/dsmlv2/compareResponse/CompareResponseTest.java:[473,30] com.sun.jndi.ldap.LdapURL is Sun proprietary API and may be removed in a future release

[WARNING] /home/users/builder/rpm/BUILD/studio/studio-dsml-parser/src/test/java/org/apache/directory/studio/dsmlv2/modifyResponse/ModifyResponseTest.java:[350,30] com.sun.jndi.ldap.LdapURL is Sun proprietary API and may be removed in a future release

[WARNING] /home/users/builder/rpm/BUILD/studio/studio-dsml-parser/src/test/java/org/apache/directory/studio/dsmlv2/modifyResponse/ModifyResponseTest.java:[421,30] com.sun.jndi.ldap.LdapURL is Sun proprietary API and may be removed in a future release

[WARNING] /home/users/builder/rpm/BUILD/studio/studio-dsml-parser/src/test/java/org/apache/directory/studio/dsmlv2/modifyResponse/ModifyResponseTest.java:[432,30] com.sun.jndi.ldap.LdapURL is Sun proprietary API and may be removed in a future release

[WARNING] /home/users/builder/rpm/BUILD/studio/studio-dsml-parser/src/test/java/org/apache/directory/studio/dsmlv2/modifyResponse/ModifyResponseTest.java:[473,30] com.sun.jndi.ldap.LdapURL is Sun proprietary API and may be removed in a future release

[WARNING] /home/users/builder/rpm/BUILD/studio/studio-dsml-parser/src/test/java/org/apache/directory/studio/dsmlv2/searchResponse/searchResultDone/SearchResultDoneTest.java:[359,30] com.sun.jndi.ldap.LdapURL is Sun proprietary API and may be removed in a future release

[WARNING] /home/users/builder/rpm/BUILD/studio/studio-dsml-parser/src/test/java/org/apache/directory/studio/dsmlv2/searchResponse/searchResultDone/SearchResultDoneTest.java:[432,30] com.sun.jndi.ldap.LdapURL is Sun proprietary API and may be removed in a future release

[WARNING] /home/users/builder/rpm/BUILD/studio/studio-dsml-parser/src/test/java/org/apache/directory/studio/dsmlv2/searchResponse/searchResultDone/SearchResultDoneTest.java:[443,30] com.sun.jndi.ldap.LdapURL is Sun proprietary API and may be removed in a future release

[WARNING] /home/users/builder/rpm/BUILD/studio/studio-dsml-parser/src/test/java/org/apache/directory/studio/dsmlv2/searchResponse/searchResultDone/SearchResultDoneTest.java:[485,30] com.sun.jndi.ldap.LdapURL is Sun proprietary API and may be removed in a future release

[WARNING] /home/users/builder/rpm/BUILD/studio/studio-dsml-parser/src/test/java/org/apache/directory/studio/dsmlv2/authResponse/AuthResponseTest.java:[349,30] com.sun.jndi.ldap.LdapURL is Sun proprietary API and may be removed in a future release

[WARNING] /home/users/builder/rpm/BUILD/studio/studio-dsml-parser/src/test/java/org/apache/directory/studio/dsmlv2/authResponse/AuthResponseTest.java:[420,30] com.sun.jndi.ldap.LdapURL is Sun proprietary API and may be removed in a future release

[WARNING] /home/users/builder/rpm/BUILD/studio/studio-dsml-parser/src/test/java/org/apache/directory/studio/dsmlv2/authResponse/AuthResponseTest.java:[431,30] com.sun.jndi.ldap.LdapURL is Sun proprietary API and may be removed in a future release

[WARNING] /home/users/builder/rpm/BUILD/studio/studio-dsml-parser/src/test/java/org/apache/directory/studio/dsmlv2/authResponse/AuthResponseTest.java:[472,30] com.sun.jndi.ldap.LdapURL is Sun proprietary API and may be removed in a future release

[WARNING] /home/users/builder/rpm/BUILD/studio/studio-dsml-parser/src/test/java/org/apache/directory/studio/dsmlv2/extendedResponse/ExtendedResponseTest.java:[352,30] com.sun.jndi.ldap.LdapURL is Sun proprietary API and may be removed in a future release

[WARNING] /home/users/builder/rpm/BUILD/studio/studio-dsml-parser/src/test/java/org/apache/directory/studio/dsmlv2/extendedResponse/ExtendedResponseTest.java:[423,30] com.sun.jndi.ldap.LdapURL is Sun proprietary API and may be removed in a future release

[WARNING] /home/users/builder/rpm/BUILD/studio/studio-dsml-parser/src/test/java/org/apache/directory/studio/dsmlv2/extendedResponse/ExtendedResponseTest.java:[434,30] com.sun.jndi.ldap.LdapURL is Sun proprietary API and may be removed in a future release

[WARNING] /home/users/builder/rpm/BUILD/studio/studio-dsml-parser/src/test/java/org/apache/directory/studio/dsmlv2/extendedResponse/ExtendedResponseTest.java:[475,30] com.sun.jndi.ldap.LdapURL is Sun proprietary API and may be removed in a future release

[WARNING] /home/users/builder/rpm/BUILD/studio/studio-dsml-parser/src/test/java/org/apache/directory/studio/dsmlv2/modDNResponse/ModifyDNResponseTest.java:[350,30] com.sun.jndi.ldap.LdapURL is Sun proprietary API and may be removed in a future release

[WARNING] /home/users/builder/rpm/BUILD/studio/studio-dsml-parser/src/test/java/org/apache/directory/studio/dsmlv2/modDNResponse/ModifyDNResponseTest.java:[421,30] com.sun.jndi.ldap.LdapURL is Sun proprietary API and may be removed in a future release

[WARNING] /home/users/builder/rpm/BUILD/studio/studio-dsml-parser/src/test/java/org/apache/directory/studio/dsmlv2/modDNResponse/ModifyDNResponseTest.java:[432,30] com.sun.jndi.ldap.LdapURL is Sun proprietary API and may be removed in a future release

[WARNING] /home/users/builder/rpm/BUILD/studio/studio-dsml-parser/src/test/java/org/apache/directory/studio/dsmlv2/modDNResponse/ModifyDNResponseTest.java:[473,30] com.sun.jndi.ldap.LdapURL is Sun proprietary API and may be removed in a future release

[WARNING] /home/users/builder/rpm/BUILD/studio/studio-dsml-parser/src/test/java/org/apache/directory/studio/dsmlv2/addResponse/AddResponseTest.java:[347,30] com.sun.jndi.ldap.LdapURL is Sun proprietary API and may be removed in a future release

[WARNING] /home/users/builder/rpm/BUILD/studio/studio-dsml-parser/src/test/java/org/apache/directory/studio/dsmlv2/addResponse/AddResponseTest.java:[418,30] com.sun.jndi.ldap.LdapURL is Sun proprietary API and may be removed in a future release

[WARNING] /home/users/builder/rpm/BUILD/studio/studio-dsml-parser/src/test/java/org/apache/directory/studio/dsmlv2/addResponse/AddResponseTest.java:[429,30] com.sun.jndi.ldap.LdapURL is Sun proprietary API and may be removed in a future release

[WARNING] /home/users/builder/rpm/BUILD/studio/studio-dsml-parser/src/test/java/org/apache/directory/studio/dsmlv2/addResponse/AddResponseTest.java:[470,30] com.sun.jndi.ldap.LdapURL is Sun proprietary API and may be removed in a future release

[WARNING] /home/users/builder/rpm/BUILD/studio/studio-dsml-parser/src/test/java/org/apache/directory/studio/dsmlv2/delResponse/DelResponseTest.java:[347,30] com.sun.jndi.ldap.LdapURL is Sun proprietary API and may be removed in a future release

[WARNING] /home/users/builder/rpm/BUILD/studio/studio-dsml-parser/src/test/java/org/apache/directory/studio/dsmlv2/delResponse/DelResponseTest.java:[418,30] com.sun.jndi.ldap.LdapURL is Sun proprietary API and may be removed in a future release

[WARNING] /home/users/builder/rpm/BUILD/studio/studio-dsml-parser/src/test/java/org/apache/directory/studio/dsmlv2/delResponse/DelResponseTest.java:[429,30] com.sun.jndi.ldap.LdapURL is Sun proprietary API and may be removed in a future release

[WARNING] /home/users/builder/rpm/BUILD/studio/studio-dsml-parser/src/test/java/org/apache/directory/studio/dsmlv2/delResponse/DelResponseTest.java:[470,30] com.sun.jndi.ldap.LdapURL is Sun proprietary API and may be removed in a future release

Downloading: http://repo1.maven.org/maven2/org/apache/maven/surefire/surefire-booter/2.4.3/surefire-booter-2.4.3.pom
1/1K
1K downloaded
Downloading: http://repo1.maven.org/maven2/org/apache/maven/surefire/surefire-api/2.4.3/surefire-api-2.4.3.pom
2/2K
2K downloaded
Downloading: http://repo1.maven.org/maven2/org/apache/maven/maven-core/2.0.6/maven-core-2.0.6.pom
2/6K
4/6K
5/6K
6/6K
6K downloaded
Downloading: http://repo1.maven.org/maven2/org/apache/maven/maven-plugin-parameter-documenter/2.0.6/maven-plugin-parameter-documenter-2.0.6.pom
1/1K
1/1K
1K downloaded
Downloading: http://repo1.maven.org/maven2/org/apache/maven/reporting/maven-reporting-api/2.0.6/maven-reporting-api-2.0.6.pom
1/1K
1K downloaded
Downloading: http://repo1.maven.org/maven2/org/apache/maven/reporting/maven-reporting/2.0.6/maven-reporting-2.0.6.pom
1/1K
1K downloaded
Downloading: http://repo1.maven.org/maven2/org/apache/maven/maven-error-diagnostics/2.0.6/maven-error-diagnostics-2.0.6.pom
1/1K
1/1K
1K downloaded
Downloading: http://repo1.maven.org/maven2/org/apache/maven/maven-plugin-descriptor/2.0.6/maven-plugin-descriptor-2.0.6.pom
1/1K
1/1K
1K downloaded
Downloading: http://repo1.maven.org/maven2/org/apache/maven/maven-monitor/2.0.6/maven-monitor-2.0.6.pom
1/1K
1K downloaded
Downloading: http://repo1.maven.org/maven2/org/apache/maven/maven-toolchain/1.0/maven-toolchain-1.0.pom
1/3K
2/3K
3/3K
3K downloaded
Downloading: http://repo1.maven.org/maven2/org/apache/maven/surefire/surefire-booter/2.4.3/surefire-booter-2.4.3.jar
1/261K
2/261K
4/261K
5/261K
8/261K
9/261K
11/261K
12/261K
13/261K
15/261K
16/261K
18/261K
19/261K
20/261K
22/261K
23/261K
25/261K
26/261K
28/261K
29/261K
30/261K
32/261K
33/261K
35/261K
36/261K
37/261K
39/261K
40/261K
42/261K
43/261K
45/261K
46/261K
47/261K
49/261K
50/261K
52/261K
53/261K
54/261K
56/261K
57/261K
59/261K
60/261K
61/261K
63/261K
66/261K
67/261K
69/261K
70/261K
71/261K
73/261K
77/261K
80/261K
81/261K
83/261K
87/261K
91/261K
95/261K
99/261K
101/261K
105/261K
109/261K
111/261K
112/261K
116/261K
120/261K
124/261K
128/261K
132/261K
134/261K
135/261K
136/261K
138/261K
139/261K
141/261K
142/261K
145/261K
146/261K
148/261K
149/261K
151/261K
152/261K
153/261K
155/261K
156/261K
158/261K
159/261K
160/261K
162/261K
163/261K
165/261K
166/261K
168/261K
169/261K
170/261K
172/261K
173/261K
175/261K
176/261K
177/261K
179/261K
180/261K
182/261K
183/261K
185/261K
186/261K
187/261K
189/261K
190/261K
192/261K
193/261K
194/261K
196/261K
197/261K
199/261K
200/261K
201/261K
203/261K
204/261K
206/261K
207/261K
209/261K
210/261K
211/261K
213/261K
214/261K
216/261K
217/261K
218/261K
220/261K
221/261K
223/261K
224/261K
226/261K
227/261K
228/261K
230/261K
231/261K
233/261K
234/261K
235/261K
238/261K
240/261K
241/261K
242/261K
244/261K
247/261K
248/261K
250/261K
251/261K
252/261K
254/261K
255/261K
257/261K
258/261K
259/261K
261/261K
261/261K
261K downloaded
Downloading: http://repo1.maven.org/maven2/org/apache/maven/surefire/surefire-api/2.4.3/surefire-api-2.4.3.jar
1/503K
2/503K
4/503K
5/503K
6/503K
8/503K
9/503K
12/503K
16/503K
16/503K
19/503K
20/503K
22/503K
23/503K
25/503K
28/503K
29/503K
30/503K
32/503K
33/503K
35/503K
36/503K
37/503K
39/503K
40/503K
42/503K
43/503K
45/503K
46/503K
47/503K
49/503K
50/503K
52/503K
53/503K
54/503K
56/503K
57/503K
59/503K
60/503K
61/503K
63/503K
64/503K
66/503K
67/503K
69/503K
70/503K
71/503K
73/503K
74/503K
76/503K
77/503K
78/503K
80/503K
81/503K
83/503K
87/503K
91/503K
95/503K
99/503K
103/503K
107/503K
111/503K
115/503K
119/503K
123/503K
127/503K
131/503K
135/503K
136/503K
138/503K
139/503K
141/503K
142/503K
144/503K
145/503K
146/503K
148/503K
149/503K
151/503K
153/503K
155/503K
156/503K
158/503K
159/503K
160/503K
162/503K
166/503K
170/503K
174/503K
178/503K
179/503K
180/503K
182/503K
183/503K
185/503K
186/503K
187/503K
189/503K
190/503K
192/503K
193/503K
194/503K
196/503K
197/503K
199/503K
200/503K
201/503K
203/503K
204/503K
206/503K
207/503K
209/503K
210/503K
211/503K
213/503K
214/503K
216/503K
217/503K
218/503K
220/503K
221/503K
223/503K
224/503K
226/503K
227/503K
228/503K
230/503K
231/503K
233/503K
235/503K
237/503K
238/503K
240/503K
241/503K
242/503K
244/503K
245/503K
248/503K
250/503K
251/503K
252/503K
254/503K
255/503K
257/503K
258/503K
259/503K
261/503K
262/503K
265/503K
267/503K
268/503K
269/503K
271/503K
272/503K
274/503K
275/503K
276/503K
278/503K
279/503K
281/503K
282/503K
283/503K
285/503K
286/503K
288/503K
289/503K
291/503K
292/503K
293/503K
295/503K
296/503K
298/503K
299/503K
300/503K
302/503K
303/503K
305/503K
306/503K
308/503K
309/503K
310/503K
312/503K
313/503K
315/503K
316/503K
317/503K
319/503K
320/503K
322/503K
323/503K
325/503K
326/503K
327/503K
329/503K
330/503K
332/503K
333/503K
334/503K
336/503K
337/503K
339/503K
340/503K
341/503K
343/503K
344/503K
346/503K
347/503K
349/503K
350/503K
351/503K
353/503K
354/503K
357/503K
358/503K
360/503K
361/503K
363/503K
364/503K
366/503K
367/503K
368/503K
370/503K
371/503K
373/503K
374/503K
375/503K
377/503K
378/503K
380/503K
381/503K
382/503K
384/503K
385/503K
387/503K
390/503K
391/503K
392/503K
394/503K
395/503K
397/503K
398/503K
399/503K
401/503K
402/503K
404/503K
405/503K
407/503K
408/503K
409/503K
411/503K
412/503K
414/503K
415/503K
416/503K
418/503K
419/503K
422/503K
423/503K
425/503K
426/503K
428/503K
429/503K
431/503K
432/503K
433/503K
435/503K
436/503K
438/503K
439/503K
440/503K
442/503K
443/503K
445/503K
446/503K
448/503K
449/503K
450/503K
452/503K
453/503K
455/503K
456/503K
457/503K
459/503K
460/503K
462/503K
463/503K
464/503K
466/503K
467/503K
471/503K
473/503K
477/503K
481/503K
484/503K
487/503K
491/503K
495/503K
499/503K
503/503K
503K downloaded
[INFO] [surefire:test]
Downloading: http://repo1.maven.org/maven2/org/apache/maven/surefire/surefire-junit/2.4.3/surefire-junit-2.4.3.pom
1/1K
1K downloaded
Downloading: http://repo1.maven.org/maven2/org/apache/maven/surefire/surefire-providers/2.4.3/surefire-providers-2.4.3.pom
1/1K
1K downloaded
Downloading: http://repo1.maven.org/maven2/org/apache/maven/surefire/surefire-junit/2.4.3/surefire-junit-2.4.3.jar
1/14K
2/14K
4/14K
5/14K
6/14K
8/14K
9/14K
11/14K
12/14K
13/14K
14/14K
14K downloaded
[INFO] Surefire report directory: /home/users/builder/rpm/BUILD/studio/studio-dsml-parser/target/surefire-reports

-------------------------------------------------------
 T E S T S
-------------------------------------------------------
Running org.apache.directory.studio.dsmlv2.modifyResponse.ModifyResponseTest
Tests run: 18, Failures: 0, Errors: 0, Skipped: 0, Time elapsed: 0.494 sec
Running org.apache.directory.studio.dsmlv2.searchRequest.SearchRequestTest
Tests run: 95, Failures: 0, Errors: 0, Skipped: 0, Time elapsed: 0.884 sec
Running org.apache.directory.studio.dsmlv2.authResponse.AuthResponseTest
Tests run: 18, Failures: 0, Errors: 0, Skipped: 0, Time elapsed: 0.145 sec
Running org.apache.directory.studio.dsmlv2.errorResponse.ErrorResponseTest
Tests run: 14, Failures: 0, Errors: 0, Skipped: 0, Time elapsed: 0.024 sec
Running org.apache.directory.studio.dsmlv2.batchResponse.BatchResponseTest
Tests run: 21, Failures: 0, Errors: 0, Skipped: 0, Time elapsed: 0.154 sec
Running org.apache.directory.studio.dsmlv2.addRequest.AddRequestTest
Tests run: 17, Failures: 0, Errors: 0, Skipped: 0, Time elapsed: 0.039 sec
Running org.apache.directory.studio.dsmlv2.searchResponse.searchResultReference.SearchResultReferenceTest
Tests run: 11, Failures: 0, Errors: 0, Skipped: 0, Time elapsed: 0.029 sec
Running org.apache.directory.studio.dsmlv2.modDNResponse.ModifyDNResponseTest
Tests run: 18, Failures: 0, Errors: 0, Skipped: 0, Time elapsed: 0.038 sec
Running org.apache.directory.studio.dsmlv2.searchResponse.searchResultEntry.SearchResultEntryTest
Tests run: 17, Failures: 0, Errors: 0, Skipped: 0, Time elapsed: 0.035 sec
Running org.apache.directory.studio.dsmlv2.modifyRequest.ModifyRequestTest
Tests run: 21, Failures: 0, Errors: 0, Skipped: 0, Time elapsed: 0.071 sec
Running org.apache.directory.studio.dsmlv2.authRequest.AuthRequestTest
Tests run: 10, Failures: 0, Errors: 0, Skipped: 0, Time elapsed: 0.019 sec
Running org.apache.directory.studio.dsmlv2.extendedRequest.ExtendedRequestTest
Tests run: 14, Failures: 0, Errors: 0, Skipped: 0, Time elapsed: 0.038 sec
Running org.apache.directory.studio.dsmlv2.delRequest.DelRequestTest
Tests run: 10, Failures: 0, Errors: 0, Skipped: 0, Time elapsed: 0.018 sec
Running org.apache.directory.studio.dsmlv2.modDNRequest.ModifyDNRequestTest
Tests run: 17, Failures: 0, Errors: 0, Skipped: 0, Time elapsed: 0.083 sec
Running org.apache.directory.studio.dsmlv2.compareRequest.CompareRequestTest
Tests run: 18, Failures: 0, Errors: 0, Skipped: 0, Time elapsed: 0.033 sec
Running org.apache.directory.studio.dsmlv2.addResponse.AddResponseTest
Tests run: 18, Failures: 0, Errors: 0, Skipped: 0, Time elapsed: 0.113 sec
Running org.apache.directory.studio.dsmlv2.searchResponse.searchResultDone.SearchResultDoneTest
Tests run: 18, Failures: 0, Errors: 0, Skipped: 0, Time elapsed: 0.055 sec
Running org.apache.directory.studio.dsmlv2.compareResponse.CompareResponseTest
Tests run: 18, Failures: 0, Errors: 0, Skipped: 0, Time elapsed: 0.028 sec
Running org.apache.directory.studio.dsmlv2.delResponse.DelResponseTest
Tests run: 18, Failures: 0, Errors: 0, Skipped: 0, Time elapsed: 0.029 sec
Running org.apache.directory.studio.dsmlv2.searchResponse.SearchResponseTest
Tests run: 12, Failures: 0, Errors: 0, Skipped: 0, Time elapsed: 0.08 sec
Running org.apache.directory.studio.dsmlv2.abandonRequest.AbandonRequestTest
Tests run: 10, Failures: 0, Errors: 0, Skipped: 0, Time elapsed: 0.02 sec
Running org.apache.directory.studio.dsmlv2.extendedResponse.ExtendedResponseTest
Tests run: 25, Failures: 0, Errors: 0, Skipped: 0, Time elapsed: 0.035 sec
Running org.apache.directory.studio.dsmlv2.batchRequest.BatchRequestTest
Tests run: 22, Failures: 0, Errors: 0, Skipped: 0, Time elapsed: 0.037 sec

Results :

Tests run: 460, Failures: 0, Errors: 0, Skipped: 0

[INFO] [jar:jar]
[INFO] Building jar: /home/users/builder/rpm/BUILD/studio/studio-dsml-parser/target/studio-dsml-parser-0.4.4-SNAPSHOT.jar
[INFO] [tools:verify-legal-files {execution: verify-legal-files}]
[INFO] Checking legal files in: studio-dsml-parser-0.4.4-SNAPSHOT.jar
[INFO] [install:install]
[INFO] Installing /home/users/builder/rpm/BUILD/studio/studio-dsml-parser/target/studio-dsml-parser-0.4.4-SNAPSHOT.jar to /home/users/builder/.m2/repository/org/apache/directory/studio/studio-dsml-parser/0.4.4-SNAPSHOT/studio-dsml-parser-0.4.4-SNAPSHOT.jar
[INFO] ------------------------------------------------------------------------
[INFO] Building Apache Directory Studio Jars
[INFO]    task-segment: [clean, install]
[INFO] ------------------------------------------------------------------------
[INFO] [clean:clean]
Downloading: http://repo1.maven.org/maven2/commons-io/commons-io/1.3.1/commons-io-1.3.1.pom
1/6K
4/6K
5/6K
6/6K
6K downloaded
Downloading: http://repo1.maven.org/maven2/commons-io/commons-io/1.3.1/commons-io-1.3.1.jar
1/81K
2/81K
5/81K
6/81K
8/81K
9/81K
11/81K
12/81K
13/81K
15/81K
16/81K
18/81K
19/81K
20/81K
22/81K
23/81K
25/81K
26/81K
28/81K
29/81K
30/81K
32/81K
33/81K
35/81K
36/81K
37/81K
39/81K
40/81K
42/81K
43/81K
45/81K
46/81K
47/81K
49/81K
50/81K
52/81K
53/81K
54/81K
56/81K
57/81K
59/81K
60/81K
61/81K
63/81K
64/81K
65/81K
66/81K
68/81K
69/81K
71/81K
72/81K
73/81K
75/81K
78/81K
79/81K
80/81K
81/81K
81K downloaded
[INFO] [remote-resources:process {execution: default}]
[INFO] [resources:resources]
[INFO] Using default encoding to copy filtered resources.
Downloading: http://repo1.maven.org/maven2/biz/aQute/bndlib/0.0.255/bndlib-0.0.255.pom
864/864b
864b downloaded
Downloading: http://repo1.maven.org/maven2/net/sf/kxml/kxml2/2.2.2/kxml2-2.2.2.pom
1/1K
1K downloaded
Downloading: http://repo1.maven.org/maven2/xmlpull/xmlpull/1.1.3.1/xmlpull-1.1.3.1.pom
386/386b
386b downloaded
Downloading: http://repo1.maven.org/maven2/org/apache/felix/org.osgi.core/1.0.0/org.osgi.core-1.0.0.pom
1/2K
2/2K
2K downloaded
Downloading: http://repo1.maven.org/maven2/org/apache/felix/felix/1.0.0/felix-1.0.0.pom
1/11K
2/11K
4/11K
5/11K
6/11K
8/11K
9/11K
11/11K
11/11K
11K downloaded
Downloading: http://repo1.maven.org/maven2/org/apache/felix/org.osgi.service.obr/1.0.1/org.osgi.service.obr-1.0.1.pom
1/1K
1K downloaded
Downloading: http://repo1.maven.org/maven2/org/apache/maven/maven-plugin-api/2.0.7/maven-plugin-api-2.0.7.pom
1/1K
1K downloaded
Downloading: http://repo1.maven.org/maven2/org/apache/maven/shared/maven-dependency-tree/1.1/maven-dependency-tree-1.1.pom
1/2K
2/2K
2/2K
2K downloaded
Downloading: http://repo1.maven.org/maven2/org/apache/maven/maven-project/2.0.8/maven-project-2.0.8.pom
1/2K
2/2K
2K downloaded
Downloading: http://repo1.maven.org/maven2/org/apache/maven/shared/maven-osgi/0.2.0/maven-osgi-0.2.0.pom
1/1K
1K downloaded
Downloading: http://repo1.maven.org/maven2/biz/aQute/bndlib/0.0.203/bndlib-0.0.203.pom
886/886b
886b downloaded
Downloading: http://repo1.maven.org/maven2/org/apache/maven/release/maven-release-manager/1.0-alpha-4/maven-release-manager-1.0-alpha-4.pom
1/8K
2/8K
4/8K
5/8K
8/8K
8K downloaded
Downloading: http://repo1.maven.org/maven2/org/codehaus/plexus/plexus-container-default/1.0-alpha-17/plexus-container-default-1.0-alpha-17.pom
1/1K
1K downloaded
Downloading: http://repo1.maven.org/maven2/org/codehaus/plexus/plexus-containers/1.0-alpha-17/plexus-containers-1.0-alpha-17.pom
1/1K
1/1K
1K downloaded
Downloading: http://repo1.maven.org/maven2/org/codehaus/plexus/plexus-utils/1.3/plexus-utils-1.3.pom
1/1K
1K downloaded
Downloading: http://repo1.maven.org/maven2/org/codehaus/plexus/plexus-interactivity-api/1.0-alpha-6/plexus-interactivity-api-1.0-alpha-6.pom
726/726b
726b downloaded
Downloading: http://repo1.maven.org/maven2/org/codehaus/plexus/plexus-interactivity/1.0-alpha-6/plexus-interactivity-1.0-alpha-6.pom
1/1K
1K downloaded
Downloading: http://repo1.maven.org/maven2/org/codehaus/plexus/plexus-utils/1.4/plexus-utils-1.4.pom
1/1K
1K downloaded
Downloading: http://repo1.maven.org/maven2/org/codehaus/plexus/plexus-classworlds/1.2-alpha-7/plexus-classworlds-1.2-alpha-7.pom
1/2K
2/2K
2K downloaded
Downloading: http://repo1.maven.org/maven2/org/apache/maven/scm/maven-scm-api/1.0/maven-scm-api-1.0.pom
603/603b
603b downloaded
Downloading: http://repo1.maven.org/maven2/org/apache/maven/scm/maven-scm/1.0/maven-scm-1.0.pom
1/5K
2/5K
4/5K
5/5K
5K downloaded
Downloading: http://repo1.maven.org/maven2/org/apache/maven/scm/maven-scm-manager-plexus/1.0/maven-scm-manager-plexus-1.0.pom
999/999b
999b downloaded
Downloading: http://repo1.maven.org/maven2/org/apache/maven/scm/maven-scm-managers/1.0/maven-scm-managers-1.0.pom
1/1K
1K downloaded
Downloading: http://repo1.maven.org/maven2/org/apache/maven/scm/maven-scm-provider-bazaar/1.0/maven-scm-provider-bazaar-1.0.pom
1/1K
1K downloaded
Downloading: http://repo1.maven.org/maven2/org/apache/maven/scm/maven-scm-providers/1.0/maven-scm-providers-1.0.pom
1/3K
2/3K
3/3K
3K downloaded
Downloading: http://repo1.maven.org/maven2/regexp/regexp/1.3/regexp-1.3.pom
145/145b
145b downloaded
Downloading: http://repo1.maven.org/maven2/org/apache/maven/scm/maven-scm-provider-clearcase/1.0/maven-scm-provider-clearcase-1.0.pom
1/1K
1K downloaded
Downloading: http://repo1.maven.org/maven2/org/apache/maven/scm/maven-scm-provider-cvsexe/1.0/maven-scm-provider-cvsexe-1.0.pom
1/1K
1K downloaded
Downloading: http://repo1.maven.org/maven2/org/apache/maven/scm/maven-scm-providers-cvs/1.0/maven-scm-providers-cvs-1.0.pom
1/1K
1K downloaded
Downloading: http://repo1.maven.org/maven2/org/apache/maven/scm/maven-scm-provider-cvs-commons/1.0/maven-scm-provider-cvs-commons-1.0.pom
1/1K
1K downloaded
Downloading: http://repo1.maven.org/maven2/org/apache/maven/scm/maven-scm-provider-cvsjava/1.0/maven-scm-provider-cvsjava-1.0.pom
1/1K
1K downloaded
Downloading: http://repo1.maven.org/maven2/org/netbeans/lib/cvsclient/20060125/cvsclient-20060125.pom
459/459b
459b downloaded
Downloading: http://repo1.maven.org/maven2/ch/ethz/ganymed/ganymed-ssh2/build210/ganymed-ssh2-build210.pom
710/710b
710b downloaded
Downloading: http://repo1.maven.org/maven2/org/apache/maven/scm/maven-scm-provider-hg/1.0/maven-scm-provider-hg-1.0.pom
1/1K
1K downloaded
Downloading: http://repo1.maven.org/maven2/org/apache/maven/scm/maven-scm-provider-perforce/1.0/maven-scm-provider-perforce-1.0.pom
1/1K
1K downloaded
Downloading: http://repo1.maven.org/maven2/org/apache/maven/scm/maven-scm-provider-starteam/1.0/maven-scm-provider-starteam-1.0.pom
1/1K
1K downloaded
Downloading: http://repo1.maven.org/maven2/org/apache/maven/scm/maven-scm-provider-svnexe/1.0/maven-scm-provider-svnexe-1.0.pom
1/1K
1K downloaded
Downloading: http://repo1.maven.org/maven2/org/apache/maven/scm/maven-scm-providers-svn/1.0/maven-scm-providers-svn-1.0.pom
1/1K
1K downloaded
Downloading: http://repo1.maven.org/maven2/org/apache/maven/scm/maven-scm-provider-svn-commons/1.0/maven-scm-provider-svn-commons-1.0.pom
1/1K
1K downloaded
Downloading: http://repo1.maven.org/maven2/org/apache/maven/scm/maven-scm-provider-synergy/1.0/maven-scm-provider-synergy-1.0.pom
817/817b
817b downloaded
Downloading: http://repo1.maven.org/maven2/jaxen/jaxen/1.1-beta-8/jaxen-1.1-beta-8.pom
1/6K
2/6K
4/6K
5/6K
6/6K
6K downloaded
Downloading: http://repo1.maven.org/maven2/commons-lang/commons-lang/2.4/commons-lang-2.4.pom
1/13K
2/13K
4/13K
5/13K
6/13K
8/13K
11/13K
13/13K
13K downloaded
Downloading: http://repo1.maven.org/maven2/org/apache/commons/commons-parent/9/commons-parent-9.pom
1/21K
2/21K
4/21K
5/21K
6/21K
8/21K
9/21K
11/21K
12/21K
13/21K
15/21K
16/21K
18/21K
19/21K
21/21K
21K downloaded
Downloading: http://repo1.maven.org/maven2/org/codehaus/plexus/plexus-archiver/1.0-alpha-10/plexus-archiver-1.0-alpha-10.pom
1/1K
1/1K
1K downloaded
Downloading: http://repo1.maven.org/maven2/org/codehaus/plexus/plexus-io/1.0-alpha-2/plexus-io-1.0-alpha-2.pom
1/1K
1K downloaded
Downloading: http://repo1.maven.org/maven2/org/codehaus/plexus/plexus-utils/1.5.6/plexus-utils-1.5.6.pom
1/5K
2/5K
4/5K
5/5K
5K downloaded
Downloading: http://repo1.maven.org/maven2/org/codehaus/plexus/plexus/1.0.12/plexus-1.0.12.pom
1/9K
4/9K
5/9K
6/9K
8/9K
9/9K
9K downloaded
Downloading: http://repo1.maven.org/maven2/biz/aQute/bndlib/0.0.255/bndlib-0.0.255.jar
1/156K
2/156K
4/156K
5/156K
6/156K
8/156K
9/156K
11/156K
12/156K
13/156K
15/156K
18/156K
19/156K
20/156K
22/156K
23/156K
25/156K
26/156K
28/156K
29/156K
30/156K
32/156K
36/156K
40/156K
44/156K
48/156K
52/156K
56/156K
56/156K
57/156K
59/156K
60/156K
61/156K
63/156K
64/156K
66/156K
67/156K
69/156K
70/156K
71/156K
73/156K
74/156K
76/156K
77/156K
78/156K
80/156K
81/156K
83/156K
84/156K
86/156K
87/156K
88/156K
90/156K
91/156K
93/156K
94/156K
95/156K
97/156K
98/156K
100/156K
102/156K
104/156K
105/156K
107/156K
108/156K
110/156K
111/156K
112/156K
114/156K
117/156K
121/156K
121/156K
125/156K
129/156K
133/156K
135/156K
139/156K
143/156K
147/156K
151/156K
152/156K
156/156K
156K downloaded
Downloading: http://repo1.maven.org/maven2/net/sf/kxml/kxml2/2.2.2/kxml2-2.2.2.jar
1/42K
2/42K
4/42K
5/42K
6/42K
8/42K
9/42K
13/42K
17/42K
18/42K
22/42K
26/42K
29/42K
30/42K
32/42K
33/42K
35/42K
36/42K
37/42K
39/42K
40/42K
42/42K
42/42K
42K downloaded
Downloading: http://repo1.maven.org/maven2/xmlpull/xmlpull/1.1.3.1/xmlpull-1.1.3.1.jar
1/7K
2/7K
6/7K
6/7K
7/7K
7K downloaded
Downloading: http://repo1.maven.org/maven2/org/apache/felix/org.osgi.core/1.0.0/org.osgi.core-1.0.0.jar
1/59K
2/59K
4/59K
5/59K
6/59K
8/59K
9/59K
11/59K
12/59K
13/59K
15/59K
16/59K
18/59K
19/59K
20/59K
22/59K
25/59K
26/59K
28/59K
29/59K
30/59K
32/59K
33/59K
35/59K
36/59K
37/59K
39/59K
40/59K
42/59K
43/59K
45/59K
46/59K
47/59K
49/59K
50/59K
52/59K
53/59K
54/59K
56/59K
57/59K
59/59K
59/59K
59K downloaded
Downloading: http://repo1.maven.org/maven2/org/apache/felix/org.osgi.service.obr/1.0.1/org.osgi.service.obr-1.0.1.jar
1/10K
2/10K
4/10K
5/10K
6/10K
8/10K
10/10K
10K downloaded
Downloading: http://repo1.maven.org/maven2/org/codehaus/plexus/plexus-utils/1.5.6/plexus-utils-1.5.6.jar
1/244K
4/244K
5/244K
6/244K
8/244K
9/244K
11/244K
12/244K
13/244K
15/244K
16/244K
18/244K
19/244K
20/244K
23/244K
25/244K
26/244K
28/244K
29/244K
30/244K
32/244K
35/244K
37/244K
39/244K
40/244K
42/244K
43/244K
45/244K
46/244K
47/244K
49/244K
50/244K
53/244K
54/244K
56/244K
59/244K
60/244K
61/244K
63/244K
64/244K
68/244K
72/244K
76/244K
80/244K
84/244K
88/244K
92/244K
94/244K
98/244K
102/244K
105/244K
107/244K
108/244K
110/244K
111/244K
114/244K
115/244K
118/244K
119/244K
121/244K
122/244K
124/244K
125/244K
127/244K
128/244K
129/244K
131/244K
132/244K
134/244K
135/244K
138/244K
139/244K
141/244K
145/244K
145/244K
146/244K
148/244K
149/244K
151/244K
152/244K
156/244K
156/244K
159/244K
160/244K
162/244K
163/244K
165/244K
166/244K
168/244K
170/244K
172/244K
176/244K
177/244K
179/244K
180/244K
182/244K
183/244K
185/244K
186/244K
190/244K
190/244K
192/244K
196/244K
197/244K
199/244K
200/244K
201/244K
203/244K
204/244K
206/244K
210/244K
210/244K
211/244K
214/244K
216/244K
217/244K
218/244K
220/244K
221/244K
223/244K
224/244K
228/244K
228/244K
232/244K
235/244K
239/244K
243/244K
244/244K
244K downloaded
Downloading: http://repo1.maven.org/maven2/org/codehaus/plexus/plexus-archiver/1.0-alpha-10/plexus-archiver-1.0-alpha-10.jar
1/168K
2/168K
4/168K
5/168K
6/168K
8/168K
9/168K
11/168K
12/168K
13/168K
15/168K
16/168K
18/168K
19/168K
20/168K
22/168K
23/168K
25/168K
26/168K
28/168K
29/168K
30/168K
32/168K
33/168K
35/168K
37/168K
39/168K
40/168K
42/168K
43/168K
45/168K
46/168K
47/168K
49/168K
50/168K
52/168K
53/168K
54/168K
56/168K
57/168K
59/168K
60/168K
61/168K
63/168K
64/168K
66/168K
67/168K
69/168K
70/168K
71/168K
73/168K
74/168K
76/168K
77/168K
78/168K
80/168K
81/168K
83/168K
84/168K
86/168K
87/168K
88/168K
90/168K
91/168K
93/168K
94/168K
95/168K
97/168K
98/168K
100/168K
102/168K
104/168K
105/168K
107/168K
108/168K
110/168K
111/168K
112/168K
114/168K
115/168K
117/168K
118/168K
119/168K
121/168K
122/168K
124/168K
125/168K
127/168K
128/168K
132/168K
136/168K
136/168K
138/168K
139/168K
142/168K
144/168K
145/168K
146/168K
148/168K
151/168K
152/168K
153/168K
155/168K
156/168K
158/168K
159/168K
160/168K
162/168K
163/168K
165/168K
166/168K
168/168K
168K downloaded
Downloading: http://repo1.maven.org/maven2/org/apache/maven/shared/maven-dependency-tree/1.1/maven-dependency-tree-1.1.jar
1/33K
2/33K
4/33K
5/33K
9/33K
11/33K
13/33K
16/33K
18/33K
20/33K
22/33K
23/33K
25/33K
26/33K
28/33K
29/33K
30/33K
32/33K
33/33K
33K downloaded
Downloading: http://repo1.maven.org/maven2/org/apache/maven/shared/maven-osgi/0.2.0/maven-osgi-0.2.0.jar
1/12K
2/12K
4/12K
5/12K
6/12K
8/12K
9/12K
11/12K
12/12K
12K downloaded
Downloading: http://repo1.maven.org/maven2/org/apache/maven/release/maven-release-manager/1.0-alpha-4/maven-release-manager-1.0-alpha-4.jar
1/132K
2/132K
4/132K
8/132K
8/132K
11/132K
13/132K
15/132K
16/132K
18/132K
19/132K
20/132K
22/132K
23/132K
25/132K
26/132K
28/132K
29/132K
30/132K
32/132K
33/132K
35/132K
36/132K
37/132K
39/132K
40/132K
42/132K
43/132K
45/132K
46/132K
47/132K
49/132K
50/132K
52/132K
53/132K
54/132K
56/132K
57/132K
59/132K
60/132K
63/132K
64/132K
66/132K
67/132K
69/132K
70/132K
71/132K
73/132K
74/132K
76/132K
77/132K
78/132K
80/132K
81/132K
83/132K
84/132K
86/132K
87/132K
88/132K
90/132K
91/132K
93/132K
94/132K
95/132K
97/132K
98/132K
100/132K
101/132K
102/132K
104/132K
105/132K
107/132K
110/132K
111/132K
112/132K
114/132K
115/132K
117/132K
118/132K
119/132K
121/132K
122/132K
124/132K
125/132K
127/132K
128/132K
129/132K
131/132K
132/132K
132/132K
132K downloaded
Downloading: http://repo1.maven.org/maven2/org/apache/maven/scm/maven-scm-api/1.0/maven-scm-api-1.0.jar
1/80K
2/80K
4/80K
6/80K
8/80K
9/80K
11/80K
12/80K
16/80K
19/80K
20/80K
22/80K
23/80K
25/80K
26/80K
28/80K
29/80K
30/80K
32/80K
33/80K
35/80K
36/80K
37/80K
39/80K
40/80K
42/80K
43/80K
45/80K
46/80K
47/80K
49/80K
50/80K
52/80K
53/80K
54/80K
56/80K
57/80K
59/80K
60/80K
61/80K
63/80K
64/80K
66/80K
67/80K
70/80K
71/80K
73/80K
74/80K
76/80K
77/80K
78/80K
80/80K
80K downloaded
Downloading: http://repo1.maven.org/maven2/org/apache/maven/scm/maven-scm-manager-plexus/1.0/maven-scm-manager-plexus-1.0.jar
1/9K
2/9K
5/9K
8/9K
9/9K
9K downloaded
Downloading: http://repo1.maven.org/maven2/org/apache/maven/scm/maven-scm-provider-bazaar/1.0/maven-scm-provider-bazaar-1.0.jar
2/45K
5/45K
6/45K
8/45K
9/45K
11/45K
12/45K
13/45K
15/45K
16/45K
18/45K
19/45K
20/45K
22/45K
23/45K
25/45K
26/45K
28/45K
29/45K
30/45K
32/45K
33/45K
35/45K
37/45K
39/45K
40/45K
43/45K
45/45K
45K downloaded
Downloading: http://repo1.maven.org/maven2/regexp/regexp/1.3/regexp-1.3.jar
1/24K
4/24K
5/24K
6/24K
8/24K
9/24K
11/24K
12/24K
13/24K
15/24K
16/24K
18/24K
19/24K
20/24K
22/24K
24/24K
24K downloaded
Downloading: http://repo1.maven.org/maven2/org/apache/maven/scm/maven-scm-provider-clearcase/1.0/maven-scm-provider-clearcase-1.0.jar
1/57K
2/57K
4/57K
5/57K
6/57K
8/57K
9/57K
11/57K
12/57K
13/57K
15/57K
16/57K
18/57K
19/57K
20/57K
22/57K
23/57K
25/57K
26/57K
28/57K
29/57K
30/57K
33/57K
35/57K
36/57K
37/57K
39/57K
40/57K
42/57K
43/57K
45/57K
46/57K
47/57K
49/57K
50/57K
52/57K
53/57K
54/57K
56/57K
57/57K
57K downloaded
Downloading: http://repo1.maven.org/maven2/org/apache/maven/scm/maven-scm-provider-cvsexe/1.0/maven-scm-provider-cvsexe-1.0.jar
1/24K
2/24K
4/24K
5/24K
8/24K
9/24K
11/24K
12/24K
13/24K
15/24K
16/24K
18/24K
20/24K
22/24K
23/24K
24/24K
24K downloaded
Downloading: http://repo1.maven.org/maven2/org/apache/maven/scm/maven-scm-provider-cvs-commons/1.0/maven-scm-provider-cvs-commons-1.0.jar
1/66K
4/66K
8/66K
8/66K
9/66K
11/66K
12/66K
13/66K
15/66K
16/66K
18/66K
19/66K
20/66K
22/66K
23/66K
25/66K
26/66K
28/66K
29/66K
30/66K
32/66K
33/66K
35/66K
36/66K
37/66K
39/66K
40/66K
42/66K
43/66K
45/66K
46/66K
49/66K
50/66K
52/66K
53/66K
54/66K
56/66K
57/66K
59/66K
60/66K
61/66K
63/66K
64/66K
66/66K
66/66K
66K downloaded
Downloading: http://repo1.maven.org/maven2/org/apache/maven/scm/maven-scm-provider-cvsjava/1.0/maven-scm-provider-cvsjava-1.0.jar
1/38K
2/38K
4/38K
5/38K
6/38K
10/38K
11/38K
12/38K
13/38K
16/38K
18/38K
19/38K
20/38K
22/38K
23/38K
25/38K
26/38K
28/38K
29/38K
30/38K
32/38K
33/38K
35/38K
36/38K
37/38K
38/38K
38K downloaded
Downloading: http://repo1.maven.org/maven2/org/netbeans/lib/cvsclient/20060125/cvsclient-20060125.jar
1/604K
4/604K
5/604K
8/604K
9/604K
11/604K
13/604K
16/604K
18/604K
19/604K
20/604K
22/604K
23/604K
25/604K
26/604K
28/604K
29/604K
30/604K
32/604K
33/604K
35/604K
36/604K
37/604K
39/604K
40/604K
42/604K
43/604K
45/604K
46/604K
47/604K
49/604K
50/604K
52/604K
53/604K
54/604K
56/604K
57/604K
59/604K
60/604K
61/604K
63/604K
64/604K
66/604K
67/604K
69/604K
70/604K
71/604K
73/604K
74/604K
76/604K
77/604K
78/604K
80/604K
81/604K
83/604K
84/604K
86/604K
87/604K
91/604K
95/604K
99/604K
103/604K
107/604K
111/604K
115/604K
119/604K
123/604K
127/604K
131/604K
135/604K
139/604K
143/604K
145/604K
146/604K
149/604K
151/604K
153/604K
155/604K
158/604K
159/604K
160/604K
162/604K
163/604K
165/604K
166/604K
168/604K
169/604K
170/604K
172/604K
173/604K
175/604K
176/604K
177/604K
179/604K
180/604K
182/604K
183/604K
185/604K
186/604K
187/604K
189/604K
190/604K
192/604K
193/604K
194/604K
196/604K
197/604K
199/604K
200/604K
201/604K
203/604K
204/604K
206/604K
207/604K
209/604K
210/604K
211/604K
213/604K
214/604K
216/604K
217/604K
218/604K
220/604K
221/604K
223/604K
224/604K
226/604K
227/604K
228/604K
230/604K
231/604K
235/604K
235/604K
237/604K
238/604K
240/604K
241/604K
242/604K
244/604K
245/604K
247/604K
248/604K
250/604K
251/604K
252/604K
254/604K
257/604K
258/604K
259/604K
261/604K
262/604K
264/604K
265/604K
267/604K
268/604K
269/604K
271/604K
272/604K
274/604K
275/604K
276/604K
278/604K
279/604K
281/604K
282/604K
283/604K
285/604K
286/604K
288/604K
289/604K
291/604K
292/604K
293/604K
295/604K
296/604K
298/604K
299/604K
300/604K
302/604K
303/604K
305/604K
306/604K
308/604K
309/604K
310/604K
312/604K
313/604K
316/604K
317/604K
319/604K
320/604K
322/604K
323/604K
325/604K
326/604K
329/604K
330/604K
332/604K
333/604K
334/604K
336/604K
337/604K
339/604K
340/604K
341/604K
343/604K
344/604K
346/604K
347/604K
349/604K
353/604K
357/604K
361/604K
365/604K
369/604K
373/604K
377/604K
381/604K
384/604K
387/604K
388/604K
392/604K
396/604K
397/604K
398/604K
402/604K
406/604K
407/604K
408/604K
409/604K
411/604K
412/604K
414/604K
415/604K
416/604K
418/604K
419/604K
421/604K
422/604K
423/604K
425/604K
426/604K
428/604K
429/604K
432/604K
433/604K
435/604K
436/604K
438/604K
439/604K
440/604K
442/604K
443/604K
445/604K
446/604K
448/604K
449/604K
450/604K
452/604K
453/604K
455/604K
456/604K
457/604K
459/604K
460/604K
462/604K
463/604K
464/604K
467/604K
469/604K
470/604K
473/604K
474/604K
476/604K
477/604K
479/604K
480/604K
481/604K
483/604K
484/604K
486/604K
487/604K
489/604K
490/604K
491/604K
493/604K
494/604K
496/604K
497/604K
498/604K
500/604K
501/604K
503/604K
504/604K
506/604K
507/604K
508/604K
510/604K
511/604K
513/604K
514/604K
515/604K
517/604K
518/604K
520/604K
521/604K
522/604K
524/604K
525/604K
527/604K
528/604K
530/604K
531/604K
532/604K
534/604K
535/604K
537/604K
538/604K
539/604K
541/604K
542/604K
544/604K
545/604K
547/604K
548/604K
549/604K
551/604K
552/604K
554/604K
555/604K
556/604K
558/604K
559/604K
561/604K
562/604K
563/604K
565/604K
566/604K
568/604K
569/604K
571/604K
572/604K
573/604K
575/604K
576/604K
578/604K
579/604K
580/604K
582/604K
583/604K
585/604K
586/604K
588/604K
589/604K
590/604K
592/604K
593/604K
595/604K
596/604K
597/604K
599/604K
600/604K
602/604K
603/604K
604/604K
604K downloaded
Downloading: http://repo1.maven.org/maven2/ch/ethz/ganymed/ganymed-ssh2/build210/ganymed-ssh2-build210.jar
1/239K
4/239K
5/239K
6/239K
10/239K
11/239K
12/239K
13/239K
17/239K
18/239K
19/239K
20/239K
23/239K
26/239K
28/239K
30/239K
33/239K
37/239K
41/239K
45/239K
49/239K
53/239K
57/239K
61/239K
65/239K
69/239K
73/239K
77/239K
81/239K
85/239K
89/239K
91/239K
92/239K
94/239K
95/239K
97/239K
98/239K
99/239K
101/239K
102/239K
104/239K
105/239K
106/239K
108/239K
109/239K
111/239K
114/239K
115/239K
116/239K
118/239K
119/239K
121/239K
122/239K
123/239K
125/239K
126/239K
128/239K
129/239K
130/239K
132/239K
136/239K
140/239K
144/239K
148/239K
152/239K
156/239K
160/239K
163/239K
164/239K
166/239K
170/239K
170/239K
171/239K
173/239K
174/239K
177/239K
179/239K
180/239K
181/239K
184/239K
186/239K
187/239K
188/239K
190/239K
191/239K
193/239K
194/239K
196/239K
197/239K
198/239K
200/239K
201/239K
203/239K
204/239K
205/239K
207/239K
208/239K
210/239K
211/239K
213/239K
214/239K
215/239K
217/239K
218/239K
220/239K
221/239K
222/239K
224/239K
225/239K
227/239K
228/239K
229/239K
231/239K
232/239K
234/239K
235/239K
237/239K
239/239K
239K downloaded
Downloading: http://repo1.maven.org/maven2/org/apache/maven/scm/maven-scm-provider-hg/1.0/maven-scm-provider-hg-1.0.jar
1/49K
2/49K
4/49K
5/49K
8/49K
9/49K
11/49K
12/49K
13/49K
15/49K
16/49K
18/49K
19/49K
20/49K
22/49K
23/49K
25/49K
26/49K
28/49K
29/49K
30/49K
32/49K
33/49K
35/49K
36/49K
37/49K
39/49K
40/49K
42/49K
43/49K
45/49K
46/49K
47/49K
49/49K
49/49K
49K downloaded
Downloading: http://repo1.maven.org/maven2/org/apache/maven/scm/maven-scm-provider-perforce/1.0/maven-scm-provider-perforce-1.0.jar
1/61K
2/61K
4/61K
5/61K
9/61K
9/61K
11/61K
12/61K
16/61K
16/61K
18/61K
19/61K
23/61K
23/61K
25/61K
26/61K
28/61K
29/61K
30/61K
32/61K
33/61K
35/61K
36/61K
37/61K
39/61K
40/61K
42/61K
43/61K
45/61K
46/61K
47/61K
49/61K
50/61K
52/61K
53/61K
54/61K
56/61K
57/61K
59/61K
60/61K
61/61K
61K downloaded
Downloading: http://repo1.maven.org/maven2/org/apache/maven/scm/maven-scm-provider-starteam/1.0/maven-scm-provider-starteam-1.0.jar
1/67K
4/67K
5/67K
6/67K
8/67K
9/67K
11/67K
12/67K
13/67K
15/67K
19/67K
20/67K
23/67K
27/67K
31/67K
35/67K
39/67K
43/67K
47/67K
51/67K
55/67K
57/67K
59/67K
60/67K
61/67K
63/67K
64/67K
66/67K
67/67K
67K downloaded
Downloading: http://repo1.maven.org/maven2/org/apache/maven/scm/maven-scm-provider-svnexe/1.0/maven-scm-provider-svnexe-1.0.jar
1/56K
4/56K
5/56K
6/56K
8/56K
9/56K
11/56K
12/56K
13/56K
15/56K
16/56K
18/56K
19/56K
20/56K
22/56K
23/56K
25/56K
26/56K
28/56K
29/56K
30/56K
32/56K
33/56K
35/56K
36/56K
37/56K
39/56K
40/56K
42/56K
43/56K
45/56K
46/56K
47/56K
49/56K
50/56K
52/56K
53/56K
54/56K
56/56K
56K downloaded
Downloading: http://repo1.maven.org/maven2/org/apache/maven/scm/maven-scm-provider-svn-commons/1.0/maven-scm-provider-svn-commons-1.0.jar
1/35K
2/35K
4/35K
5/35K
6/35K
8/35K
9/35K
11/35K
12/35K
13/35K
15/35K
16/35K
18/35K
19/35K
20/35K
22/35K
23/35K
25/35K
26/35K
28/35K
29/35K
30/35K
32/35K
33/35K
35/35K
35K downloaded
Downloading: http://repo1.maven.org/maven2/org/apache/maven/scm/maven-scm-provider-synergy/1.0/maven-scm-provider-synergy-1.0.jar
1/48K
4/48K
5/48K
6/48K
8/48K
9/48K
11/48K
12/48K
13/48K
15/48K
16/48K
18/48K
19/48K
20/48K
23/48K
25/48K
26/48K
28/48K
29/48K
30/48K
32/48K
33/48K
35/48K
36/48K
37/48K
39/48K
40/48K
42/48K
43/48K
45/48K
46/48K
47/48K
48/48K
48K downloaded
Downloading: http://repo1.maven.org/maven2/jaxen/jaxen/1.1-beta-8/jaxen-1.1-beta-8.jar
1/226K
4/226K
8/226K
9/226K
11/226K
13/226K
15/226K
16/226K
20/226K
22/226K
23/226K
27/226K
31/226K
35/226K
39/226K
43/226K
47/226K
51/226K
55/226K
59/226K
63/226K
64/226K
66/226K
67/226K
69/226K
70/226K
71/226K
73/226K
74/226K
76/226K
77/226K
78/226K
80/226K
83/226K
84/226K
86/226K
87/226K
88/226K
90/226K
91/226K
94/226K
95/226K
97/226K
98/226K
100/226K
101/226K
102/226K
104/226K
105/226K
107/226K
108/226K
110/226K
111/226K
112/226K
114/226K
115/226K
117/226K
118/226K
119/226K
121/226K
122/226K
124/226K
125/226K
127/226K
128/226K
129/226K
131/226K
132/226K
134/226K
135/226K
138/226K
139/226K
141/226K
142/226K
144/226K
145/226K
146/226K
148/226K
149/226K
151/226K
152/226K
153/226K
155/226K
156/226K
158/226K
159/226K
160/226K
162/226K
163/226K
165/226K
166/226K
168/226K
169/226K
170/226K
172/226K
173/226K
175/226K
176/226K
177/226K
179/226K
180/226K
182/226K
183/226K
185/226K
186/226K
187/226K
189/226K
190/226K
192/226K
193/226K
194/226K
196/226K
197/226K
199/226K
200/226K
201/226K
203/226K
204/226K
206/226K
207/226K
209/226K
210/226K
211/226K
213/226K
214/226K
216/226K
217/226K
218/226K
220/226K
221/226K
223/226K
224/226K
226/226K
226/226K
226K downloaded
Downloading: http://repo1.maven.org/maven2/commons-lang/commons-lang/2.4/commons-lang-2.4.jar
1/255K
2/255K
4/255K
5/255K
9/255K
9/255K
12/255K
16/255K
18/255K
22/255K
22/255K
23/255K
25/255K
26/255K
28/255K
29/255K
30/255K
32/255K
33/255K
35/255K
36/255K
37/255K
39/255K
40/255K
42/255K
43/255K
45/255K
46/255K
47/255K
49/255K
50/255K
52/255K
53/255K
56/255K
57/255K
59/255K
60/255K
61/255K
63/255K
64/255K
66/255K
67/255K
69/255K
70/255K
71/255K
73/255K
74/255K
76/255K
77/255K
78/255K
80/255K
81/255K
83/255K
84/255K
86/255K
87/255K
88/255K
90/255K
91/255K
93/255K
94/255K
95/255K
97/255K
98/255K
100/255K
101/255K
102/255K
104/255K
105/255K
107/255K
108/255K
110/255K
111/255K
112/255K
114/255K
115/255K
117/255K
118/255K
119/255K
121/255K
122/255K
124/255K
125/255K
127/255K
128/255K
129/255K
131/255K
132/255K
134/255K
135/255K
136/255K
138/255K
139/255K
141/255K
142/255K
144/255K
145/255K
146/255K
148/255K
149/255K
151/255K
152/255K
153/255K
155/255K
156/255K
158/255K
159/255K
160/255K
162/255K
163/255K
165/255K
168/255K
169/255K
170/255K
172/255K
173/255K
175/255K
177/255K
179/255K
180/255K
182/255K
183/255K
185/255K
186/255K
187/255K
189/255K
190/255K
192/255K
193/255K
194/255K
196/255K
197/255K
199/255K
200/255K
201/255K
203/255K
204/255K
206/255K
207/255K
209/255K
210/255K
211/255K
213/255K
214/255K
216/255K
217/255K
218/255K
220/255K
221/255K
223/255K
224/255K
226/255K
227/255K
228/255K
230/255K
231/255K
233/255K
234/255K
235/255K
237/255K
238/255K
240/255K
241/255K
242/255K
244/255K
245/255K
247/255K
248/255K
250/255K
251/255K
252/255K
254/255K
255/255K
255K downloaded
Downloading: http://repo1.maven.org/maven2/org/codehaus/plexus/plexus-io/1.0-alpha-2/plexus-io-1.0-alpha-2.jar
1/30K
5/30K
9/30K
13/30K
17/30K
21/30K
25/30K
29/30K
30/30K
30K downloaded
[INFO] [studio:prepare-jar-package {execution: default}]
[INFO] Copying /home/users/builder/.m2/repository/antlr/antlr/2.7.7/antlr-2.7.7.jar to
               /home/users/builder/rpm/BUILD/studio/jars/target/classes/lib/antlr-2.7.7.jar
[INFO] Copying /home/users/builder/.m2/repository/commons-codec/commons-codec/1.3/commons-codec-1.3.jar to
               /home/users/builder/rpm/BUILD/studio/jars/target/classes/lib/commons-codec-1.3.jar
[INFO] Copying /home/users/builder/.m2/repository/commons-collections/commons-collections/3.2/commons-collections-3.2.jar to
               /home/users/builder/rpm/BUILD/studio/jars/target/classes/lib/commons-collections-3.2.jar
[INFO] Copying /home/users/builder/.m2/repository/commons-io/commons-io/1.3.1/commons-io-1.3.1.jar to
               /home/users/builder/rpm/BUILD/studio/jars/target/classes/lib/commons-io-1.3.1.jar
[INFO] Copying /home/users/builder/.m2/repository/commons-lang/commons-lang/2.3/commons-lang-2.3.jar to
               /home/users/builder/rpm/BUILD/studio/jars/target/classes/lib/commons-lang-2.3.jar
[INFO] Copying /home/users/builder/.m2/repository/dom4j/dom4j/1.6.1/dom4j-1.6.1.jar to
               /home/users/builder/rpm/BUILD/studio/jars/target/classes/lib/dom4j-1.6.1.jar
[INFO] Copying /home/users/builder/.m2/repository/org/slf4j/nlog4j/1.2.25/nlog4j-1.2.25.jar to
               /home/users/builder/rpm/BUILD/studio/jars/target/classes/lib/nlog4j-1.2.25.jar
[INFO] Copying /home/users/builder/.m2/repository/org/apache/directory/shared/shared-asn1/0.9.14-SNAPSHOT/shared-asn1-0.9.14-SNAPSHOT.jar to
               /home/users/builder/rpm/BUILD/studio/jars/target/classes/lib/shared-asn1-0.9.14-SNAPSHOT.jar
[INFO] Copying /home/users/builder/.m2/repository/org/apache/directory/shared/shared-ldap/0.9.14-SNAPSHOT/shared-ldap-0.9.14-SNAPSHOT.jar to
               /home/users/builder/rpm/BUILD/studio/jars/target/classes/lib/shared-ldap-0.9.14-SNAPSHOT.jar
[INFO] Copying /home/users/builder/.m2/repository/org/apache/directory/shared/shared-ldap-constants/0.9.14-SNAPSHOT/shared-ldap-constants-0.9.14-SNAPSHOT.jar to
               /home/users/builder/rpm/BUILD/studio/jars/target/classes/lib/shared-ldap-constants-0.9.14-SNAPSHOT.jar
[INFO] Copying /home/users/builder/rpm/BUILD/studio/studio-dsml-parser/target/studio-dsml-parser-0.4.4-SNAPSHOT.jar to
               /home/users/builder/rpm/BUILD/studio/jars/target/classes/lib/studio-dsml-parser-0.4.4-SNAPSHOT.jar
[INFO] Copying /home/users/builder/.m2/repository/xpp3/xpp3/1.1.3.4.O/xpp3-1.1.3.4.O.jar to
               /home/users/builder/rpm/BUILD/studio/jars/target/classes/lib/xpp3-1.1.3.4.O.jar
[INFO] [compiler:compile]
[INFO] Nothing to compile - all classes are up to date
[INFO] [bundle:manifest {execution: default}]
[INFO] [resources:testResources]
[INFO] Using default encoding to copy filtered resources.
[INFO] [compiler:testCompile]
[INFO] Nothing to compile - all classes are up to date
[INFO] [surefire:test]
[INFO] Tests are skipped.
[INFO] [jar:jar]
[INFO] Building jar: /home/users/builder/rpm/BUILD/studio/jars/target/jars-1.4.0-SNAPSHOT.jar
[INFO] [tools:verify-legal-files {execution: verify-legal-files}]
[INFO] Checking legal files in: jars-1.4.0-SNAPSHOT.jar
[INFO] [install:install]
[INFO] Installing /home/users/builder/rpm/BUILD/studio/jars/target/jars-1.4.0-SNAPSHOT.jar to /home/users/builder/.m2/repository/org/apache/directory/studio/jars/1.4.0-SNAPSHOT/jars-1.4.0-SNAPSHOT.jar
[INFO] ------------------------------------------------------------------------
[INFO] Building Apache Directory Studio LDIF Parser
[INFO]    task-segment: [clean, install]
[INFO] ------------------------------------------------------------------------
[INFO] [clean:clean]
[INFO] [remote-resources:process {execution: default}]
[INFO] [resources:resources]
[INFO] Using default encoding to copy filtered resources.
[INFO] [studio:prepare-jar-package {execution: default}]
[INFO] [compiler:compile]
[INFO] Compiling 41 source files to /home/users/builder/rpm/BUILD/studio/ldif-parser/target/classes
[INFO] [bundle:manifest {execution: generate-manifest}]
[WARNING] Warning in manifest for org.apache.directory.studio:ldifparser:jar:1.4.0-SNAPSHOT : Did not find matching referal for !
[INFO] [resources:testResources]
[INFO] Using default encoding to copy filtered resources.
[INFO] [compiler:testCompile]
[INFO] Compiling 3 source files to /home/users/builder/rpm/BUILD/studio/ldif-parser/target/test-classes
[INFO] [surefire:test]
[INFO] Surefire report directory: /home/users/builder/rpm/BUILD/studio/ldif-parser/target/surefire-reports

-------------------------------------------------------
 T E S T S
-------------------------------------------------------
Running org.apache.directory.studio.ldifparser.model.lines.LdifDnLineTest
Tests run: 5, Failures: 0, Errors: 0, Skipped: 0, Time elapsed: 0.048 sec
Running org.apache.directory.studio.ldifparser.model.lines.LdifAttrValLineTest
Tests run: 5, Failures: 0, Errors: 0, Skipped: 0, Time elapsed: 0.074 sec
Running org.apache.directory.studio.ldifparser.parser.LdifParserTest
Tests run: 1, Failures: 0, Errors: 0, Skipped: 0, Time elapsed: 0.045 sec

Results :

Tests run: 11, Failures: 0, Errors: 0, Skipped: 0

[INFO] [jar:jar]
[INFO] Building jar: /home/users/builder/rpm/BUILD/studio/ldif-parser/target/ldifparser-1.4.0-SNAPSHOT.jar
[INFO] [tools:verify-legal-files {execution: verify-legal-files}]
[INFO] Checking legal files in: ldifparser-1.4.0-SNAPSHOT.jar
[INFO] [install:install]
[INFO] Installing /home/users/builder/rpm/BUILD/studio/ldif-parser/target/ldifparser-1.4.0-SNAPSHOT.jar to /home/users/builder/.m2/repository/org/apache/directory/studio/ldifparser/1.4.0-SNAPSHOT/ldifparser-1.4.0-SNAPSHOT.jar
[INFO] ------------------------------------------------------------------------
[INFO] Building Apache Directory Studio Connection Core
[INFO]    task-segment: [clean, install]
[INFO] ------------------------------------------------------------------------
[INFO] [clean:clean]
[INFO] [remote-resources:process {execution: default}]
[INFO] [resources:resources]
[INFO] Using default encoding to copy filtered resources.
[INFO] [studio:prepare-jar-package {execution: default}]
[INFO] [compiler:compile]
[INFO] Compiling 43 source files to /home/users/builder/rpm/BUILD/studio/connection-core/target/classes
[INFO] ------------------------------------------------------------------------
[ERROR] BUILD FAILURE
[INFO] ------------------------------------------------------------------------
[INFO] Compilation failure
Failure executing javac, but could not parse the error:


The system is out of resources.
Consult the following stack trace for details.
java.lang.OutOfMemoryError: Java heap space
	at com.sun.tools.javac.zip.ZipFileIndex$ZipDirectory.buildIndex(ZipFileIndex.java:713)
	at com.sun.tools.javac.zip.ZipFileIndex$ZipDirectory.access$000(ZipFileIndex.java:652)
	at com.sun.tools.javac.zip.ZipFileIndex.checkIndex(ZipFileIndex.java:261)
	at com.sun.tools.javac.zip.ZipFileIndex.<init>(ZipFileIndex.java:209)
	at com.sun.tools.javac.zip.ZipFileIndex.getZipFileIndex(ZipFileIndex.java:115)
	at com.sun.tools.javac.util.DefaultFileManager.openArchive(DefaultFileManager.java:645)
	at com.sun.tools.javac.util.DefaultFileManager.listDirectory(DefaultFileManager.java:325)
	at com.sun.tools.javac.util.DefaultFileManager.list(DefaultFileManager.java:872)
	at com.sun.tools.javac.jvm.ClassReader.fillIn(ClassReader.java:2077)
	at com.sun.tools.javac.jvm.ClassReader.complete(ClassReader.java:1781)
	at com.sun.tools.javac.code.Symbol.complete(Symbol.java:386)
	at com.sun.tools.javac.comp.Enter.visitTopLevel(Enter.java:272)
	at com.sun.tools.javac.tree.JCTree$JCCompilationUnit.accept(JCTree.java:446)
	at com.sun.tools.javac.comp.Enter.classEnter(Enter.java:236)
	at com.sun.tools.javac.comp.Enter.classEnter(Enter.java:250)
	at com.sun.tools.javac.comp.Enter.complete(Enter.java:444)
	at com.sun.tools.javac.comp.Enter.main(Enter.java:429)
	at com.sun.tools.javac.main.JavaCompiler.enterTrees(JavaCompiler.java:819)
	at com.sun.tools.javac.main.JavaCompiler.compile(JavaCompiler.java:727)
	at com.sun.tools.javac.main.Main.compile(Main.java:353)
	at com.sun.tools.javac.main.Main.compile(Main.java:279)
	at com.sun.tools.javac.main.Main.compile(Main.java:270)
	at com.sun.tools.javac.Main.compile(Main.java:87)
	at sun.reflect.NativeMethodAccessorImpl.invoke0(Native Method)
	at sun.reflect.NativeMethodAccessorImpl.invoke(NativeMethodAccessorImpl.java:39)
	at sun.reflect.DelegatingMethodAccessorImpl.invoke(DelegatingMethodAccessorImpl.java:25)
	at java.lang.reflect.Method.invoke(Method.java:597)
	at org.codehaus.plexus.compiler.javac.JavacCompiler.compileInProcess(JavacCompiler.java:420)
	at org.codehaus.plexus.compiler.javac.JavacCompiler.compile(JavacCompiler.java:141)
	at org.apache.maven.plugin.AbstractCompilerMojo.execute(AbstractCompilerMojo.java:493)
	at org.apache.maven.plugin.CompilerMojo.execute(CompilerMojo.java:114)
	at org.apache.maven.plugin.DefaultPluginManager.executeMojo(DefaultPluginManager.java:451)



Failure executing javac, but could not parse the error:


The system is out of resources.
Consult the following stack trace for details.
java.lang.OutOfMemoryError: Java heap space
	at com.sun.tools.javac.zip.ZipFileIndex$ZipDirectory.buildIndex(ZipFileIndex.java:713)
	at com.sun.tools.javac.zip.ZipFileIndex$ZipDirectory.access$000(ZipFileIndex.java:652)
	at com.sun.tools.javac.zip.ZipFileIndex.checkIndex(ZipFileIndex.java:261)
	at com.sun.tools.javac.zip.ZipFileIndex.<init>(ZipFileIndex.java:209)
	at com.sun.tools.javac.zip.ZipFileIndex.getZipFileIndex(ZipFileIndex.java:115)
	at com.sun.tools.javac.util.DefaultFileManager.openArchive(DefaultFileManager.java:645)
	at com.sun.tools.javac.util.DefaultFileManager.listDirectory(DefaultFileManager.java:325)
	at com.sun.tools.javac.util.DefaultFileManager.list(DefaultFileManager.java:872)
	at com.sun.tools.javac.jvm.ClassReader.fillIn(ClassReader.java:2077)
	at com.sun.tools.javac.jvm.ClassReader.complete(ClassReader.java:1781)
	at com.sun.tools.javac.code.Symbol.complete(Symbol.java:386)
	at com.sun.tools.javac.comp.Enter.visitTopLevel(Enter.java:272)
	at com.sun.tools.javac.tree.JCTree$JCCompilationUnit.accept(JCTree.java:446)
	at com.sun.tools.javac.comp.Enter.classEnter(Enter.java:236)
	at com.sun.tools.javac.comp.Enter.classEnter(Enter.java:250)
	at com.sun.tools.javac.comp.Enter.complete(Enter.java:444)
	at com.sun.tools.javac.comp.Enter.main(Enter.java:429)
	at com.sun.tools.javac.main.JavaCompiler.enterTrees(JavaCompiler.java:819)
	at com.sun.tools.javac.main.JavaCompiler.compile(JavaCompiler.java:727)
	at com.sun.tools.javac.main.Main.compile(Main.java:353)
	at com.sun.tools.javac.main.Main.compile(Main.java:279)
	at com.sun.tools.javac.main.Main.compile(Main.java:270)
	at com.sun.tools.javac.Main.compile(Main.java:87)
	at sun.reflect.NativeMethodAccessorImpl.invoke0(Native Method)
	at sun.reflect.NativeMethodAccessorImpl.invoke(NativeMethodAccessorImpl.java:39)
	at sun.reflect.DelegatingMethodAccessorImpl.invoke(DelegatingMethodAccessorImpl.java:25)
	at java.lang.reflect.Method.invoke(Method.java:597)
	at org.codehaus.plexus.compiler.javac.JavacCompiler.compileInProcess(JavacCompiler.java:420)
	at org.codehaus.plexus.compiler.javac.JavacCompiler.compile(JavacCompiler.java:141)
	at org.apache.maven.plugin.AbstractCompilerMojo.execute(AbstractCompilerMojo.java:493)
	at org.apache.maven.plugin.CompilerMojo.execute(CompilerMojo.java:114)
	at org.apache.maven.plugin.DefaultPluginManager.executeMojo(DefaultPluginManager.java:451)


[INFO] ------------------------------------------------------------------------
[INFO] For more information, run Maven with the -e switch
[INFO] ------------------------------------------------------------------------
[INFO] Total time: 2 minutes 59 seconds
[INFO] Finished at: Fri Feb 20 10:29:59 CET 2009
[INFO] Final Memory: 78M/81M
[INFO] ------------------------------------------------------------------------
error: Bad exit status from /tmp/B.e214dd/rpm-tmp.67235 (%build)


RPM build errors:
    Bad exit status from /tmp/B.e214dd/rpm-tmp.67235 (%build)
error: No files produced.
Begin-PLD-Builder-Info
Build-Time: user:139.41s sys:10.19s real:1274.95s (faults io:353 non-io:747378)

End-PLD-Builder-Info
[Back to list of logs] [View rpm -qa of builder]