FailedOk

th/SRPMS[OK]
th/x32[OK]
th/i686[OK]
th/x86_64[OK]

ac/SRPMS[OK]
ac/i386[OK]
ac/i586[OK]
ac/i686[OK]
ac/alpha[OK]
ac/amd64[OK]
ac/athlon[OK]
ac/ppc[OK]
ac/sparc[OK]
ac/sparc64[OK]

Advanced Search
main()
Powered by PLD Linux
(c) 2002-2024 PLD Team
$Revision: 1.37 $
Powered by Dark Side of the Force.
Your IP: 3.236.112.70

VirtualBox 965ba0a2-ff26-4493-876e-52110d65aaab

Status:Failed
Source URL:https://buildlogs.pld-linux.org/pld/th/x86_64/FAIL/VirtualBox,965ba0a2-ff26-4493-876e-52110d65aaab.bz2
text/plain URL:View!
rpm -qa of builder:View!
Date:2024/05/24 22:42:41
Runtime:0:00:50.182279

Toc:

  • prep
  • Executing(%prep): /bin/sh -e /tmp/B.e3vtk6dg/BUILD/tmp/rpm-tmp.qtBwZQ
  • build
  • Executing(%build): /bin/sh -e /tmp/B.e3vtk6dg/BUILD/tmp/rpm-tmp.97Y43s
  • error 1
  • cc1: error: incompatible gcc/plugin versions
  • error 2
  • cc1: error: failed to initialize plugin ./scripts/gcc-plugins/stackleak_plugin.so
  • error 3
  • cc1: error: incompatible gcc/plugin versions
  • error 4
  • cc1: error: failed to initialize plugin ./scripts/gcc-plugins/randomize_layout_plugin.so
  • error 5
  • make[2]: *** [scripts/Makefile.build:244: /tmp/B.e3vtk6dg/BUILD/VirtualBox-7.0.18/kernel/HostDrivers/vboxdrv/linux/SUPDrv-linux.o] Error 1
  • error 6
  • cc1: error: incompatible gcc/plugin versions
  • error 7
  • cc1: error: failed to initialize plugin ./scripts/gcc-plugins/stackleak_plugin.so
  • error 8
  • cc1: error: incompatible gcc/plugin versions
  • error 9
  • cc1: error: failed to initialize plugin ./scripts/gcc-plugins/randomize_layout_plugin.so
  • error 10
  • make[2]: *** [scripts/Makefile.build:244: /tmp/B.e3vtk6dg/BUILD/VirtualBox-7.0.18/kernel/HostDrivers/vboxdrv/SUPDrvGip.o] Error 1
  • error 11
  • cc1: error: incompatible gcc/plugin versions
  • error 12
  • cc1: error: failed to initialize plugin ./scripts/gcc-plugins/stackleak_plugin.so
  • error 13
  • cc1: error: incompatible gcc/plugin versions
  • error 14
  • cc1: error: failed to initialize plugin ./scripts/gcc-plugins/randomize_layout_plugin.so
  • error 15
  • make[2]: *** [scripts/Makefile.build:244: /tmp/B.e3vtk6dg/BUILD/VirtualBox-7.0.18/kernel/HostDrivers/vboxdrv/SUPDrv.o] Error 1
  • error 16
  • cc1: error: incompatible gcc/plugin versions
  • error 17
  • cc1: error: failed to initialize plugin ./scripts/gcc-plugins/stackleak_plugin.so
  • error 18
  • cc1: error: incompatible gcc/plugin versions
  • error 19
  • cc1: error: failed to initialize plugin ./scripts/gcc-plugins/randomize_layout_plugin.so
  • error 20
  • make[2]: *** [scripts/Makefile.build:244: /tmp/B.e3vtk6dg/BUILD/VirtualBox-7.0.18/kernel/HostDrivers/vboxdrv/SUPDrvSem.o] Error 1
  • error 21
  • cc1: error: incompatible gcc/plugin versions
  • error 22
  • cc1: error: failed to initialize plugin ./scripts/gcc-plugins/stackleak_plugin.so
  • error 23
  • cc1: error: incompatible gcc/plugin versions
  • error 24
  • cc1: error: failed to initialize plugin ./scripts/gcc-plugins/randomize_layout_plugin.so
  • error 25
  • make[2]: *** [scripts/Makefile.build:244: /tmp/B.e3vtk6dg/BUILD/VirtualBox-7.0.18/kernel/HostDrivers/vboxdrv/SUPDrvTracer.o] Error 1
  • error 26
  • cc1: error: incompatible gcc/plugin versions
  • error 27
  • cc1: error: failed to initialize plugin ./scripts/gcc-plugins/stackleak_plugin.so
  • error 28
  • cc1: error: incompatible gcc/plugin versions
  • error 29
  • cc1: error: failed to initialize plugin ./scripts/gcc-plugins/randomize_layout_plugin.so
  • error 30
  • make[2]: *** [scripts/Makefile.build:244: /tmp/B.e3vtk6dg/BUILD/VirtualBox-7.0.18/kernel/HostDrivers/vboxdrv/SUPLibAll.o] Error 1
  • error 31
  • make[1]: *** [/usr/src/linux-6.9.0/Makefile:1919: /tmp/B.e3vtk6dg/BUILD/VirtualBox-7.0.18/kernel/HostDrivers/vboxdrv] Error 2
  • error 32
  • error: Bad exit status from /tmp/B.e3vtk6dg/BUILD/tmp/rpm-tmp.97Y43s (%build)
  • error 33
  • RPM build errors:
  • error 34
  • error: No files produced.

Content:

request from: baggins
checking if we should skip the build
started at: Fri May 24 22:40:55 2024
killing old processes on a builder
sending signal 9 to pid -1
cleaning up /tmp
fetching https://srcbuilder.pld-linux.org/th//srpms/965ba0a2-ff26-4493-876e-52110d65aaab/VirtualBox-kernel-7.0.18-1%406.9.0_1.src.rpm
fetched 212356360 bytes, 19086.7 K/s
installing srpm: VirtualBox-kernel-7.0.18-1@6.9.0_1.src.rpm
+ install -d /tmp/B.e3vtk6dg/BUILD /tmp/B.e3vtk6dg/RPMS
+ LC_ALL=en_US.UTF-8
+ rpm -qp --changelog VirtualBox-kernel-7.0.18-1@6.9.0_1.src.rpm
* Fri May 24 2024 PLD Linux Team <feedback@pld-linux.org>
- For complete changelog see: http://git.pld-linux.org/?p=packages/VirtualBox.git;a=log;h=master
* Fri May 24 2024 Jan Rękorajski <baggins@pld-linux.org> 9b23ebe
- up to 7.0.18 * Tue Apr 16 2024 Jakub Bogusz <qboosh@pld-linux.org> 479657d
- rel 2 (libvpx 1.14) * Sun Dec 24 2023 Jan Rękorajski <baggins@pld-linux.org> a4c810d
- up to 7.0.12 * Sun Oct 01 2023 Jan Palus <atler@pld-linux.org> ec5bd26
- libvpx 1.13.x rebuild * Fri Sep 08 2023 Jan Rękorajski <baggins@pld-linux.org> 7717f26
- build full python 3 api, not the limited one, rel 2 * Thu Sep 07 2023 Jan Rękorajski <baggins@pld-linux.org> 058bd73
- try harder to build with python3 * Thu Sep 07 2023 Jan Rękorajski <baggins@pld-linux.org> b9427a4
- rel 1 * Thu Sep 07 2023 Jan Rękorajski <baggins@pld-linux.org> 0c8089b
- =- updated deps and files * Thu Sep 07 2023 Jan Rękorajski <baggins@pld-linux.org> 406ba9c
- fix build on i686 * Wed Sep 06 2023 Jan Rękorajski <baggins@pld-linux.org> ef33541
- up to 7.0.10, switch to python 3 * Fri Aug 18 2023 Łukasz Maśko <lmasko@pld-linux.org> d5cde46
- A patch against kernels 6.4.10 and newer. Probably to be removed in the next version (if will exist). * Mon Jul 24 2023 Łukasz Maśko <lmasko@pld-linux.org> c7e9c3b
- Removed patch 12. * Mon Jul 24 2023 Łukasz Maśko <lmasko@pld-linux.org> 254afb1
- Up to 6.1.46. * Fri May 05 2023 Łukasz Maśko <lmasko@pld-linux.org> d73f6bc
- Up to 6.1.44, the latest from the 6.1 branch (6.1.40 doesn't build on 6.3.x kernels). * Fri Oct 14 2022 Jan Rękorajski <baggins@pld-linux.org> 6929594
- up to 6.1.40 * Thu May 26 2022 Jan Rękorajski <baggins@pld-linux.org> ea66265
- rel 1 * Thu May 26 2022 Jan Rękorajski <baggins@pld-linux.org> 8c2ca99
- fix building kernel modules for 5.18 * Wed May 25 2022 Jan Rękorajski <baggins@pld-linux.org> f9b01c8
- up to 6.1.34 * Sun May 01 2022 Jan Rękorajski <baggins@pld-linux.org> 99b517a
- Release 3 (by relup.sh) * Thu Feb 10 2022 Jan Rękorajski <baggins@pld-linux.org> 8346b51
- Release 2 (by relup.sh) + rpm -Uhv --nodeps --define '_topdir /tmp/B.e3vtk6dg' --define '_specdir %{_topdir}' --define '_sourcedir %{_specdir}' --define '_rpmdir %{_topdir}/RPMS' --define '_builddir %{_topdir}/BUILD' --without userspace --define 'build_kernels head,6.1,5.15,5.10,5.4,4.19' VirtualBox-kernel-7.0.18-1@6.9.0_1.src.rpm Updating / installing... VirtualBox-kernel-7.0.18-1@6.9.0_1 ######################################## + rm -f VirtualBox-kernel-7.0.18-1@6.9.0_1.src.rpm + install -m 700 -d /tmp/B.e3vtk6dg/BUILD/tmp + TMPDIR=/tmp/B.e3vtk6dg/BUILD/tmp + exec nice -n 0 rpmbuild -bp --short-circuit --nodeps --define '_topdir /tmp/B.e3vtk6dg' --define '_specdir %{_topdir}' --define '_sourcedir %{_specdir}' --define '_rpmdir %{_topdir}/RPMS' --define '_builddir %{_topdir}/BUILD' --without userspace --target x86_64-pld-linux --define 'build_kernels head,6.1,5.15,5.10,5.4,4.19' --define 'prep exit 0' /tmp/B.e3vtk6dg/VirtualBox.spec warning: line 542: It's not recommended to have unversioned Obsoletes: Obsoletes: kernel-init-guest warning: line 542: It's not recommended to have unversioned Obsoletes: Obsoletes: kernel-init-host warning: line 542: It's not recommended to have unversioned Obsoletes: Obsoletes: kernel-init-guest warning: line 542: It's not recommended to have unversioned Obsoletes: Obsoletes: kernel-init-host warning: line 542: It's not recommended to have unversioned Obsoletes: Obsoletes: kernel-init-guest warning: line 542: It's not recommended to have unversioned Obsoletes: Obsoletes: kernel-init-host warning: line 542: It's not recommended to have unversioned Obsoletes: Obsoletes: kernel-init-guest warning: line 542: It's not recommended to have unversioned Obsoletes: Obsoletes: kernel-init-host warning: line 542: It's not recommended to have unversioned Obsoletes: Obsoletes: kernel-init-guest warning: line 542: It's not recommended to have unversioned Obsoletes: Obsoletes: kernel-init-host warning: line 542: It's not recommended to have unversioned Obsoletes: Obsoletes: kernel-init-guest warning: line 542: It's not recommended to have unversioned Obsoletes: Obsoletes: kernel-init-host warning: Could not canonicalize hostname: ymir Building target platforms: x86_64-pld-linux Building for target x86_64-pld-linux RPM build warnings: line 542: It's not recommended to have unversioned Obsoletes: Obsoletes: kernel-init-guest line 542: It's not recommended to have unversioned Obsoletes: Obsoletes: kernel-init-host line 542: It's not recommended to have unversioned Obsoletes: Obsoletes: kernel-init-guest line 542: It's not recommended to have unversioned Obsoletes: Obsoletes: kernel-init-host line 542: It's not recommended to have unversioned Obsoletes: Obsoletes: kernel-init-guest line 542: It's not recommended to have unversioned Obsoletes: Obsoletes: kernel-init-host line 542: It's not recommended to have unversioned Obsoletes: Obsoletes: kernel-init-guest line 542: It's not recommended to have unversioned Obsoletes: Obsoletes: kernel-init-host line 542: It's not recommended to have unversioned Obsoletes: Obsoletes: kernel-init-guest line 542: It's not recommended to have unversioned Obsoletes: Obsoletes: kernel-init-host line 542: It's not recommended to have unversioned Obsoletes: Obsoletes: kernel-init-guest line 542: It's not recommended to have unversioned Obsoletes: Obsoletes: kernel-init-host Could not canonicalize hostname: ymir checking BuildConflict-ing packages rpm: warning: line 542: It's not recommended to have unversioned Obsoletes: Obsoletes: kernel-init-guest rpm: warning: line 542: It's not recommended to have unversioned Obsoletes: Obsoletes: kernel-init-host rpm: warning: line 542: It's not recommended to have unversioned Obsoletes: Obsoletes: kernel-init-guest rpm: warning: line 542: It's not recommended to have unversioned Obsoletes: Obsoletes: kernel-init-host rpm: warning: line 542: It's not recommended to have unversioned Obsoletes: Obsoletes: kernel-init-guest rpm: warning: line 542: It's not recommended to have unversioned Obsoletes: Obsoletes: kernel-init-host rpm: warning: line 542: It's not recommended to have unversioned Obsoletes: Obsoletes: kernel-init-guest rpm: warning: line 542: It's not recommended to have unversioned Obsoletes: Obsoletes: kernel-init-host rpm: warning: line 542: It's not recommended to have unversioned Obsoletes: Obsoletes: kernel-init-guest rpm: warning: line 542: It's not recommended to have unversioned Obsoletes: Obsoletes: kernel-init-host rpm: warning: line 542: It's not recommended to have unversioned Obsoletes: Obsoletes: kernel-init-guest rpm: warning: line 542: It's not recommended to have unversioned Obsoletes: Obsoletes: kernel-init-host rpm: warning: Could not canonicalize hostname: ymir rpm: Building target platforms: x86_64-pld-linux rpm: Building for target x86_64-pld-linux rpm: rpm: RPM build warnings: rpm: line 542: It's not recommended to have unversioned Obsoletes: Obsoletes: kernel-init-guest rpm: line 542: It's not recommended to have unversioned Obsoletes: Obsoletes: kernel-init-host rpm: line 542: It's not recommended to have unversioned Obsoletes: Obsoletes: kernel-init-guest rpm: line 542: It's not recommended to have unversioned Obsoletes: Obsoletes: kernel-init-host rpm: line 542: It's not recommended to have unversioned Obsoletes: Obsoletes: kernel-init-guest rpm: line 542: It's not recommended to have unversioned Obsoletes: Obsoletes: kernel-init-host rpm: line 542: It's not recommended to have unversioned Obsoletes: Obsoletes: kernel-init-guest rpm: line 542: It's not recommended to have unversioned Obsoletes: Obsoletes: kernel-init-host rpm: line 542: It's not recommended to have unversioned Obsoletes: Obsoletes: kernel-init-guest rpm: line 542: It's not recommended to have unversioned Obsoletes: Obsoletes: kernel-init-host rpm: line 542: It's not recommended to have unversioned Obsoletes: Obsoletes: kernel-init-guest rpm: line 542: It's not recommended to have unversioned Obsoletes: Obsoletes: kernel-init-host rpm: Could not canonicalize hostname: ymir no BuildConflicts found checking BR rpm: warning: line 542: It's not recommended to have unversioned Obsoletes: Obsoletes: kernel-init-guest rpm: warning: line 542: It's not recommended to have unversioned Obsoletes: Obsoletes: kernel-init-host rpm: warning: line 542: It's not recommended to have unversioned Obsoletes: Obsoletes: kernel-init-guest rpm: warning: line 542: It's not recommended to have unversioned Obsoletes: Obsoletes: kernel-init-host rpm: warning: line 542: It's not recommended to have unversioned Obsoletes: Obsoletes: kernel-init-guest rpm: warning: line 542: It's not recommended to have unversioned Obsoletes: Obsoletes: kernel-init-host rpm: warning: line 542: It's not recommended to have unversioned Obsoletes: Obsoletes: kernel-init-guest rpm: warning: line 542: It's not recommended to have unversioned Obsoletes: Obsoletes: kernel-init-host rpm: warning: line 542: It's not recommended to have unversioned Obsoletes: Obsoletes: kernel-init-guest rpm: warning: line 542: It's not recommended to have unversioned Obsoletes: Obsoletes: kernel-init-host rpm: warning: line 542: It's not recommended to have unversioned Obsoletes: Obsoletes: kernel-init-guest rpm: warning: line 542: It's not recommended to have unversioned Obsoletes: Obsoletes: kernel-init-host rpm: warning: Could not canonicalize hostname: ymir rpm: Building target platforms: x86_64-pld-linux rpm: Building for target x86_64-pld-linux rpm: rpm: RPM build warnings: rpm: line 542: It's not recommended to have unversioned Obsoletes: Obsoletes: kernel-init-guest rpm: line 542: It's not recommended to have unversioned Obsoletes: Obsoletes: kernel-init-host rpm: line 542: It's not recommended to have unversioned Obsoletes: Obsoletes: kernel-init-guest rpm: line 542: It's not recommended to have unversioned Obsoletes: Obsoletes: kernel-init-host rpm: line 542: It's not recommended to have unversioned Obsoletes: Obsoletes: kernel-init-guest rpm: line 542: It's not recommended to have unversioned Obsoletes: Obsoletes: kernel-init-host rpm: line 542: It's not recommended to have unversioned Obsoletes: Obsoletes: kernel-init-guest rpm: line 542: It's not recommended to have unversioned Obsoletes: Obsoletes: kernel-init-host rpm: line 542: It's not recommended to have unversioned Obsoletes: Obsoletes: kernel-init-guest rpm: line 542: It's not recommended to have unversioned Obsoletes: Obsoletes: kernel-init-host rpm: line 542: It's not recommended to have unversioned Obsoletes: Obsoletes: kernel-init-guest rpm: line 542: It's not recommended to have unversioned Obsoletes: Obsoletes: kernel-init-host rpm: Could not canonicalize hostname: ymir no BR needed building RPM using: set -ex; : build-id: 965ba0a2-ff26-4493-876e-52110d65aaab; TMPDIR=/tmp/B.e3vtk6dg/BUILD/tmp exec nice -n 0 rpmbuild -bb --define '__jobs 28' --define '_smp_mflags -j28' --define '_make_opts -Otarget' --define '_pld_builder 1' --define '_topdir /tmp/B.e3vtk6dg' --define '_specdir %{_topdir}' --define '_sourcedir %{_specdir}' --define '_rpmdir %{_topdir}/RPMS' --define '_builddir %{_topdir}/BUILD' --without userspace --target x86_64-pld-linux --define 'build_kernels head,6.1,5.15,5.10,5.4,4.19' /tmp/B.e3vtk6dg/VirtualBox.spec + : build-id: 965ba0a2-ff26-4493-876e-52110d65aaab + TMPDIR=/tmp/B.e3vtk6dg/BUILD/tmp + exec nice -n 0 rpmbuild -bb --define '__jobs 28' --define '_smp_mflags -j28' --define '_make_opts -Otarget' --define '_pld_builder 1' --define '_topdir /tmp/B.e3vtk6dg' --define '_specdir %{_topdir}' --define '_sourcedir %{_specdir}' --define '_rpmdir %{_topdir}/RPMS' --define '_builddir %{_topdir}/BUILD' --without userspace --target x86_64-pld-linux --define 'build_kernels head,6.1,5.15,5.10,5.4,4.19' /tmp/B.e3vtk6dg/VirtualBox.spec warning: line 542: It's not recommended to have unversioned Obsoletes: Obsoletes: kernel-init-guest warning: line 542: It's not recommended to have unversioned Obsoletes: Obsoletes: kernel-init-host warning: line 542: It's not recommended to have unversioned Obsoletes: Obsoletes: kernel-init-guest warning: line 542: It's not recommended to have unversioned Obsoletes: Obsoletes: kernel-init-host warning: line 542: It's not recommended to have unversioned Obsoletes: Obsoletes: kernel-init-guest warning: line 542: It's not recommended to have unversioned Obsoletes: Obsoletes: kernel-init-host warning: line 542: It's not recommended to have unversioned Obsoletes: Obsoletes: kernel-init-guest warning: line 542: It's not recommended to have unversioned Obsoletes: Obsoletes: kernel-init-host warning: line 542: It's not recommended to have unversioned Obsoletes: Obsoletes: kernel-init-guest warning: line 542: It's not recommended to have unversioned Obsoletes: Obsoletes: kernel-init-host warning: line 542: It's not recommended to have unversioned Obsoletes: Obsoletes: kernel-init-guest warning: line 542: It's not recommended to have unversioned Obsoletes: Obsoletes: kernel-init-host warning: Could not canonicalize hostname: ymir Building target platforms: x86_64-pld-linux Building for target x86_64-pld-linux Executing(%prep): /bin/sh -e /tmp/B.e3vtk6dg/BUILD/tmp/rpm-tmp.qtBwZQ + umask 022 + cd /tmp/B.e3vtk6dg/BUILD + cd /tmp/B.e3vtk6dg/BUILD + rm -rf VirtualBox-7.0.18 + /usr/bin/bzip2 -dc /tmp/B.e3vtk6dg/VirtualBox-7.0.18.tar.bz2 + /bin/tar -xof - + STATUS=0 + '[' 0 -ne 0 ']' + cd VirtualBox-7.0.18 + /bin/chmod -Rf a+rX,u+w,g-w,o-w . + echo 'Patch #0 (VirtualBox-version-error.patch):' Patch #0 (VirtualBox-version-error.patch): + </tmp/B.e3vtk6dg/VirtualBox-version-error.patch + /usr/bin/patch -s -f -p1 '--fuzz=0' + echo 'Patch #1 (VirtualBox-VBoxSysInfo.patch):' Patch #1 (VirtualBox-VBoxSysInfo.patch): + </tmp/B.e3vtk6dg/VirtualBox-VBoxSysInfo.patch + /usr/bin/patch -s -f -p1 '--fuzz=0' + echo 'Patch #2 (VirtualBox-warning_workaround.patch):' Patch #2 (VirtualBox-warning_workaround.patch): + </tmp/B.e3vtk6dg/VirtualBox-warning_workaround.patch + /usr/bin/patch -s -f -p1 '--fuzz=0' + echo 'Patch #4 (wrapper.patch):' Patch #4 (wrapper.patch): + </tmp/B.e3vtk6dg/wrapper.patch + /usr/bin/patch -s -f -p1 '--fuzz=0' + echo 'Patch #6 (hardening-shared.patch):' Patch #6 (hardening-shared.patch): + </tmp/B.e3vtk6dg/hardening-shared.patch + /usr/bin/patch -s -f -p1 '--fuzz=0' + echo 'Patch #7 (lightdm-greeter-makefile.patch):' Patch #7 (lightdm-greeter-makefile.patch): + </tmp/B.e3vtk6dg/lightdm-greeter-makefile.patch + /usr/bin/patch -s -f -p1 '--fuzz=0' + echo 'Patch #8 (lightdm-greeter-g++-link.patch):' Patch #8 (lightdm-greeter-g++-link.patch): + </tmp/B.e3vtk6dg/lightdm-greeter-g++-link.patch + /usr/bin/patch -s -f -p1 '--fuzz=0' + echo 'Patch #9 (pld-guest.patch):' Patch #9 (pld-guest.patch): + </tmp/B.e3vtk6dg/pld-guest.patch + /usr/bin/patch -s -f -p1 '--fuzz=0' + echo 'Patch #10 (16-no-update.patch):' Patch #10 (16-no-update.patch): + </tmp/B.e3vtk6dg/16-no-update.patch + /usr/bin/patch -s -f -p1 '--fuzz=0' + echo 'Patch #13 (VirtualBox-no-scrextend.patch):' Patch #13 (VirtualBox-no-scrextend.patch): + </tmp/B.e3vtk6dg/VirtualBox-no-scrextend.patch + /usr/bin/patch -s -f -p1 '--fuzz=0' + echo 'Patch #15 (VirtualBox-lightdm-1.19.2.patch):' Patch #15 (VirtualBox-lightdm-1.19.2.patch): + </tmp/B.e3vtk6dg/VirtualBox-lightdm-1.19.2.patch + /usr/bin/patch -s -f -p0 '--fuzz=0' + echo 'Patch #16 (VirtualBox-no-vboxvideo.patch):' Patch #16 (VirtualBox-no-vboxvideo.patch): + </tmp/B.e3vtk6dg/VirtualBox-no-vboxvideo.patch + /usr/bin/patch -s -f -p0 '--fuzz=0' + echo 'Patch #17 (qt5-gl.patch):' Patch #17 (qt5-gl.patch): + </tmp/B.e3vtk6dg/qt5-gl.patch + /usr/bin/patch -s -f -p1 '--fuzz=0' + echo 'Patch #18 (qt-detect.patch):' Patch #18 (qt-detect.patch): + </tmp/B.e3vtk6dg/qt-detect.patch + /usr/bin/patch -s -f -p1 '--fuzz=0' + echo 'Patch #19 (python3.patch):' Patch #19 (python3.patch): + </tmp/B.e3vtk6dg/python3.patch + /usr/bin/patch -s -f -p1 '--fuzz=0' + echo 'Patch #20 (gcc-13.patch):' Patch #20 (gcc-13.patch): + </tmp/B.e3vtk6dg/gcc-13.patch + /usr/bin/patch -s -f -p1 '--fuzz=0' + echo 'Patch #21 (xsl-style-dir.patch):' Patch #21 (xsl-style-dir.patch): + </tmp/B.e3vtk6dg/xsl-style-dir.patch + /usr/bin/patch -s -f -p1 '--fuzz=0' + echo 'Patch #22 (build-arch.patch):' Patch #22 (build-arch.patch): + </tmp/B.e3vtk6dg/build-arch.patch + /usr/bin/patch -s -f -p1 '--fuzz=0' + /bin/sed -i -e s,@VBOX_DOC_PATH@,/usr/share/doc/VirtualBox-kernel-7.0.18, -e 's/Categories=.*/Categories=Utility;Emulator;/' src/VBox/Installer/common/virtualbox.desktop.in + /bin/sed -i -e 's@_LDFLAGS\.amd64*.*=@& -Wl,--as-needed -Wl,--no-copy-dt-needed-entries -Wl,-z,relro -Wl,-z,combreloc @g' -i Config.kmk src/libs/xpcom18a4/Config.kmk + /bin/sed -i -e 's#@INSTALL_DIR@#/usr/lib64/VirtualBox#' src/VBox/Installer/linux/VBox.sh + install -d kernel/GuestDrivers kernel/HostDrivers + cd kernel + ../src/VBox/Additions/linux/export_modules.sh guest-modules.tar.gz Doing a test build, this may take a while. Warning: test build failed. Please check /tmp/vbox-export-guest.log + tar -zxf guest-modules.tar.gz -C GuestDrivers + ../src/VBox/HostDrivers/linux/export_modules.sh --file host-modules.tar.gz --without-hardening Doing a test build, this may take a while. Warning: test build failed. Please check /tmp/vbox-export-host.log + tar -zxf host-modules.tar.gz -C HostDrivers + cd - /tmp/B.e3vtk6dg/BUILD/VirtualBox-7.0.18 + /bin/rm '--interactive=never' -r kBuild + cp -p src/VBox/Frontends/VirtualBox/images/os_linux26.png src/VBox/Frontends/VirtualBox/images/os_pld.png + cp -p src/VBox/Frontends/VirtualBox/images/os_linux26_64.png src/VBox/Frontends/VirtualBox/images/os_pld_64.png + <<"EOF" KBUILD_VERBOSE=3 USERNAME=builder VBOX_BUILD_PUBLISHER=_PLD VBOX_VERSION_STRING=$(VBOX_VERSION_MAJOR).$(VBOX_VERSION_MINOR).$(VBOX_VERSION_BUILD)_PLD XSERVER_VERSION=211 VBOX_USE_SYSTEM_XORG_HEADERS=1 VBOX_USE_SYSTEM_GL_HEADERS=1 VBOX_WITH_LIGHTDM_GREETER=1 VBOX_WITH_LIGHTDM_GREETER_PACKING=1 TOOL_GCC3_CFLAGS=-O2 -fwrapv -pipe -Wformat -Wp,-D_FORTIFY_SOURCE=2 -fstack-protector-strong --param=ssp-buffer-size=4 -Werror=trampolines -march=x86-64 -mtune=generic TOOL_GCC3_CXXFLAGS=-O2 -fwrapv -pipe -Wformat -Wp,-D_FORTIFY_SOURCE=2 -fstack-protector-strong --param=ssp-buffer-size=4 -Werror=trampolines -march=x86-64 -mtune=generic VBOX_GCC_OPT=-O2 -fwrapv -pipe -Wformat -Wp,-D_FORTIFY_SOURCE=2 -fstack-protector-strong --param=ssp-buffer-size=4 -Werror=trampolines -march=x86-64 -mtune=generic TOOL_YASM_AS := /usr/bin/yasm VBOX_BLD_PYTHON := /usr/bin/python3 VBOX_WITHOUT_PYTHON_LIMITED_API=1 VBOX_PATH_APP_PRIVATE_ARCH := /usr/lib64/VirtualBox VBOX_PATH_APP_PRIVATE := /usr/share/VirtualBox VBOX_PATH_SHARED_LIBS := $(VBOX_PATH_APP_PRIVATE_ARCH) VBOX_WITH_ORIGIN := VBOX_WITH_RUNPATH := $(VBOX_PATH_APP_PRIVATE_ARCH) #VBOX_PATH_APP_DOCS := /usr/share/doc/VirtualBox-doc-7.0.18 VBOX_PATH_DOCBOOK_DTD := /usr/share/sgml/docbook/xml-dtd-4.4 # don't build testcases to save time, they are not needed for the package VBOX_WITH_TESTCASES := VBOX_WITH_TESTSUITE := VBOX_WITH_VRDP_RDESKTOP= VBOX_WITH_MULTIVERSION_PYTHON=0 EOF + >>LocalConfig.kmk + cat + RPM_EC=0 + jobs -p + exit 0 Executing(%build): /bin/sh -e /tmp/B.e3vtk6dg/BUILD/tmp/rpm-tmp.97Y43s TMP=/home/users/builder/tmp HOME=/home/users/builder PATH=/home/users/builder/GNUstep/Tools:/bin:/usr/bin:/usr/local/bin:/home/users/builder/bin TMPDIR=/tmp/B.e3vtk6dg/BUILD/tmp + umask 022 + cd /tmp/B.e3vtk6dg/BUILD + cd VirtualBox-7.0.18 + export 'KERN_DIR=/usr/src/linux' + cd kernel/HostDrivers + cd vboxdrv + compile + typeset 'L=<' PATCH_SH + set -e -x + '[' -r /usr/src/linux/.config ']' + rm -rf o + install -d o/include/linux o/include/generated o/arch/x86/include o/arch/powerpc/lib + ln -sf /usr/src/linux/.config o/.config + ln -sf /usr/src/linux/Module.symvers o/Module.symvers + '[' -f /usr/src/linux/include/generated/autoconf.h ']' + ln -sf /usr/src/linux/include/generated/autoconf.h o/include/generated/autoconf.h + ln -s ../generated/autoconf.h o/include/linux/autoconf.h + '[' -d /usr/src/linux/arch/x86/include/generated ']' + ln -s /usr/src/linux/arch/x86/include/generated o/arch/x86/include + set +x + install -d o/include/config + touch o/include/config/MARKER + ln -sf /usr/src/linux/include/config/auto.conf o/include/config/auto.conf + ln -sf /usr/src/linux/scripts o/scripts + /usr/bin/make -Otarget -j28 -C /usr/src/linux clean 'RCS_FIND_IGNORE=-name '\''*.[ks]o'\'' -o' 'M=/tmp/B.e3vtk6dg/BUILD/VirtualBox-7.0.18/kernel/HostDrivers/vboxdrv' 'HOSTCC=x86_64-pld-linux-gcc' 'SYSSRC=/usr/src/linux' 'SYSOUT=/tmp/B.e3vtk6dg/BUILD/VirtualBox-7.0.18/kernel/HostDrivers/vboxdrv/o' 'V=1' 'ARCH=x86_64' 'CC=x86_64-pld-linux-gcc' /usr/bin/make --no-print-directory -C /usr/src/linux-6.9.0 \ -f /usr/src/linux-6.9.0/Makefile clean /usr/bin/make -f ./scripts/Makefile.clean obj=/tmp/B.e3vtk6dg/BUILD/VirtualBox-7.0.18/kernel/HostDrivers/vboxdrv # cmd_rmfiles clean rm -rf /tmp/B.e3vtk6dg/BUILD/VirtualBox-7.0.18/kernel/HostDrivers/vboxdrv/Module.symvers /tmp/B.e3vtk6dg/BUILD/VirtualBox-7.0.18/kernel/HostDrivers/vboxdrv/modules.nsdeps /tmp/B.e3vtk6dg/BUILD/VirtualBox-7.0.18/kernel/HostDrivers/vboxdrv/compile_commands.json /tmp/B.e3vtk6dg/BUILD/VirtualBox-7.0.18/kernel/HostDrivers/vboxdrv/.thinlto-cache + /usr/bin/make -Otarget -j28 -C /usr/src/linux modules 'M=/tmp/B.e3vtk6dg/BUILD/VirtualBox-7.0.18/kernel/HostDrivers/vboxdrv' 'CONSTIFY_PLUGIN=' 'HOSTCC=x86_64-pld-linux-gcc' 'SYSSRC=/usr/src/linux' 'SYSOUT=/tmp/B.e3vtk6dg/BUILD/VirtualBox-7.0.18/kernel/HostDrivers/vboxdrv/o' 'V=1' 'ARCH=x86_64' 'CC=x86_64-pld-linux-gcc' /usr/bin/make --no-print-directory -C /usr/src/linux-6.9.0 \ -f /usr/src/linux-6.9.0/Makefile modules warning: the compiler differs from the one used to build the kernel The kernel was built by: x86_64-pld-linux-gcc (PLD-Linux) 13.2.0 20230727 (release) You are using: x86_64-pld-linux-gcc (PLD-Linux) 13.3.0 20240521 (release) /usr/bin/make -f ./scripts/Makefile.build obj=/tmp/B.e3vtk6dg/BUILD/VirtualBox-7.0.18/kernel/HostDrivers/vboxdrv need-builtin=1 need-modorder=1 # cmd_mod /tmp/B.e3vtk6dg/BUILD/VirtualBox-7.0.18/kernel/HostDrivers/vboxdrv/vboxdrv.mod printf '%s ' linux/SUPDrv-linux.o SUPDrv.o SUPDrvGip.o SUPDrvSem.o SUPDrvTracer.o SUPLibAll.o common/string/strformatrt.o combined-agnostic1.o combined-agnostic2.o combined-os-specific.o | awk '!x[$0]++ { print("/tmp/B.e3vtk6dg/BUILD/VirtualBox-7.0.18/kernel/HostDrivers/vboxdrv/"$0) }' > /tmp/B.e3vtk6dg/BUILD/VirtualBox-7.0.18/kernel/HostDrivers/vboxdrv/vboxdrv.mod # CC [M] /tmp/B.e3vtk6dg/BUILD/VirtualBox-7.0.18/kernel/HostDrivers/vboxdrv/linux/SUPDrv-linux.o x86_64-pld-linux-gcc -Wp,-MMD,/tmp/B.e3vtk6dg/BUILD/VirtualBox-7.0.18/kernel/HostDrivers/vboxdrv/linux/.SUPDrv-linux.o.d -nostdinc -I./arch/x86/include -I./arch/x86/include/generated -I./include -I./arch/x86/include/uapi -I./arch/x86/include/generated/uapi -I./include/uapi -I./include/generated/uapi -include ./include/linux/compiler-version.h -include ./include/linux/kconfig.h -include ./include/linux/compiler_types.h -D__KERNEL__ -fmacro-prefix-map=./= -std=gnu11 -fshort-wchar -funsigned-char -fno-common -fno-PIE -fno-strict-aliasing -mno-sse -mno-mmx -mno-sse2 -mno-3dnow -mno-avx -fcf-protection=none -m64 -falign-jumps=1 -falign-loops=1 -mno-80387 -mno-fp-ret-in-387 -mpreferred-stack-boundary=3 -mskip-rax-setup -mtune=generic -mno-red-zone -mcmodel=kernel -Wno-sign-compare -fno-asynchronous-unwind-tables -mindirect-branch=thunk-extern -mindirect-branch-register -mindirect-branch-cs-prefix -mfunction-return=thunk-extern -fno-jump-tables -mharden-sls=all -fpatchable-function-entry=16,16 -fno-delete-null-pointer-checks -O2 -fno-allow-store-data-races -fstack-protector-strong -ftrivial-auto-var-init=zero -fno-stack-clash-protection -fzero-call-used-regs=used-gpr -pg -mrecord-mcount -mfentry -DCC_USING_FENTRY -falign-functions=16 -fstrict-flex-arrays=3 -fno-strict-overflow -fno-stack-check -fconserve-stack -Wall -Wundef -Werror=implicit-function-declaration -Werror=implicit-int -Werror=return-type -Werror=strict-prototypes -Wno-format-security -Wno-trigraphs -Wno-frame-address -Wno-address-of-packed-member -Wmissing-declarations -Wmissing-prototypes -Wframe-larger-than=2048 -Wno-main -Wno-unused-but-set-variable -Wno-unused-const-variable -Wno-dangling-pointer -Wvla -Wno-pointer-sign -Wcast-function-type -Wno-stringop-overflow -Wno-array-bounds -Wno-alloc-size-larger-than -Wimplicit-fallthrough=5 -Werror=date-time -Werror=incompatible-pointer-types -Werror=designated-init -Wenum-conversion -Wno-unused-but-set-variable -Wno-unused-const-variable -Wno-restrict -Wno-packed-not-aligned -Wno-format-overflow -Wno-format-truncation -Wno-stringop-truncation -Wno-override-init -Wno-missing-field-initializers -Wno-type-limits -Wno-shift-negative-value -Wno-maybe-uninitialized -Wno-sign-compare -gsplit-dwarf -g -gz=zlib -DRANDSTRUCT -fplugin=./scripts/gcc-plugins/randomize_layout_plugin.so -fplugin-arg-randomize_layout_plugin-performance-mode -fplugin=./scripts/gcc-plugins/stackleak_plugin.so -DSTACKLEAK_PLUGIN -fplugin-arg-stackleak_plugin-track-min-size=100 -fplugin-arg-stackleak_plugin-arch=x86 -include /tmp/B.e3vtk6dg/BUILD/VirtualBox-7.0.18/kernel/HostDrivers/vboxdrv/include/VBox/SUPDrvMangling.h -fno-omit-frame-pointer -fno-pie -Wno-declaration-after-statement -I/usr/src/linux/include -I/tmp/B.e3vtk6dg/BUILD/VirtualBox-7.0.18/kernel/HostDrivers/vboxdrv/ -I/tmp/B.e3vtk6dg/BUILD/VirtualBox-7.0.18/kernel/HostDrivers/vboxdrv/include -I/tmp/B.e3vtk6dg/BUILD/VirtualBox-7.0.18/kernel/HostDrivers/vboxdrv/r0drv/linux -D__KERNEL__ -DMODULE -DRT_WITHOUT_PRAGMA_ONCE -DRT_OS_LINUX -DIN_RING0 -DIN_RT_R0 -DIN_SUP_R0 -DVBOX -DRT_WITH_VBOX -DSUPDRV_WITH_RELEASE_LOGGER -DVBOX_WITHOUT_EFLAGS_AC_SET_IN_VBOXDRV -DIPRT_WITHOUT_EFLAGS_AC_PRESERVING -DVBOX_WITH_64_BITS_GUESTS -DCONFIG_VBOXDRV_AS_MISC -DRT_ARCH_AMD64 -DMODULE -DKBUILD_BASENAME='"SUPDrv_linux"' -DKBUILD_MODNAME='"vboxdrv"' -D__KBUILD_MODNAME=kmod_vboxdrv -c -o /tmp/B.e3vtk6dg/BUILD/VirtualBox-7.0.18/kernel/HostDrivers/vboxdrv/linux/SUPDrv-linux.o /tmp/B.e3vtk6dg/BUILD/VirtualBox-7.0.18/kernel/HostDrivers/vboxdrv/linux/SUPDrv-linux.c ; ./tools/objtool/objtool --hacks=jump_label --hacks=noinstr --hacks=skylake --orc --retpoline --rethunk --sls --static-call --uaccess --prefix=16 --module /tmp/B.e3vtk6dg/BUILD/VirtualBox-7.0.18/kernel/HostDrivers/vboxdrv/linux/SUPDrv-linux.o cc1: error: incompatible gcc/plugin versions cc1: error: failed to initialize plugin ./scripts/gcc-plugins/stackleak_plugin.so cc1: error: incompatible gcc/plugin versions cc1: error: failed to initialize plugin ./scripts/gcc-plugins/randomize_layout_plugin.so make[2]: *** [scripts/Makefile.build:244: /tmp/B.e3vtk6dg/BUILD/VirtualBox-7.0.18/kernel/HostDrivers/vboxdrv/linux/SUPDrv-linux.o] Error 1 make[2]: *** Waiting for unfinished jobs.... # CC [M] /tmp/B.e3vtk6dg/BUILD/VirtualBox-7.0.18/kernel/HostDrivers/vboxdrv/SUPDrvGip.o x86_64-pld-linux-gcc -Wp,-MMD,/tmp/B.e3vtk6dg/BUILD/VirtualBox-7.0.18/kernel/HostDrivers/vboxdrv/.SUPDrvGip.o.d -nostdinc -I./arch/x86/include -I./arch/x86/include/generated -I./include -I./arch/x86/include/uapi -I./arch/x86/include/generated/uapi -I./include/uapi -I./include/generated/uapi -include ./include/linux/compiler-version.h -include ./include/linux/kconfig.h -include ./include/linux/compiler_types.h -D__KERNEL__ -fmacro-prefix-map=./= -std=gnu11 -fshort-wchar -funsigned-char -fno-common -fno-PIE -fno-strict-aliasing -mno-sse -mno-mmx -mno-sse2 -mno-3dnow -mno-avx -fcf-protection=none -m64 -falign-jumps=1 -falign-loops=1 -mno-80387 -mno-fp-ret-in-387 -mpreferred-stack-boundary=3 -mskip-rax-setup -mtune=generic -mno-red-zone -mcmodel=kernel -Wno-sign-compare -fno-asynchronous-unwind-tables -mindirect-branch=thunk-extern -mindirect-branch-register -mindirect-branch-cs-prefix -mfunction-return=thunk-extern -fno-jump-tables -mharden-sls=all -fpatchable-function-entry=16,16 -fno-delete-null-pointer-checks -O2 -fno-allow-store-data-races -fstack-protector-strong -ftrivial-auto-var-init=zero -fno-stack-clash-protection -fzero-call-used-regs=used-gpr -pg -mrecord-mcount -mfentry -DCC_USING_FENTRY -falign-functions=16 -fstrict-flex-arrays=3 -fno-strict-overflow -fno-stack-check -fconserve-stack -Wall -Wundef -Werror=implicit-function-declaration -Werror=implicit-int -Werror=return-type -Werror=strict-prototypes -Wno-format-security -Wno-trigraphs -Wno-frame-address -Wno-address-of-packed-member -Wmissing-declarations -Wmissing-prototypes -Wframe-larger-than=2048 -Wno-main -Wno-unused-but-set-variable -Wno-unused-const-variable -Wno-dangling-pointer -Wvla -Wno-pointer-sign -Wcast-function-type -Wno-stringop-overflow -Wno-array-bounds -Wno-alloc-size-larger-than -Wimplicit-fallthrough=5 -Werror=date-time -Werror=incompatible-pointer-types -Werror=designated-init -Wenum-conversion -Wno-unused-but-set-variable -Wno-unused-const-variable -Wno-restrict -Wno-packed-not-aligned -Wno-format-overflow -Wno-format-truncation -Wno-stringop-truncation -Wno-override-init -Wno-missing-field-initializers -Wno-type-limits -Wno-shift-negative-value -Wno-maybe-uninitialized -Wno-sign-compare -gsplit-dwarf -g -gz=zlib -DRANDSTRUCT -fplugin=./scripts/gcc-plugins/randomize_layout_plugin.so -fplugin-arg-randomize_layout_plugin-performance-mode -fplugin=./scripts/gcc-plugins/stackleak_plugin.so -DSTACKLEAK_PLUGIN -fplugin-arg-stackleak_plugin-track-min-size=100 -fplugin-arg-stackleak_plugin-arch=x86 -include /tmp/B.e3vtk6dg/BUILD/VirtualBox-7.0.18/kernel/HostDrivers/vboxdrv/include/VBox/SUPDrvMangling.h -fno-omit-frame-pointer -fno-pie -Wno-declaration-after-statement -I/usr/src/linux/include -I/tmp/B.e3vtk6dg/BUILD/VirtualBox-7.0.18/kernel/HostDrivers/vboxdrv/ -I/tmp/B.e3vtk6dg/BUILD/VirtualBox-7.0.18/kernel/HostDrivers/vboxdrv/include -I/tmp/B.e3vtk6dg/BUILD/VirtualBox-7.0.18/kernel/HostDrivers/vboxdrv/r0drv/linux -D__KERNEL__ -DMODULE -DRT_WITHOUT_PRAGMA_ONCE -DRT_OS_LINUX -DIN_RING0 -DIN_RT_R0 -DIN_SUP_R0 -DVBOX -DRT_WITH_VBOX -DSUPDRV_WITH_RELEASE_LOGGER -DVBOX_WITHOUT_EFLAGS_AC_SET_IN_VBOXDRV -DIPRT_WITHOUT_EFLAGS_AC_PRESERVING -DVBOX_WITH_64_BITS_GUESTS -DCONFIG_VBOXDRV_AS_MISC -DRT_ARCH_AMD64 -DMODULE -DKBUILD_BASENAME='"SUPDrvGip"' -DKBUILD_MODNAME='"vboxdrv"' -D__KBUILD_MODNAME=kmod_vboxdrv -c -o /tmp/B.e3vtk6dg/BUILD/VirtualBox-7.0.18/kernel/HostDrivers/vboxdrv/SUPDrvGip.o /tmp/B.e3vtk6dg/BUILD/VirtualBox-7.0.18/kernel/HostDrivers/vboxdrv/SUPDrvGip.c ; ./tools/objtool/objtool --hacks=jump_label --hacks=noinstr --hacks=skylake --orc --retpoline --rethunk --sls --static-call --uaccess --prefix=16 --module /tmp/B.e3vtk6dg/BUILD/VirtualBox-7.0.18/kernel/HostDrivers/vboxdrv/SUPDrvGip.o cc1: error: incompatible gcc/plugin versions cc1: error: failed to initialize plugin ./scripts/gcc-plugins/stackleak_plugin.so cc1: error: incompatible gcc/plugin versions cc1: error: failed to initialize plugin ./scripts/gcc-plugins/randomize_layout_plugin.so make[2]: *** [scripts/Makefile.build:244: /tmp/B.e3vtk6dg/BUILD/VirtualBox-7.0.18/kernel/HostDrivers/vboxdrv/SUPDrvGip.o] Error 1 # CC [M] /tmp/B.e3vtk6dg/BUILD/VirtualBox-7.0.18/kernel/HostDrivers/vboxdrv/SUPDrv.o x86_64-pld-linux-gcc -Wp,-MMD,/tmp/B.e3vtk6dg/BUILD/VirtualBox-7.0.18/kernel/HostDrivers/vboxdrv/.SUPDrv.o.d -nostdinc -I./arch/x86/include -I./arch/x86/include/generated -I./include -I./arch/x86/include/uapi -I./arch/x86/include/generated/uapi -I./include/uapi -I./include/generated/uapi -include ./include/linux/compiler-version.h -include ./include/linux/kconfig.h -include ./include/linux/compiler_types.h -D__KERNEL__ -fmacro-prefix-map=./= -std=gnu11 -fshort-wchar -funsigned-char -fno-common -fno-PIE -fno-strict-aliasing -mno-sse -mno-mmx -mno-sse2 -mno-3dnow -mno-avx -fcf-protection=none -m64 -falign-jumps=1 -falign-loops=1 -mno-80387 -mno-fp-ret-in-387 -mpreferred-stack-boundary=3 -mskip-rax-setup -mtune=generic -mno-red-zone -mcmodel=kernel -Wno-sign-compare -fno-asynchronous-unwind-tables -mindirect-branch=thunk-extern -mindirect-branch-register -mindirect-branch-cs-prefix -mfunction-return=thunk-extern -fno-jump-tables -mharden-sls=all -fpatchable-function-entry=16,16 -fno-delete-null-pointer-checks -O2 -fno-allow-store-data-races -fstack-protector-strong -ftrivial-auto-var-init=zero -fno-stack-clash-protection -fzero-call-used-regs=used-gpr -pg -mrecord-mcount -mfentry -DCC_USING_FENTRY -falign-functions=16 -fstrict-flex-arrays=3 -fno-strict-overflow -fno-stack-check -fconserve-stack -Wall -Wundef -Werror=implicit-function-declaration -Werror=implicit-int -Werror=return-type -Werror=strict-prototypes -Wno-format-security -Wno-trigraphs -Wno-frame-address -Wno-address-of-packed-member -Wmissing-declarations -Wmissing-prototypes -Wframe-larger-than=2048 -Wno-main -Wno-unused-but-set-variable -Wno-unused-const-variable -Wno-dangling-pointer -Wvla -Wno-pointer-sign -Wcast-function-type -Wno-stringop-overflow -Wno-array-bounds -Wno-alloc-size-larger-than -Wimplicit-fallthrough=5 -Werror=date-time -Werror=incompatible-pointer-types -Werror=designated-init -Wenum-conversion -Wno-unused-but-set-variable -Wno-unused-const-variable -Wno-restrict -Wno-packed-not-aligned -Wno-format-overflow -Wno-format-truncation -Wno-stringop-truncation -Wno-override-init -Wno-missing-field-initializers -Wno-type-limits -Wno-shift-negative-value -Wno-maybe-uninitialized -Wno-sign-compare -gsplit-dwarf -g -gz=zlib -DRANDSTRUCT -fplugin=./scripts/gcc-plugins/randomize_layout_plugin.so -fplugin-arg-randomize_layout_plugin-performance-mode -fplugin=./scripts/gcc-plugins/stackleak_plugin.so -DSTACKLEAK_PLUGIN -fplugin-arg-stackleak_plugin-track-min-size=100 -fplugin-arg-stackleak_plugin-arch=x86 -include /tmp/B.e3vtk6dg/BUILD/VirtualBox-7.0.18/kernel/HostDrivers/vboxdrv/include/VBox/SUPDrvMangling.h -fno-omit-frame-pointer -fno-pie -Wno-declaration-after-statement -I/usr/src/linux/include -I/tmp/B.e3vtk6dg/BUILD/VirtualBox-7.0.18/kernel/HostDrivers/vboxdrv/ -I/tmp/B.e3vtk6dg/BUILD/VirtualBox-7.0.18/kernel/HostDrivers/vboxdrv/include -I/tmp/B.e3vtk6dg/BUILD/VirtualBox-7.0.18/kernel/HostDrivers/vboxdrv/r0drv/linux -D__KERNEL__ -DMODULE -DRT_WITHOUT_PRAGMA_ONCE -DRT_OS_LINUX -DIN_RING0 -DIN_RT_R0 -DIN_SUP_R0 -DVBOX -DRT_WITH_VBOX -DSUPDRV_WITH_RELEASE_LOGGER -DVBOX_WITHOUT_EFLAGS_AC_SET_IN_VBOXDRV -DIPRT_WITHOUT_EFLAGS_AC_PRESERVING -DVBOX_WITH_64_BITS_GUESTS -DCONFIG_VBOXDRV_AS_MISC -DRT_ARCH_AMD64 -DMODULE -DKBUILD_BASENAME='"SUPDrv"' -DKBUILD_MODNAME='"vboxdrv"' -D__KBUILD_MODNAME=kmod_vboxdrv -c -o /tmp/B.e3vtk6dg/BUILD/VirtualBox-7.0.18/kernel/HostDrivers/vboxdrv/SUPDrv.o /tmp/B.e3vtk6dg/BUILD/VirtualBox-7.0.18/kernel/HostDrivers/vboxdrv/SUPDrv.c ; ./tools/objtool/objtool --hacks=jump_label --hacks=noinstr --hacks=skylake --orc --retpoline --rethunk --sls --static-call --uaccess --prefix=16 --module /tmp/B.e3vtk6dg/BUILD/VirtualBox-7.0.18/kernel/HostDrivers/vboxdrv/SUPDrv.o cc1: error: incompatible gcc/plugin versions cc1: error: failed to initialize plugin ./scripts/gcc-plugins/stackleak_plugin.so cc1: error: incompatible gcc/plugin versions cc1: error: failed to initialize plugin ./scripts/gcc-plugins/randomize_layout_plugin.so make[2]: *** [scripts/Makefile.build:244: /tmp/B.e3vtk6dg/BUILD/VirtualBox-7.0.18/kernel/HostDrivers/vboxdrv/SUPDrv.o] Error 1 # CC [M] /tmp/B.e3vtk6dg/BUILD/VirtualBox-7.0.18/kernel/HostDrivers/vboxdrv/SUPDrvSem.o x86_64-pld-linux-gcc -Wp,-MMD,/tmp/B.e3vtk6dg/BUILD/VirtualBox-7.0.18/kernel/HostDrivers/vboxdrv/.SUPDrvSem.o.d -nostdinc -I./arch/x86/include -I./arch/x86/include/generated -I./include -I./arch/x86/include/uapi -I./arch/x86/include/generated/uapi -I./include/uapi -I./include/generated/uapi -include ./include/linux/compiler-version.h -include ./include/linux/kconfig.h -include ./include/linux/compiler_types.h -D__KERNEL__ -fmacro-prefix-map=./= -std=gnu11 -fshort-wchar -funsigned-char -fno-common -fno-PIE -fno-strict-aliasing -mno-sse -mno-mmx -mno-sse2 -mno-3dnow -mno-avx -fcf-protection=none -m64 -falign-jumps=1 -falign-loops=1 -mno-80387 -mno-fp-ret-in-387 -mpreferred-stack-boundary=3 -mskip-rax-setup -mtune=generic -mno-red-zone -mcmodel=kernel -Wno-sign-compare -fno-asynchronous-unwind-tables -mindirect-branch=thunk-extern -mindirect-branch-register -mindirect-branch-cs-prefix -mfunction-return=thunk-extern -fno-jump-tables -mharden-sls=all -fpatchable-function-entry=16,16 -fno-delete-null-pointer-checks -O2 -fno-allow-store-data-races -fstack-protector-strong -ftrivial-auto-var-init=zero -fno-stack-clash-protection -fzero-call-used-regs=used-gpr -pg -mrecord-mcount -mfentry -DCC_USING_FENTRY -falign-functions=16 -fstrict-flex-arrays=3 -fno-strict-overflow -fno-stack-check -fconserve-stack -Wall -Wundef -Werror=implicit-function-declaration -Werror=implicit-int -Werror=return-type -Werror=strict-prototypes -Wno-format-security -Wno-trigraphs -Wno-frame-address -Wno-address-of-packed-member -Wmissing-declarations -Wmissing-prototypes -Wframe-larger-than=2048 -Wno-main -Wno-unused-but-set-variable -Wno-unused-const-variable -Wno-dangling-pointer -Wvla -Wno-pointer-sign -Wcast-function-type -Wno-stringop-overflow -Wno-array-bounds -Wno-alloc-size-larger-than -Wimplicit-fallthrough=5 -Werror=date-time -Werror=incompatible-pointer-types -Werror=designated-init -Wenum-conversion -Wno-unused-but-set-variable -Wno-unused-const-variable -Wno-restrict -Wno-packed-not-aligned -Wno-format-overflow -Wno-format-truncation -Wno-stringop-truncation -Wno-override-init -Wno-missing-field-initializers -Wno-type-limits -Wno-shift-negative-value -Wno-maybe-uninitialized -Wno-sign-compare -gsplit-dwarf -g -gz=zlib -DRANDSTRUCT -fplugin=./scripts/gcc-plugins/randomize_layout_plugin.so -fplugin-arg-randomize_layout_plugin-performance-mode -fplugin=./scripts/gcc-plugins/stackleak_plugin.so -DSTACKLEAK_PLUGIN -fplugin-arg-stackleak_plugin-track-min-size=100 -fplugin-arg-stackleak_plugin-arch=x86 -include /tmp/B.e3vtk6dg/BUILD/VirtualBox-7.0.18/kernel/HostDrivers/vboxdrv/include/VBox/SUPDrvMangling.h -fno-omit-frame-pointer -fno-pie -Wno-declaration-after-statement -I/usr/src/linux/include -I/tmp/B.e3vtk6dg/BUILD/VirtualBox-7.0.18/kernel/HostDrivers/vboxdrv/ -I/tmp/B.e3vtk6dg/BUILD/VirtualBox-7.0.18/kernel/HostDrivers/vboxdrv/include -I/tmp/B.e3vtk6dg/BUILD/VirtualBox-7.0.18/kernel/HostDrivers/vboxdrv/r0drv/linux -D__KERNEL__ -DMODULE -DRT_WITHOUT_PRAGMA_ONCE -DRT_OS_LINUX -DIN_RING0 -DIN_RT_R0 -DIN_SUP_R0 -DVBOX -DRT_WITH_VBOX -DSUPDRV_WITH_RELEASE_LOGGER -DVBOX_WITHOUT_EFLAGS_AC_SET_IN_VBOXDRV -DIPRT_WITHOUT_EFLAGS_AC_PRESERVING -DVBOX_WITH_64_BITS_GUESTS -DCONFIG_VBOXDRV_AS_MISC -DRT_ARCH_AMD64 -DMODULE -DKBUILD_BASENAME='"SUPDrvSem"' -DKBUILD_MODNAME='"vboxdrv"' -D__KBUILD_MODNAME=kmod_vboxdrv -c -o /tmp/B.e3vtk6dg/BUILD/VirtualBox-7.0.18/kernel/HostDrivers/vboxdrv/SUPDrvSem.o /tmp/B.e3vtk6dg/BUILD/VirtualBox-7.0.18/kernel/HostDrivers/vboxdrv/SUPDrvSem.c ; ./tools/objtool/objtool --hacks=jump_label --hacks=noinstr --hacks=skylake --orc --retpoline --rethunk --sls --static-call --uaccess --prefix=16 --module /tmp/B.e3vtk6dg/BUILD/VirtualBox-7.0.18/kernel/HostDrivers/vboxdrv/SUPDrvSem.o cc1: error: incompatible gcc/plugin versions cc1: error: failed to initialize plugin ./scripts/gcc-plugins/stackleak_plugin.so cc1: error: incompatible gcc/plugin versions cc1: error: failed to initialize plugin ./scripts/gcc-plugins/randomize_layout_plugin.so make[2]: *** [scripts/Makefile.build:244: /tmp/B.e3vtk6dg/BUILD/VirtualBox-7.0.18/kernel/HostDrivers/vboxdrv/SUPDrvSem.o] Error 1 # CC [M] /tmp/B.e3vtk6dg/BUILD/VirtualBox-7.0.18/kernel/HostDrivers/vboxdrv/SUPDrvTracer.o x86_64-pld-linux-gcc -Wp,-MMD,/tmp/B.e3vtk6dg/BUILD/VirtualBox-7.0.18/kernel/HostDrivers/vboxdrv/.SUPDrvTracer.o.d -nostdinc -I./arch/x86/include -I./arch/x86/include/generated -I./include -I./arch/x86/include/uapi -I./arch/x86/include/generated/uapi -I./include/uapi -I./include/generated/uapi -include ./include/linux/compiler-version.h -include ./include/linux/kconfig.h -include ./include/linux/compiler_types.h -D__KERNEL__ -fmacro-prefix-map=./= -std=gnu11 -fshort-wchar -funsigned-char -fno-common -fno-PIE -fno-strict-aliasing -mno-sse -mno-mmx -mno-sse2 -mno-3dnow -mno-avx -fcf-protection=none -m64 -falign-jumps=1 -falign-loops=1 -mno-80387 -mno-fp-ret-in-387 -mpreferred-stack-boundary=3 -mskip-rax-setup -mtune=generic -mno-red-zone -mcmodel=kernel -Wno-sign-compare -fno-asynchronous-unwind-tables -mindirect-branch=thunk-extern -mindirect-branch-register -mindirect-branch-cs-prefix -mfunction-return=thunk-extern -fno-jump-tables -mharden-sls=all -fpatchable-function-entry=16,16 -fno-delete-null-pointer-checks -O2 -fno-allow-store-data-races -fstack-protector-strong -ftrivial-auto-var-init=zero -fno-stack-clash-protection -fzero-call-used-regs=used-gpr -pg -mrecord-mcount -mfentry -DCC_USING_FENTRY -falign-functions=16 -fstrict-flex-arrays=3 -fno-strict-overflow -fno-stack-check -fconserve-stack -Wall -Wundef -Werror=implicit-function-declaration -Werror=implicit-int -Werror=return-type -Werror=strict-prototypes -Wno-format-security -Wno-trigraphs -Wno-frame-address -Wno-address-of-packed-member -Wmissing-declarations -Wmissing-prototypes -Wframe-larger-than=2048 -Wno-main -Wno-unused-but-set-variable -Wno-unused-const-variable -Wno-dangling-pointer -Wvla -Wno-pointer-sign -Wcast-function-type -Wno-stringop-overflow -Wno-array-bounds -Wno-alloc-size-larger-than -Wimplicit-fallthrough=5 -Werror=date-time -Werror=incompatible-pointer-types -Werror=designated-init -Wenum-conversion -Wno-unused-but-set-variable -Wno-unused-const-variable -Wno-restrict -Wno-packed-not-aligned -Wno-format-overflow -Wno-format-truncation -Wno-stringop-truncation -Wno-override-init -Wno-missing-field-initializers -Wno-type-limits -Wno-shift-negative-value -Wno-maybe-uninitialized -Wno-sign-compare -gsplit-dwarf -g -gz=zlib -DRANDSTRUCT -fplugin=./scripts/gcc-plugins/randomize_layout_plugin.so -fplugin-arg-randomize_layout_plugin-performance-mode -fplugin=./scripts/gcc-plugins/stackleak_plugin.so -DSTACKLEAK_PLUGIN -fplugin-arg-stackleak_plugin-track-min-size=100 -fplugin-arg-stackleak_plugin-arch=x86 -include /tmp/B.e3vtk6dg/BUILD/VirtualBox-7.0.18/kernel/HostDrivers/vboxdrv/include/VBox/SUPDrvMangling.h -fno-omit-frame-pointer -fno-pie -Wno-declaration-after-statement -I/usr/src/linux/include -I/tmp/B.e3vtk6dg/BUILD/VirtualBox-7.0.18/kernel/HostDrivers/vboxdrv/ -I/tmp/B.e3vtk6dg/BUILD/VirtualBox-7.0.18/kernel/HostDrivers/vboxdrv/include -I/tmp/B.e3vtk6dg/BUILD/VirtualBox-7.0.18/kernel/HostDrivers/vboxdrv/r0drv/linux -D__KERNEL__ -DMODULE -DRT_WITHOUT_PRAGMA_ONCE -DRT_OS_LINUX -DIN_RING0 -DIN_RT_R0 -DIN_SUP_R0 -DVBOX -DRT_WITH_VBOX -DSUPDRV_WITH_RELEASE_LOGGER -DVBOX_WITHOUT_EFLAGS_AC_SET_IN_VBOXDRV -DIPRT_WITHOUT_EFLAGS_AC_PRESERVING -DVBOX_WITH_64_BITS_GUESTS -DCONFIG_VBOXDRV_AS_MISC -DRT_ARCH_AMD64 -DMODULE -DKBUILD_BASENAME='"SUPDrvTracer"' -DKBUILD_MODNAME='"vboxdrv"' -D__KBUILD_MODNAME=kmod_vboxdrv -c -o /tmp/B.e3vtk6dg/BUILD/VirtualBox-7.0.18/kernel/HostDrivers/vboxdrv/SUPDrvTracer.o /tmp/B.e3vtk6dg/BUILD/VirtualBox-7.0.18/kernel/HostDrivers/vboxdrv/SUPDrvTracer.c ; ./tools/objtool/objtool --hacks=jump_label --hacks=noinstr --hacks=skylake --orc --retpoline --rethunk --sls --static-call --uaccess --prefix=16 --module /tmp/B.e3vtk6dg/BUILD/VirtualBox-7.0.18/kernel/HostDrivers/vboxdrv/SUPDrvTracer.o cc1: error: incompatible gcc/plugin versions cc1: error: failed to initialize plugin ./scripts/gcc-plugins/stackleak_plugin.so cc1: error: incompatible gcc/plugin versions cc1: error: failed to initialize plugin ./scripts/gcc-plugins/randomize_layout_plugin.so make[2]: *** [scripts/Makefile.build:244: /tmp/B.e3vtk6dg/BUILD/VirtualBox-7.0.18/kernel/HostDrivers/vboxdrv/SUPDrvTracer.o] Error 1 # CC [M] /tmp/B.e3vtk6dg/BUILD/VirtualBox-7.0.18/kernel/HostDrivers/vboxdrv/SUPLibAll.o x86_64-pld-linux-gcc -Wp,-MMD,/tmp/B.e3vtk6dg/BUILD/VirtualBox-7.0.18/kernel/HostDrivers/vboxdrv/.SUPLibAll.o.d -nostdinc -I./arch/x86/include -I./arch/x86/include/generated -I./include -I./arch/x86/include/uapi -I./arch/x86/include/generated/uapi -I./include/uapi -I./include/generated/uapi -include ./include/linux/compiler-version.h -include ./include/linux/kconfig.h -include ./include/linux/compiler_types.h -D__KERNEL__ -fmacro-prefix-map=./= -std=gnu11 -fshort-wchar -funsigned-char -fno-common -fno-PIE -fno-strict-aliasing -mno-sse -mno-mmx -mno-sse2 -mno-3dnow -mno-avx -fcf-protection=none -m64 -falign-jumps=1 -falign-loops=1 -mno-80387 -mno-fp-ret-in-387 -mpreferred-stack-boundary=3 -mskip-rax-setup -mtune=generic -mno-red-zone -mcmodel=kernel -Wno-sign-compare -fno-asynchronous-unwind-tables -mindirect-branch=thunk-extern -mindirect-branch-register -mindirect-branch-cs-prefix -mfunction-return=thunk-extern -fno-jump-tables -mharden-sls=all -fpatchable-function-entry=16,16 -fno-delete-null-pointer-checks -O2 -fno-allow-store-data-races -fstack-protector-strong -ftrivial-auto-var-init=zero -fno-stack-clash-protection -fzero-call-used-regs=used-gpr -pg -mrecord-mcount -mfentry -DCC_USING_FENTRY -falign-functions=16 -fstrict-flex-arrays=3 -fno-strict-overflow -fno-stack-check -fconserve-stack -Wall -Wundef -Werror=implicit-function-declaration -Werror=implicit-int -Werror=return-type -Werror=strict-prototypes -Wno-format-security -Wno-trigraphs -Wno-frame-address -Wno-address-of-packed-member -Wmissing-declarations -Wmissing-prototypes -Wframe-larger-than=2048 -Wno-main -Wno-unused-but-set-variable -Wno-unused-const-variable -Wno-dangling-pointer -Wvla -Wno-pointer-sign -Wcast-function-type -Wno-stringop-overflow -Wno-array-bounds -Wno-alloc-size-larger-than -Wimplicit-fallthrough=5 -Werror=date-time -Werror=incompatible-pointer-types -Werror=designated-init -Wenum-conversion -Wno-unused-but-set-variable -Wno-unused-const-variable -Wno-restrict -Wno-packed-not-aligned -Wno-format-overflow -Wno-format-truncation -Wno-stringop-truncation -Wno-override-init -Wno-missing-field-initializers -Wno-type-limits -Wno-shift-negative-value -Wno-maybe-uninitialized -Wno-sign-compare -gsplit-dwarf -g -gz=zlib -DRANDSTRUCT -fplugin=./scripts/gcc-plugins/randomize_layout_plugin.so -fplugin-arg-randomize_layout_plugin-performance-mode -fplugin=./scripts/gcc-plugins/stackleak_plugin.so -DSTACKLEAK_PLUGIN -fplugin-arg-stackleak_plugin-track-min-size=100 -fplugin-arg-stackleak_plugin-arch=x86 -include /tmp/B.e3vtk6dg/BUILD/VirtualBox-7.0.18/kernel/HostDrivers/vboxdrv/include/VBox/SUPDrvMangling.h -fno-omit-frame-pointer -fno-pie -Wno-declaration-after-statement -I/usr/src/linux/include -I/tmp/B.e3vtk6dg/BUILD/VirtualBox-7.0.18/kernel/HostDrivers/vboxdrv/ -I/tmp/B.e3vtk6dg/BUILD/VirtualBox-7.0.18/kernel/HostDrivers/vboxdrv/include -I/tmp/B.e3vtk6dg/BUILD/VirtualBox-7.0.18/kernel/HostDrivers/vboxdrv/r0drv/linux -D__KERNEL__ -DMODULE -DRT_WITHOUT_PRAGMA_ONCE -DRT_OS_LINUX -DIN_RING0 -DIN_RT_R0 -DIN_SUP_R0 -DVBOX -DRT_WITH_VBOX -DSUPDRV_WITH_RELEASE_LOGGER -DVBOX_WITHOUT_EFLAGS_AC_SET_IN_VBOXDRV -DIPRT_WITHOUT_EFLAGS_AC_PRESERVING -DVBOX_WITH_64_BITS_GUESTS -DCONFIG_VBOXDRV_AS_MISC -DRT_ARCH_AMD64 -DMODULE -DKBUILD_BASENAME='"SUPLibAll"' -DKBUILD_MODNAME='"vboxdrv"' -D__KBUILD_MODNAME=kmod_vboxdrv -c -o /tmp/B.e3vtk6dg/BUILD/VirtualBox-7.0.18/kernel/HostDrivers/vboxdrv/SUPLibAll.o /tmp/B.e3vtk6dg/BUILD/VirtualBox-7.0.18/kernel/HostDrivers/vboxdrv/SUPLibAll.c ; ./tools/objtool/objtool --hacks=jump_label --hacks=noinstr --hacks=skylake --orc --retpoline --rethunk --sls --static-call --uaccess --prefix=16 --module /tmp/B.e3vtk6dg/BUILD/VirtualBox-7.0.18/kernel/HostDrivers/vboxdrv/SUPLibAll.o cc1: error: incompatible gcc/plugin versions cc1: error: failed to initialize plugin ./scripts/gcc-plugins/stackleak_plugin.so cc1: error: incompatible gcc/plugin versions cc1: error: failed to initialize plugin ./scripts/gcc-plugins/randomize_layout_plugin.so make[2]: *** [scripts/Makefile.build:244: /tmp/B.e3vtk6dg/BUILD/VirtualBox-7.0.18/kernel/HostDrivers/vboxdrv/SUPLibAll.o] Error 1 make[1]: *** [/usr/src/linux-6.9.0/Makefile:1919: /tmp/B.e3vtk6dg/BUILD/VirtualBox-7.0.18/kernel/HostDrivers/vboxdrv] Error 2 make: *** [Makefile:240: __sub-make] Error 2 error: Bad exit status from /tmp/B.e3vtk6dg/BUILD/tmp/rpm-tmp.97Y43s (%build) RPM build warnings: line 542: It's not recommended to have unversioned Obsoletes: Obsoletes: kernel-init-guest line 542: It's not recommended to have unversioned Obsoletes: Obsoletes: kernel-init-host line 542: It's not recommended to have unversioned Obsoletes: Obsoletes: kernel-init-guest line 542: It's not recommended to have unversioned Obsoletes: Obsoletes: kernel-init-host line 542: It's not recommended to have unversioned Obsoletes: Obsoletes: kernel-init-guest line 542: It's not recommended to have unversioned Obsoletes: Obsoletes: kernel-init-host line 542: It's not recommended to have unversioned Obsoletes: Obsoletes: kernel-init-guest line 542: It's not recommended to have unversioned Obsoletes: Obsoletes: kernel-init-host line 542: It's not recommended to have unversioned Obsoletes: Obsoletes: kernel-init-guest line 542: It's not recommended to have unversioned Obsoletes: Obsoletes: kernel-init-host line 542: It's not recommended to have unversioned Obsoletes: Obsoletes: kernel-init-guest line 542: It's not recommended to have unversioned Obsoletes: Obsoletes: kernel-init-host Could not canonicalize hostname: ymir RPM build errors: Bad exit status from /tmp/B.e3vtk6dg/BUILD/tmp/rpm-tmp.97Y43s (%build) ended at: Fri May 24 22:42:37 2024, done in 0:00:50.182279 error: No files produced. + chmod -R u+rwX /tmp/B.e3vtk6dg/BUILD + rm -rf /tmp/B.e3vtk6dg/tmp /tmp/B.e3vtk6dg/BUILD + rm -rf /tmp/B.e3vtk6dg Begin-PLD-Builder-Info Build-Time: user:68.44s sys:31.50s real:106.23s (faults io:1 non-io:2194414) End-PLD-Builder-Info
[Back to list of logs] [View rpm -qa of builder]