FailedOk

th/SRPMS[OK]
th/x32[OK]
th/i686[OK]
th/x86_64[OK]

ac/SRPMS[OK]
ac/i386[OK]
ac/i586[OK]
ac/i686[OK]
ac/alpha[OK]
ac/amd64[OK]
ac/athlon[OK]
ac/ppc[OK]
ac/sparc[OK]
ac/sparc64[OK]

Advanced Search
main()
Powered by PLD Linux
(c) 2002-2024 PLD Team
$Revision: 1.37 $
Powered by NSA.
Your IP: 35.172.230.21

VirtualBox 965ba0a2-ff26-4493-876e-52110d65aaab

Status:Failed
Source URL:https://buildlogs.pld-linux.org/pld/th/x86_64/FAIL/VirtualBox,965ba0a2-ff26-4493-876e-52110d65aaab.bz2
text/plain URL:View!
full text:View!
rpm -qa of builder:View!
Date:2024/05/24 22:42:41
Runtime:0:00:50.182279

Toc:

  • error 1
  • cc1: error: incompatible gcc/plugin versions
  • error 2
  • cc1: error: failed to initialize plugin ./scripts/gcc-plugins/stackleak_plugin.so
  • error 3
  • cc1: error: incompatible gcc/plugin versions
  • error 4
  • cc1: error: failed to initialize plugin ./scripts/gcc-plugins/randomize_layout_plugin.so
  • error 5
  • make[2]: *** [scripts/Makefile.build:244: /tmp/B.e3vtk6dg/BUILD/VirtualBox-7.0.18/kernel/HostDrivers/vboxdrv/linux/SUPDrv-linux.o] Error 1
  • error 6
  • cc1: error: incompatible gcc/plugin versions
  • error 7
  • cc1: error: failed to initialize plugin ./scripts/gcc-plugins/stackleak_plugin.so
  • error 8
  • cc1: error: incompatible gcc/plugin versions
  • error 9
  • cc1: error: failed to initialize plugin ./scripts/gcc-plugins/randomize_layout_plugin.so
  • error 10
  • make[2]: *** [scripts/Makefile.build:244: /tmp/B.e3vtk6dg/BUILD/VirtualBox-7.0.18/kernel/HostDrivers/vboxdrv/SUPDrvGip.o] Error 1
  • error 11
  • cc1: error: incompatible gcc/plugin versions
  • error 12
  • cc1: error: failed to initialize plugin ./scripts/gcc-plugins/stackleak_plugin.so
  • error 13
  • cc1: error: incompatible gcc/plugin versions
  • error 14
  • cc1: error: failed to initialize plugin ./scripts/gcc-plugins/randomize_layout_plugin.so
  • error 15
  • make[2]: *** [scripts/Makefile.build:244: /tmp/B.e3vtk6dg/BUILD/VirtualBox-7.0.18/kernel/HostDrivers/vboxdrv/SUPDrv.o] Error 1
  • error 16
  • cc1: error: incompatible gcc/plugin versions
  • error 17
  • cc1: error: failed to initialize plugin ./scripts/gcc-plugins/stackleak_plugin.so
  • error 18
  • cc1: error: incompatible gcc/plugin versions
  • error 19
  • cc1: error: failed to initialize plugin ./scripts/gcc-plugins/randomize_layout_plugin.so
  • error 20
  • make[2]: *** [scripts/Makefile.build:244: /tmp/B.e3vtk6dg/BUILD/VirtualBox-7.0.18/kernel/HostDrivers/vboxdrv/SUPDrvSem.o] Error 1
  • error 21
  • cc1: error: incompatible gcc/plugin versions
  • error 22
  • cc1: error: failed to initialize plugin ./scripts/gcc-plugins/stackleak_plugin.so
  • error 23
  • cc1: error: incompatible gcc/plugin versions
  • error 24
  • cc1: error: failed to initialize plugin ./scripts/gcc-plugins/randomize_layout_plugin.so
  • error 25
  • make[2]: *** [scripts/Makefile.build:244: /tmp/B.e3vtk6dg/BUILD/VirtualBox-7.0.18/kernel/HostDrivers/vboxdrv/SUPDrvTracer.o] Error 1
  • error 26
  • cc1: error: incompatible gcc/plugin versions
  • error 27
  • cc1: error: failed to initialize plugin ./scripts/gcc-plugins/stackleak_plugin.so
  • error 28
  • cc1: error: incompatible gcc/plugin versions
  • error 29
  • cc1: error: failed to initialize plugin ./scripts/gcc-plugins/randomize_layout_plugin.so
  • error 30
  • make[2]: *** [scripts/Makefile.build:244: /tmp/B.e3vtk6dg/BUILD/VirtualBox-7.0.18/kernel/HostDrivers/vboxdrv/SUPLibAll.o] Error 1
  • error 31
  • make[1]: *** [/usr/src/linux-6.9.0/Makefile:1919: /tmp/B.e3vtk6dg/BUILD/VirtualBox-7.0.18/kernel/HostDrivers/vboxdrv] Error 2
  • error 32
  • error: Bad exit status from /tmp/B.e3vtk6dg/BUILD/tmp/rpm-tmp.97Y43s (%build)
  • error 33
  • RPM build errors:
  • error 34
  • error: No files produced.

Content:

Doing a test build, this may take a while.
Warning: test build failed.  Please check /tmp/vbox-export-guest.log
+ tar -zxf guest-modules.tar.gz -C GuestDrivers
+ ../src/VBox/HostDrivers/linux/export_modules.sh --file host-modules.tar.gz --without-hardening
Doing a test build, this may take a while.
Warning: test build failed.  Please check /tmp/vbox-export-host.log
+ tar -zxf host-modules.tar.gz -C HostDrivers
+ cd -
/tmp/B.e3vtk6dg/BUILD/VirtualBox-7.0.18
+ /bin/rm '--interactive=never' -r kBuild
+ cp -p src/VBox/Frontends/VirtualBox/images/os_linux26.png src/VBox/Frontends/VirtualBox/images/os_pld.png
+ cp -p src/VBox/Frontends/VirtualBox/images/os_linux26_64.png src/VBox/Frontends/VirtualBox/images/os_pld_64.png
+ <<"EOF" 
KBUILD_VERBOSE=3
USERNAME=builder
VBOX_BUILD_PUBLISHER=_PLD
VBOX_VERSION_STRING=$(VBOX_VERSION_MAJOR).$(VBOX_VERSION_MINOR).$(VBOX_VERSION_BUILD)_PLD
XSERVER_VERSION=211
VBOX_USE_SYSTEM_XORG_HEADERS=1
VBOX_USE_SYSTEM_GL_HEADERS=1
VBOX_WITH_LIGHTDM_GREETER=1
VBOX_WITH_LIGHTDM_GREETER_PACKING=1
TOOL_GCC3_CFLAGS=-O2 -fwrapv -pipe -Wformat -Wp,-D_FORTIFY_SOURCE=2 -fstack-protector-strong --param=ssp-buffer-size=4 -Werror=trampolines -march=x86-64 -mtune=generic 
TOOL_GCC3_CXXFLAGS=-O2 -fwrapv -pipe -Wformat -Wp,-D_FORTIFY_SOURCE=2 -fstack-protector-strong --param=ssp-buffer-size=4 -Werror=trampolines -march=x86-64 -mtune=generic 
VBOX_GCC_OPT=-O2 -fwrapv -pipe -Wformat -Wp,-D_FORTIFY_SOURCE=2 -fstack-protector-strong --param=ssp-buffer-size=4 -Werror=trampolines -march=x86-64 -mtune=generic 

TOOL_YASM_AS := /usr/bin/yasm

VBOX_BLD_PYTHON := /usr/bin/python3
VBOX_WITHOUT_PYTHON_LIMITED_API=1

VBOX_PATH_APP_PRIVATE_ARCH := /usr/lib64/VirtualBox
VBOX_PATH_APP_PRIVATE := /usr/share/VirtualBox
VBOX_PATH_SHARED_LIBS := $(VBOX_PATH_APP_PRIVATE_ARCH)
VBOX_WITH_ORIGIN :=
VBOX_WITH_RUNPATH := $(VBOX_PATH_APP_PRIVATE_ARCH)
#VBOX_PATH_APP_DOCS := /usr/share/doc/VirtualBox-doc-7.0.18
VBOX_PATH_DOCBOOK_DTD := /usr/share/sgml/docbook/xml-dtd-4.4

# don't build testcases to save time, they are not needed for the package
VBOX_WITH_TESTCASES :=
VBOX_WITH_TESTSUITE :=

VBOX_WITH_VRDP_RDESKTOP=
VBOX_WITH_MULTIVERSION_PYTHON=0
EOF

+ >>LocalConfig.kmk 
+ cat
+ RPM_EC=0 
+ jobs -p
+ exit 0
Executing(%build): /bin/sh -e /tmp/B.e3vtk6dg/BUILD/tmp/rpm-tmp.97Y43s
TMP=/home/users/builder/tmp
HOME=/home/users/builder
PATH=/home/users/builder/GNUstep/Tools:/bin:/usr/bin:/usr/local/bin:/home/users/builder/bin
TMPDIR=/tmp/B.e3vtk6dg/BUILD/tmp
+ umask 022
+ cd /tmp/B.e3vtk6dg/BUILD
+ cd VirtualBox-7.0.18
+ export 'KERN_DIR=/usr/src/linux'
+ cd kernel/HostDrivers
+ cd vboxdrv
+ compile
+ typeset 'L=<' PATCH_SH
+ set -e -x
+ '[' -r /usr/src/linux/.config ']'
+ rm -rf o
+ install -d o/include/linux o/include/generated o/arch/x86/include o/arch/powerpc/lib
+ ln -sf /usr/src/linux/.config o/.config
+ ln -sf /usr/src/linux/Module.symvers o/Module.symvers
+ '[' -f /usr/src/linux/include/generated/autoconf.h ']'
+ ln -sf /usr/src/linux/include/generated/autoconf.h o/include/generated/autoconf.h
+ ln -s ../generated/autoconf.h o/include/linux/autoconf.h
+ '[' -d /usr/src/linux/arch/x86/include/generated ']'
+ ln -s /usr/src/linux/arch/x86/include/generated o/arch/x86/include
+ set +x
+ install -d o/include/config
+ touch o/include/config/MARKER
+ ln -sf /usr/src/linux/include/config/auto.conf o/include/config/auto.conf
+ ln -sf /usr/src/linux/scripts o/scripts
+ /usr/bin/make -Otarget -j28 -C /usr/src/linux clean 'RCS_FIND_IGNORE=-name '\''*.[ks]o'\'' -o' 'M=/tmp/B.e3vtk6dg/BUILD/VirtualBox-7.0.18/kernel/HostDrivers/vboxdrv' 'HOSTCC=x86_64-pld-linux-gcc' 'SYSSRC=/usr/src/linux' 'SYSOUT=/tmp/B.e3vtk6dg/BUILD/VirtualBox-7.0.18/kernel/HostDrivers/vboxdrv/o' 'V=1' 'ARCH=x86_64' 'CC=x86_64-pld-linux-gcc'
/usr/bin/make --no-print-directory -C /usr/src/linux-6.9.0 \
-f /usr/src/linux-6.9.0/Makefile clean
/usr/bin/make -f ./scripts/Makefile.clean obj=/tmp/B.e3vtk6dg/BUILD/VirtualBox-7.0.18/kernel/HostDrivers/vboxdrv
# cmd_rmfiles clean
  rm -rf /tmp/B.e3vtk6dg/BUILD/VirtualBox-7.0.18/kernel/HostDrivers/vboxdrv/Module.symvers /tmp/B.e3vtk6dg/BUILD/VirtualBox-7.0.18/kernel/HostDrivers/vboxdrv/modules.nsdeps /tmp/B.e3vtk6dg/BUILD/VirtualBox-7.0.18/kernel/HostDrivers/vboxdrv/compile_commands.json /tmp/B.e3vtk6dg/BUILD/VirtualBox-7.0.18/kernel/HostDrivers/vboxdrv/.thinlto-cache
+ /usr/bin/make -Otarget -j28 -C /usr/src/linux modules 'M=/tmp/B.e3vtk6dg/BUILD/VirtualBox-7.0.18/kernel/HostDrivers/vboxdrv' 'CONSTIFY_PLUGIN=' 'HOSTCC=x86_64-pld-linux-gcc' 'SYSSRC=/usr/src/linux' 'SYSOUT=/tmp/B.e3vtk6dg/BUILD/VirtualBox-7.0.18/kernel/HostDrivers/vboxdrv/o' 'V=1' 'ARCH=x86_64' 'CC=x86_64-pld-linux-gcc'
/usr/bin/make --no-print-directory -C /usr/src/linux-6.9.0 \
-f /usr/src/linux-6.9.0/Makefile modules
warning: the compiler differs from the one used to build the kernel
  The kernel was built by: x86_64-pld-linux-gcc (PLD-Linux) 13.2.0 20230727 (release)
  You are using:           x86_64-pld-linux-gcc (PLD-Linux) 13.3.0 20240521 (release)
/usr/bin/make -f ./scripts/Makefile.build obj=/tmp/B.e3vtk6dg/BUILD/VirtualBox-7.0.18/kernel/HostDrivers/vboxdrv need-builtin=1 need-modorder=1 
# cmd_mod /tmp/B.e3vtk6dg/BUILD/VirtualBox-7.0.18/kernel/HostDrivers/vboxdrv/vboxdrv.mod
  printf '%s
'   linux/SUPDrv-linux.o SUPDrv.o SUPDrvGip.o SUPDrvSem.o SUPDrvTracer.o SUPLibAll.o common/string/strformatrt.o combined-agnostic1.o combined-agnostic2.o combined-os-specific.o | awk '!x[$0]++ { print("/tmp/B.e3vtk6dg/BUILD/VirtualBox-7.0.18/kernel/HostDrivers/vboxdrv/"$0) }' > /tmp/B.e3vtk6dg/BUILD/VirtualBox-7.0.18/kernel/HostDrivers/vboxdrv/vboxdrv.mod
# CC [M]  /tmp/B.e3vtk6dg/BUILD/VirtualBox-7.0.18/kernel/HostDrivers/vboxdrv/linux/SUPDrv-linux.o
  x86_64-pld-linux-gcc -Wp,-MMD,/tmp/B.e3vtk6dg/BUILD/VirtualBox-7.0.18/kernel/HostDrivers/vboxdrv/linux/.SUPDrv-linux.o.d -nostdinc -I./arch/x86/include -I./arch/x86/include/generated  -I./include -I./arch/x86/include/uapi -I./arch/x86/include/generated/uapi -I./include/uapi -I./include/generated/uapi -include ./include/linux/compiler-version.h -include ./include/linux/kconfig.h -include ./include/linux/compiler_types.h -D__KERNEL__ -fmacro-prefix-map=./= -std=gnu11 -fshort-wchar -funsigned-char -fno-common -fno-PIE -fno-strict-aliasing -mno-sse -mno-mmx -mno-sse2 -mno-3dnow -mno-avx -fcf-protection=none -m64 -falign-jumps=1 -falign-loops=1 -mno-80387 -mno-fp-ret-in-387 -mpreferred-stack-boundary=3 -mskip-rax-setup -mtune=generic -mno-red-zone -mcmodel=kernel -Wno-sign-compare -fno-asynchronous-unwind-tables -mindirect-branch=thunk-extern -mindirect-branch-register -mindirect-branch-cs-prefix -mfunction-return=thunk-extern -fno-jump-tables -mharden-sls=all -fpatchable-function-entry=16,16 -fno-delete-null-pointer-checks -O2 -fno-allow-store-data-races -fstack-protector-strong -ftrivial-auto-var-init=zero -fno-stack-clash-protection -fzero-call-used-regs=used-gpr -pg -mrecord-mcount -mfentry -DCC_USING_FENTRY -falign-functions=16 -fstrict-flex-arrays=3 -fno-strict-overflow -fno-stack-check -fconserve-stack -Wall -Wundef -Werror=implicit-function-declaration -Werror=implicit-int -Werror=return-type -Werror=strict-prototypes -Wno-format-security -Wno-trigraphs -Wno-frame-address -Wno-address-of-packed-member -Wmissing-declarations -Wmissing-prototypes -Wframe-larger-than=2048 -Wno-main -Wno-unused-but-set-variable -Wno-unused-const-variable -Wno-dangling-pointer -Wvla -Wno-pointer-sign -Wcast-function-type -Wno-stringop-overflow -Wno-array-bounds -Wno-alloc-size-larger-than -Wimplicit-fallthrough=5 -Werror=date-time -Werror=incompatible-pointer-types -Werror=designated-init -Wenum-conversion -Wno-unused-but-set-variable -Wno-unused-const-variable -Wno-restrict -Wno-packed-not-aligned -Wno-format-overflow -Wno-format-truncation -Wno-stringop-truncation -Wno-override-init -Wno-missing-field-initializers -Wno-type-limits -Wno-shift-negative-value -Wno-maybe-uninitialized -Wno-sign-compare -gsplit-dwarf -g -gz=zlib -DRANDSTRUCT -fplugin=./scripts/gcc-plugins/randomize_layout_plugin.so -fplugin-arg-randomize_layout_plugin-performance-mode -fplugin=./scripts/gcc-plugins/stackleak_plugin.so -DSTACKLEAK_PLUGIN -fplugin-arg-stackleak_plugin-track-min-size=100 -fplugin-arg-stackleak_plugin-arch=x86 -include /tmp/B.e3vtk6dg/BUILD/VirtualBox-7.0.18/kernel/HostDrivers/vboxdrv/include/VBox/SUPDrvMangling.h -fno-omit-frame-pointer -fno-pie -Wno-declaration-after-statement -I/usr/src/linux/include -I/tmp/B.e3vtk6dg/BUILD/VirtualBox-7.0.18/kernel/HostDrivers/vboxdrv/ -I/tmp/B.e3vtk6dg/BUILD/VirtualBox-7.0.18/kernel/HostDrivers/vboxdrv/include -I/tmp/B.e3vtk6dg/BUILD/VirtualBox-7.0.18/kernel/HostDrivers/vboxdrv/r0drv/linux -D__KERNEL__ -DMODULE -DRT_WITHOUT_PRAGMA_ONCE -DRT_OS_LINUX -DIN_RING0 -DIN_RT_R0 -DIN_SUP_R0 -DVBOX -DRT_WITH_VBOX -DSUPDRV_WITH_RELEASE_LOGGER -DVBOX_WITHOUT_EFLAGS_AC_SET_IN_VBOXDRV -DIPRT_WITHOUT_EFLAGS_AC_PRESERVING -DVBOX_WITH_64_BITS_GUESTS -DCONFIG_VBOXDRV_AS_MISC -DRT_ARCH_AMD64  -DMODULE  -DKBUILD_BASENAME='"SUPDrv_linux"' -DKBUILD_MODNAME='"vboxdrv"' -D__KBUILD_MODNAME=kmod_vboxdrv -c -o /tmp/B.e3vtk6dg/BUILD/VirtualBox-7.0.18/kernel/HostDrivers/vboxdrv/linux/SUPDrv-linux.o /tmp/B.e3vtk6dg/BUILD/VirtualBox-7.0.18/kernel/HostDrivers/vboxdrv/linux/SUPDrv-linux.c   ; ./tools/objtool/objtool --hacks=jump_label --hacks=noinstr --hacks=skylake --orc --retpoline --rethunk --sls --static-call --uaccess --prefix=16   --module /tmp/B.e3vtk6dg/BUILD/VirtualBox-7.0.18/kernel/HostDrivers/vboxdrv/linux/SUPDrv-linux.o
cc1: error: incompatible gcc/plugin versions
cc1: error: failed to initialize plugin ./scripts/gcc-plugins/stackleak_plugin.so
cc1: error: incompatible gcc/plugin versions
cc1: error: failed to initialize plugin ./scripts/gcc-plugins/randomize_layout_plugin.so
make[2]: *** [scripts/Makefile.build:244: /tmp/B.e3vtk6dg/BUILD/VirtualBox-7.0.18/kernel/HostDrivers/vboxdrv/linux/SUPDrv-linux.o] Error 1
make[2]: *** Waiting for unfinished jobs....
# CC [M]  /tmp/B.e3vtk6dg/BUILD/VirtualBox-7.0.18/kernel/HostDrivers/vboxdrv/SUPDrvGip.o
  x86_64-pld-linux-gcc -Wp,-MMD,/tmp/B.e3vtk6dg/BUILD/VirtualBox-7.0.18/kernel/HostDrivers/vboxdrv/.SUPDrvGip.o.d -nostdinc -I./arch/x86/include -I./arch/x86/include/generated  -I./include -I./arch/x86/include/uapi -I./arch/x86/include/generated/uapi -I./include/uapi -I./include/generated/uapi -include ./include/linux/compiler-version.h -include ./include/linux/kconfig.h -include ./include/linux/compiler_types.h -D__KERNEL__ -fmacro-prefix-map=./= -std=gnu11 -fshort-wchar -funsigned-char -fno-common -fno-PIE -fno-strict-aliasing -mno-sse -mno-mmx -mno-sse2 -mno-3dnow -mno-avx -fcf-protection=none -m64 -falign-jumps=1 -falign-loops=1 -mno-80387 -mno-fp-ret-in-387 -mpreferred-stack-boundary=3 -mskip-rax-setup -mtune=generic -mno-red-zone -mcmodel=kernel -Wno-sign-compare -fno-asynchronous-unwind-tables -mindirect-branch=thunk-extern -mindirect-branch-register -mindirect-branch-cs-prefix -mfunction-return=thunk-extern -fno-jump-tables -mharden-sls=all -fpatchable-function-entry=16,16 -fno-delete-null-pointer-checks -O2 -fno-allow-store-data-races -fstack-protector-strong -ftrivial-auto-var-init=zero -fno-stack-clash-protection -fzero-call-used-regs=used-gpr -pg -mrecord-mcount -mfentry -DCC_USING_FENTRY -falign-functions=16 -fstrict-flex-arrays=3 -fno-strict-overflow -fno-stack-check -fconserve-stack -Wall -Wundef -Werror=implicit-function-declaration -Werror=implicit-int -Werror=return-type -Werror=strict-prototypes -Wno-format-security -Wno-trigraphs -Wno-frame-address -Wno-address-of-packed-member -Wmissing-declarations -Wmissing-prototypes -Wframe-larger-than=2048 -Wno-main -Wno-unused-but-set-variable -Wno-unused-const-variable -Wno-dangling-pointer -Wvla -Wno-pointer-sign -Wcast-function-type -Wno-stringop-overflow -Wno-array-bounds -Wno-alloc-size-larger-than -Wimplicit-fallthrough=5 -Werror=date-time -Werror=incompatible-pointer-types -Werror=designated-init -Wenum-conversion -Wno-unused-but-set-variable -Wno-unused-const-variable -Wno-restrict -Wno-packed-not-aligned -Wno-format-overflow -Wno-format-truncation -Wno-stringop-truncation -Wno-override-init -Wno-missing-field-initializers -Wno-type-limits -Wno-shift-negative-value -Wno-maybe-uninitialized -Wno-sign-compare -gsplit-dwarf -g -gz=zlib -DRANDSTRUCT -fplugin=./scripts/gcc-plugins/randomize_layout_plugin.so -fplugin-arg-randomize_layout_plugin-performance-mode -fplugin=./scripts/gcc-plugins/stackleak_plugin.so -DSTACKLEAK_PLUGIN -fplugin-arg-stackleak_plugin-track-min-size=100 -fplugin-arg-stackleak_plugin-arch=x86 -include /tmp/B.e3vtk6dg/BUILD/VirtualBox-7.0.18/kernel/HostDrivers/vboxdrv/include/VBox/SUPDrvMangling.h -fno-omit-frame-pointer -fno-pie -Wno-declaration-after-statement -I/usr/src/linux/include -I/tmp/B.e3vtk6dg/BUILD/VirtualBox-7.0.18/kernel/HostDrivers/vboxdrv/ -I/tmp/B.e3vtk6dg/BUILD/VirtualBox-7.0.18/kernel/HostDrivers/vboxdrv/include -I/tmp/B.e3vtk6dg/BUILD/VirtualBox-7.0.18/kernel/HostDrivers/vboxdrv/r0drv/linux -D__KERNEL__ -DMODULE -DRT_WITHOUT_PRAGMA_ONCE -DRT_OS_LINUX -DIN_RING0 -DIN_RT_R0 -DIN_SUP_R0 -DVBOX -DRT_WITH_VBOX -DSUPDRV_WITH_RELEASE_LOGGER -DVBOX_WITHOUT_EFLAGS_AC_SET_IN_VBOXDRV -DIPRT_WITHOUT_EFLAGS_AC_PRESERVING -DVBOX_WITH_64_BITS_GUESTS -DCONFIG_VBOXDRV_AS_MISC -DRT_ARCH_AMD64  -DMODULE  -DKBUILD_BASENAME='"SUPDrvGip"' -DKBUILD_MODNAME='"vboxdrv"' -D__KBUILD_MODNAME=kmod_vboxdrv -c -o /tmp/B.e3vtk6dg/BUILD/VirtualBox-7.0.18/kernel/HostDrivers/vboxdrv/SUPDrvGip.o /tmp/B.e3vtk6dg/BUILD/VirtualBox-7.0.18/kernel/HostDrivers/vboxdrv/SUPDrvGip.c   ; ./tools/objtool/objtool --hacks=jump_label --hacks=noinstr --hacks=skylake --orc --retpoline --rethunk --sls --static-call --uaccess --prefix=16   --module /tmp/B.e3vtk6dg/BUILD/VirtualBox-7.0.18/kernel/HostDrivers/vboxdrv/SUPDrvGip.o
cc1: error: incompatible gcc/plugin versions
cc1: error: failed to initialize plugin ./scripts/gcc-plugins/stackleak_plugin.so
cc1: error: incompatible gcc/plugin versions
cc1: error: failed to initialize plugin ./scripts/gcc-plugins/randomize_layout_plugin.so
make[2]: *** [scripts/Makefile.build:244: /tmp/B.e3vtk6dg/BUILD/VirtualBox-7.0.18/kernel/HostDrivers/vboxdrv/SUPDrvGip.o] Error 1
# CC [M]  /tmp/B.e3vtk6dg/BUILD/VirtualBox-7.0.18/kernel/HostDrivers/vboxdrv/SUPDrv.o
  x86_64-pld-linux-gcc -Wp,-MMD,/tmp/B.e3vtk6dg/BUILD/VirtualBox-7.0.18/kernel/HostDrivers/vboxdrv/.SUPDrv.o.d -nostdinc -I./arch/x86/include -I./arch/x86/include/generated  -I./include -I./arch/x86/include/uapi -I./arch/x86/include/generated/uapi -I./include/uapi -I./include/generated/uapi -include ./include/linux/compiler-version.h -include ./include/linux/kconfig.h -include ./include/linux/compiler_types.h -D__KERNEL__ -fmacro-prefix-map=./= -std=gnu11 -fshort-wchar -funsigned-char -fno-common -fno-PIE -fno-strict-aliasing -mno-sse -mno-mmx -mno-sse2 -mno-3dnow -mno-avx -fcf-protection=none -m64 -falign-jumps=1 -falign-loops=1 -mno-80387 -mno-fp-ret-in-387 -mpreferred-stack-boundary=3 -mskip-rax-setup -mtune=generic -mno-red-zone -mcmodel=kernel -Wno-sign-compare -fno-asynchronous-unwind-tables -mindirect-branch=thunk-extern -mindirect-branch-register -mindirect-branch-cs-prefix -mfunction-return=thunk-extern -fno-jump-tables -mharden-sls=all -fpatchable-function-entry=16,16 -fno-delete-null-pointer-checks -O2 -fno-allow-store-data-races -fstack-protector-strong -ftrivial-auto-var-init=zero -fno-stack-clash-protection -fzero-call-used-regs=used-gpr -pg -mrecord-mcount -mfentry -DCC_USING_FENTRY -falign-functions=16 -fstrict-flex-arrays=3 -fno-strict-overflow -fno-stack-check -fconserve-stack -Wall -Wundef -Werror=implicit-function-declaration -Werror=implicit-int -Werror=return-type -Werror=strict-prototypes -Wno-format-security -Wno-trigraphs -Wno-frame-address -Wno-address-of-packed-member -Wmissing-declarations -Wmissing-prototypes -Wframe-larger-than=2048 -Wno-main -Wno-unused-but-set-variable -Wno-unused-const-variable -Wno-dangling-pointer -Wvla -Wno-pointer-sign -Wcast-function-type -Wno-stringop-overflow -Wno-array-bounds -Wno-alloc-size-larger-than -Wimplicit-fallthrough=5 -Werror=date-time -Werror=incompatible-pointer-types -Werror=designated-init -Wenum-conversion -Wno-unused-but-set-variable -Wno-unused-const-variable -Wno-restrict -Wno-packed-not-aligned -Wno-format-overflow -Wno-format-truncation -Wno-stringop-truncation -Wno-override-init -Wno-missing-field-initializers -Wno-type-limits -Wno-shift-negative-value -Wno-maybe-uninitialized -Wno-sign-compare -gsplit-dwarf -g -gz=zlib -DRANDSTRUCT -fplugin=./scripts/gcc-plugins/randomize_layout_plugin.so -fplugin-arg-randomize_layout_plugin-performance-mode -fplugin=./scripts/gcc-plugins/stackleak_plugin.so -DSTACKLEAK_PLUGIN -fplugin-arg-stackleak_plugin-track-min-size=100 -fplugin-arg-stackleak_plugin-arch=x86 -include /tmp/B.e3vtk6dg/BUILD/VirtualBox-7.0.18/kernel/HostDrivers/vboxdrv/include/VBox/SUPDrvMangling.h -fno-omit-frame-pointer -fno-pie -Wno-declaration-after-statement -I/usr/src/linux/include -I/tmp/B.e3vtk6dg/BUILD/VirtualBox-7.0.18/kernel/HostDrivers/vboxdrv/ -I/tmp/B.e3vtk6dg/BUILD/VirtualBox-7.0.18/kernel/HostDrivers/vboxdrv/include -I/tmp/B.e3vtk6dg/BUILD/VirtualBox-7.0.18/kernel/HostDrivers/vboxdrv/r0drv/linux -D__KERNEL__ -DMODULE -DRT_WITHOUT_PRAGMA_ONCE -DRT_OS_LINUX -DIN_RING0 -DIN_RT_R0 -DIN_SUP_R0 -DVBOX -DRT_WITH_VBOX -DSUPDRV_WITH_RELEASE_LOGGER -DVBOX_WITHOUT_EFLAGS_AC_SET_IN_VBOXDRV -DIPRT_WITHOUT_EFLAGS_AC_PRESERVING -DVBOX_WITH_64_BITS_GUESTS -DCONFIG_VBOXDRV_AS_MISC -DRT_ARCH_AMD64  -DMODULE  -DKBUILD_BASENAME='"SUPDrv"' -DKBUILD_MODNAME='"vboxdrv"' -D__KBUILD_MODNAME=kmod_vboxdrv -c -o /tmp/B.e3vtk6dg/BUILD/VirtualBox-7.0.18/kernel/HostDrivers/vboxdrv/SUPDrv.o /tmp/B.e3vtk6dg/BUILD/VirtualBox-7.0.18/kernel/HostDrivers/vboxdrv/SUPDrv.c   ; ./tools/objtool/objtool --hacks=jump_label --hacks=noinstr --hacks=skylake --orc --retpoline --rethunk --sls --static-call --uaccess --prefix=16   --module /tmp/B.e3vtk6dg/BUILD/VirtualBox-7.0.18/kernel/HostDrivers/vboxdrv/SUPDrv.o
cc1: error: incompatible gcc/plugin versions
cc1: error: failed to initialize plugin ./scripts/gcc-plugins/stackleak_plugin.so
cc1: error: incompatible gcc/plugin versions
cc1: error: failed to initialize plugin ./scripts/gcc-plugins/randomize_layout_plugin.so
make[2]: *** [scripts/Makefile.build:244: /tmp/B.e3vtk6dg/BUILD/VirtualBox-7.0.18/kernel/HostDrivers/vboxdrv/SUPDrv.o] Error 1
# CC [M]  /tmp/B.e3vtk6dg/BUILD/VirtualBox-7.0.18/kernel/HostDrivers/vboxdrv/SUPDrvSem.o
  x86_64-pld-linux-gcc -Wp,-MMD,/tmp/B.e3vtk6dg/BUILD/VirtualBox-7.0.18/kernel/HostDrivers/vboxdrv/.SUPDrvSem.o.d -nostdinc -I./arch/x86/include -I./arch/x86/include/generated  -I./include -I./arch/x86/include/uapi -I./arch/x86/include/generated/uapi -I./include/uapi -I./include/generated/uapi -include ./include/linux/compiler-version.h -include ./include/linux/kconfig.h -include ./include/linux/compiler_types.h -D__KERNEL__ -fmacro-prefix-map=./= -std=gnu11 -fshort-wchar -funsigned-char -fno-common -fno-PIE -fno-strict-aliasing -mno-sse -mno-mmx -mno-sse2 -mno-3dnow -mno-avx -fcf-protection=none -m64 -falign-jumps=1 -falign-loops=1 -mno-80387 -mno-fp-ret-in-387 -mpreferred-stack-boundary=3 -mskip-rax-setup -mtune=generic -mno-red-zone -mcmodel=kernel -Wno-sign-compare -fno-asynchronous-unwind-tables -mindirect-branch=thunk-extern -mindirect-branch-register -mindirect-branch-cs-prefix -mfunction-return=thunk-extern -fno-jump-tables -mharden-sls=all -fpatchable-function-entry=16,16 -fno-delete-null-pointer-checks -O2 -fno-allow-store-data-races -fstack-protector-strong -ftrivial-auto-var-init=zero -fno-stack-clash-protection -fzero-call-used-regs=used-gpr -pg -mrecord-mcount -mfentry -DCC_USING_FENTRY -falign-functions=16 -fstrict-flex-arrays=3 -fno-strict-overflow -fno-stack-check -fconserve-stack -Wall -Wundef -Werror=implicit-function-declaration -Werror=implicit-int -Werror=return-type -Werror=strict-prototypes -Wno-format-security -Wno-trigraphs -Wno-frame-address -Wno-address-of-packed-member -Wmissing-declarations -Wmissing-prototypes -Wframe-larger-than=2048 -Wno-main -Wno-unused-but-set-variable -Wno-unused-const-variable -Wno-dangling-pointer -Wvla -Wno-pointer-sign -Wcast-function-type -Wno-stringop-overflow -Wno-array-bounds -Wno-alloc-size-larger-than -Wimplicit-fallthrough=5 -Werror=date-time -Werror=incompatible-pointer-types -Werror=designated-init -Wenum-conversion -Wno-unused-but-set-variable -Wno-unused-const-variable -Wno-restrict -Wno-packed-not-aligned -Wno-format-overflow -Wno-format-truncation -Wno-stringop-truncation -Wno-override-init -Wno-missing-field-initializers -Wno-type-limits -Wno-shift-negative-value -Wno-maybe-uninitialized -Wno-sign-compare -gsplit-dwarf -g -gz=zlib -DRANDSTRUCT -fplugin=./scripts/gcc-plugins/randomize_layout_plugin.so -fplugin-arg-randomize_layout_plugin-performance-mode -fplugin=./scripts/gcc-plugins/stackleak_plugin.so -DSTACKLEAK_PLUGIN -fplugin-arg-stackleak_plugin-track-min-size=100 -fplugin-arg-stackleak_plugin-arch=x86 -include /tmp/B.e3vtk6dg/BUILD/VirtualBox-7.0.18/kernel/HostDrivers/vboxdrv/include/VBox/SUPDrvMangling.h -fno-omit-frame-pointer -fno-pie -Wno-declaration-after-statement -I/usr/src/linux/include -I/tmp/B.e3vtk6dg/BUILD/VirtualBox-7.0.18/kernel/HostDrivers/vboxdrv/ -I/tmp/B.e3vtk6dg/BUILD/VirtualBox-7.0.18/kernel/HostDrivers/vboxdrv/include -I/tmp/B.e3vtk6dg/BUILD/VirtualBox-7.0.18/kernel/HostDrivers/vboxdrv/r0drv/linux -D__KERNEL__ -DMODULE -DRT_WITHOUT_PRAGMA_ONCE -DRT_OS_LINUX -DIN_RING0 -DIN_RT_R0 -DIN_SUP_R0 -DVBOX -DRT_WITH_VBOX -DSUPDRV_WITH_RELEASE_LOGGER -DVBOX_WITHOUT_EFLAGS_AC_SET_IN_VBOXDRV -DIPRT_WITHOUT_EFLAGS_AC_PRESERVING -DVBOX_WITH_64_BITS_GUESTS -DCONFIG_VBOXDRV_AS_MISC -DRT_ARCH_AMD64  -DMODULE  -DKBUILD_BASENAME='"SUPDrvSem"' -DKBUILD_MODNAME='"vboxdrv"' -D__KBUILD_MODNAME=kmod_vboxdrv -c -o /tmp/B.e3vtk6dg/BUILD/VirtualBox-7.0.18/kernel/HostDrivers/vboxdrv/SUPDrvSem.o /tmp/B.e3vtk6dg/BUILD/VirtualBox-7.0.18/kernel/HostDrivers/vboxdrv/SUPDrvSem.c   ; ./tools/objtool/objtool --hacks=jump_label --hacks=noinstr --hacks=skylake --orc --retpoline --rethunk --sls --static-call --uaccess --prefix=16   --module /tmp/B.e3vtk6dg/BUILD/VirtualBox-7.0.18/kernel/HostDrivers/vboxdrv/SUPDrvSem.o
cc1: error: incompatible gcc/plugin versions
cc1: error: failed to initialize plugin ./scripts/gcc-plugins/stackleak_plugin.so
cc1: error: incompatible gcc/plugin versions
cc1: error: failed to initialize plugin ./scripts/gcc-plugins/randomize_layout_plugin.so
make[2]: *** [scripts/Makefile.build:244: /tmp/B.e3vtk6dg/BUILD/VirtualBox-7.0.18/kernel/HostDrivers/vboxdrv/SUPDrvSem.o] Error 1
# CC [M]  /tmp/B.e3vtk6dg/BUILD/VirtualBox-7.0.18/kernel/HostDrivers/vboxdrv/SUPDrvTracer.o
  x86_64-pld-linux-gcc -Wp,-MMD,/tmp/B.e3vtk6dg/BUILD/VirtualBox-7.0.18/kernel/HostDrivers/vboxdrv/.SUPDrvTracer.o.d -nostdinc -I./arch/x86/include -I./arch/x86/include/generated  -I./include -I./arch/x86/include/uapi -I./arch/x86/include/generated/uapi -I./include/uapi -I./include/generated/uapi -include ./include/linux/compiler-version.h -include ./include/linux/kconfig.h -include ./include/linux/compiler_types.h -D__KERNEL__ -fmacro-prefix-map=./= -std=gnu11 -fshort-wchar -funsigned-char -fno-common -fno-PIE -fno-strict-aliasing -mno-sse -mno-mmx -mno-sse2 -mno-3dnow -mno-avx -fcf-protection=none -m64 -falign-jumps=1 -falign-loops=1 -mno-80387 -mno-fp-ret-in-387 -mpreferred-stack-boundary=3 -mskip-rax-setup -mtune=generic -mno-red-zone -mcmodel=kernel -Wno-sign-compare -fno-asynchronous-unwind-tables -mindirect-branch=thunk-extern -mindirect-branch-register -mindirect-branch-cs-prefix -mfunction-return=thunk-extern -fno-jump-tables -mharden-sls=all -fpatchable-function-entry=16,16 -fno-delete-null-pointer-checks -O2 -fno-allow-store-data-races -fstack-protector-strong -ftrivial-auto-var-init=zero -fno-stack-clash-protection -fzero-call-used-regs=used-gpr -pg -mrecord-mcount -mfentry -DCC_USING_FENTRY -falign-functions=16 -fstrict-flex-arrays=3 -fno-strict-overflow -fno-stack-check -fconserve-stack -Wall -Wundef -Werror=implicit-function-declaration -Werror=implicit-int -Werror=return-type -Werror=strict-prototypes -Wno-format-security -Wno-trigraphs -Wno-frame-address -Wno-address-of-packed-member -Wmissing-declarations -Wmissing-prototypes -Wframe-larger-than=2048 -Wno-main -Wno-unused-but-set-variable -Wno-unused-const-variable -Wno-dangling-pointer -Wvla -Wno-pointer-sign -Wcast-function-type -Wno-stringop-overflow -Wno-array-bounds -Wno-alloc-size-larger-than -Wimplicit-fallthrough=5 -Werror=date-time -Werror=incompatible-pointer-types -Werror=designated-init -Wenum-conversion -Wno-unused-but-set-variable -Wno-unused-const-variable -Wno-restrict -Wno-packed-not-aligned -Wno-format-overflow -Wno-format-truncation -Wno-stringop-truncation -Wno-override-init -Wno-missing-field-initializers -Wno-type-limits -Wno-shift-negative-value -Wno-maybe-uninitialized -Wno-sign-compare -gsplit-dwarf -g -gz=zlib -DRANDSTRUCT -fplugin=./scripts/gcc-plugins/randomize_layout_plugin.so -fplugin-arg-randomize_layout_plugin-performance-mode -fplugin=./scripts/gcc-plugins/stackleak_plugin.so -DSTACKLEAK_PLUGIN -fplugin-arg-stackleak_plugin-track-min-size=100 -fplugin-arg-stackleak_plugin-arch=x86 -include /tmp/B.e3vtk6dg/BUILD/VirtualBox-7.0.18/kernel/HostDrivers/vboxdrv/include/VBox/SUPDrvMangling.h -fno-omit-frame-pointer -fno-pie -Wno-declaration-after-statement -I/usr/src/linux/include -I/tmp/B.e3vtk6dg/BUILD/VirtualBox-7.0.18/kernel/HostDrivers/vboxdrv/ -I/tmp/B.e3vtk6dg/BUILD/VirtualBox-7.0.18/kernel/HostDrivers/vboxdrv/include -I/tmp/B.e3vtk6dg/BUILD/VirtualBox-7.0.18/kernel/HostDrivers/vboxdrv/r0drv/linux -D__KERNEL__ -DMODULE -DRT_WITHOUT_PRAGMA_ONCE -DRT_OS_LINUX -DIN_RING0 -DIN_RT_R0 -DIN_SUP_R0 -DVBOX -DRT_WITH_VBOX -DSUPDRV_WITH_RELEASE_LOGGER -DVBOX_WITHOUT_EFLAGS_AC_SET_IN_VBOXDRV -DIPRT_WITHOUT_EFLAGS_AC_PRESERVING -DVBOX_WITH_64_BITS_GUESTS -DCONFIG_VBOXDRV_AS_MISC -DRT_ARCH_AMD64  -DMODULE  -DKBUILD_BASENAME='"SUPDrvTracer"' -DKBUILD_MODNAME='"vboxdrv"' -D__KBUILD_MODNAME=kmod_vboxdrv -c -o /tmp/B.e3vtk6dg/BUILD/VirtualBox-7.0.18/kernel/HostDrivers/vboxdrv/SUPDrvTracer.o /tmp/B.e3vtk6dg/BUILD/VirtualBox-7.0.18/kernel/HostDrivers/vboxdrv/SUPDrvTracer.c   ; ./tools/objtool/objtool --hacks=jump_label --hacks=noinstr --hacks=skylake --orc --retpoline --rethunk --sls --static-call --uaccess --prefix=16   --module /tmp/B.e3vtk6dg/BUILD/VirtualBox-7.0.18/kernel/HostDrivers/vboxdrv/SUPDrvTracer.o
cc1: error: incompatible gcc/plugin versions
cc1: error: failed to initialize plugin ./scripts/gcc-plugins/stackleak_plugin.so
cc1: error: incompatible gcc/plugin versions
cc1: error: failed to initialize plugin ./scripts/gcc-plugins/randomize_layout_plugin.so
make[2]: *** [scripts/Makefile.build:244: /tmp/B.e3vtk6dg/BUILD/VirtualBox-7.0.18/kernel/HostDrivers/vboxdrv/SUPDrvTracer.o] Error 1
# CC [M]  /tmp/B.e3vtk6dg/BUILD/VirtualBox-7.0.18/kernel/HostDrivers/vboxdrv/SUPLibAll.o
  x86_64-pld-linux-gcc -Wp,-MMD,/tmp/B.e3vtk6dg/BUILD/VirtualBox-7.0.18/kernel/HostDrivers/vboxdrv/.SUPLibAll.o.d -nostdinc -I./arch/x86/include -I./arch/x86/include/generated  -I./include -I./arch/x86/include/uapi -I./arch/x86/include/generated/uapi -I./include/uapi -I./include/generated/uapi -include ./include/linux/compiler-version.h -include ./include/linux/kconfig.h -include ./include/linux/compiler_types.h -D__KERNEL__ -fmacro-prefix-map=./= -std=gnu11 -fshort-wchar -funsigned-char -fno-common -fno-PIE -fno-strict-aliasing -mno-sse -mno-mmx -mno-sse2 -mno-3dnow -mno-avx -fcf-protection=none -m64 -falign-jumps=1 -falign-loops=1 -mno-80387 -mno-fp-ret-in-387 -mpreferred-stack-boundary=3 -mskip-rax-setup -mtune=generic -mno-red-zone -mcmodel=kernel -Wno-sign-compare -fno-asynchronous-unwind-tables -mindirect-branch=thunk-extern -mindirect-branch-register -mindirect-branch-cs-prefix -mfunction-return=thunk-extern -fno-jump-tables -mharden-sls=all -fpatchable-function-entry=16,16 -fno-delete-null-pointer-checks -O2 -fno-allow-store-data-races -fstack-protector-strong -ftrivial-auto-var-init=zero -fno-stack-clash-protection -fzero-call-used-regs=used-gpr -pg -mrecord-mcount -mfentry -DCC_USING_FENTRY -falign-functions=16 -fstrict-flex-arrays=3 -fno-strict-overflow -fno-stack-check -fconserve-stack -Wall -Wundef -Werror=implicit-function-declaration -Werror=implicit-int -Werror=return-type -Werror=strict-prototypes -Wno-format-security -Wno-trigraphs -Wno-frame-address -Wno-address-of-packed-member -Wmissing-declarations -Wmissing-prototypes -Wframe-larger-than=2048 -Wno-main -Wno-unused-but-set-variable -Wno-unused-const-variable -Wno-dangling-pointer -Wvla -Wno-pointer-sign -Wcast-function-type -Wno-stringop-overflow -Wno-array-bounds -Wno-alloc-size-larger-than -Wimplicit-fallthrough=5 -Werror=date-time -Werror=incompatible-pointer-types -Werror=designated-init -Wenum-conversion -Wno-unused-but-set-variable -Wno-unused-const-variable -Wno-restrict -Wno-packed-not-aligned -Wno-format-overflow -Wno-format-truncation -Wno-stringop-truncation -Wno-override-init -Wno-missing-field-initializers -Wno-type-limits -Wno-shift-negative-value -Wno-maybe-uninitialized -Wno-sign-compare -gsplit-dwarf -g -gz=zlib -DRANDSTRUCT -fplugin=./scripts/gcc-plugins/randomize_layout_plugin.so -fplugin-arg-randomize_layout_plugin-performance-mode -fplugin=./scripts/gcc-plugins/stackleak_plugin.so -DSTACKLEAK_PLUGIN -fplugin-arg-stackleak_plugin-track-min-size=100 -fplugin-arg-stackleak_plugin-arch=x86 -include /tmp/B.e3vtk6dg/BUILD/VirtualBox-7.0.18/kernel/HostDrivers/vboxdrv/include/VBox/SUPDrvMangling.h -fno-omit-frame-pointer -fno-pie -Wno-declaration-after-statement -I/usr/src/linux/include -I/tmp/B.e3vtk6dg/BUILD/VirtualBox-7.0.18/kernel/HostDrivers/vboxdrv/ -I/tmp/B.e3vtk6dg/BUILD/VirtualBox-7.0.18/kernel/HostDrivers/vboxdrv/include -I/tmp/B.e3vtk6dg/BUILD/VirtualBox-7.0.18/kernel/HostDrivers/vboxdrv/r0drv/linux -D__KERNEL__ -DMODULE -DRT_WITHOUT_PRAGMA_ONCE -DRT_OS_LINUX -DIN_RING0 -DIN_RT_R0 -DIN_SUP_R0 -DVBOX -DRT_WITH_VBOX -DSUPDRV_WITH_RELEASE_LOGGER -DVBOX_WITHOUT_EFLAGS_AC_SET_IN_VBOXDRV -DIPRT_WITHOUT_EFLAGS_AC_PRESERVING -DVBOX_WITH_64_BITS_GUESTS -DCONFIG_VBOXDRV_AS_MISC -DRT_ARCH_AMD64  -DMODULE  -DKBUILD_BASENAME='"SUPLibAll"' -DKBUILD_MODNAME='"vboxdrv"' -D__KBUILD_MODNAME=kmod_vboxdrv -c -o /tmp/B.e3vtk6dg/BUILD/VirtualBox-7.0.18/kernel/HostDrivers/vboxdrv/SUPLibAll.o /tmp/B.e3vtk6dg/BUILD/VirtualBox-7.0.18/kernel/HostDrivers/vboxdrv/SUPLibAll.c   ; ./tools/objtool/objtool --hacks=jump_label --hacks=noinstr --hacks=skylake --orc --retpoline --rethunk --sls --static-call --uaccess --prefix=16   --module /tmp/B.e3vtk6dg/BUILD/VirtualBox-7.0.18/kernel/HostDrivers/vboxdrv/SUPLibAll.o
cc1: error: incompatible gcc/plugin versions
cc1: error: failed to initialize plugin ./scripts/gcc-plugins/stackleak_plugin.so
cc1: error: incompatible gcc/plugin versions
cc1: error: failed to initialize plugin ./scripts/gcc-plugins/randomize_layout_plugin.so
make[2]: *** [scripts/Makefile.build:244: /tmp/B.e3vtk6dg/BUILD/VirtualBox-7.0.18/kernel/HostDrivers/vboxdrv/SUPLibAll.o] Error 1
make[1]: *** [/usr/src/linux-6.9.0/Makefile:1919: /tmp/B.e3vtk6dg/BUILD/VirtualBox-7.0.18/kernel/HostDrivers/vboxdrv] Error 2
make: *** [Makefile:240: __sub-make] Error 2
error: Bad exit status from /tmp/B.e3vtk6dg/BUILD/tmp/rpm-tmp.97Y43s (%build)

RPM build warnings:
    line 542: It's not recommended to have unversioned Obsoletes: Obsoletes:	kernel-init-guest
    line 542: It's not recommended to have unversioned Obsoletes: Obsoletes:	kernel-init-host
    line 542: It's not recommended to have unversioned Obsoletes: Obsoletes:	kernel-init-guest
    line 542: It's not recommended to have unversioned Obsoletes: Obsoletes:	kernel-init-host
    line 542: It's not recommended to have unversioned Obsoletes: Obsoletes:	kernel-init-guest
    line 542: It's not recommended to have unversioned Obsoletes: Obsoletes:	kernel-init-host
    line 542: It's not recommended to have unversioned Obsoletes: Obsoletes:	kernel-init-guest
    line 542: It's not recommended to have unversioned Obsoletes: Obsoletes:	kernel-init-host
    line 542: It's not recommended to have unversioned Obsoletes: Obsoletes:	kernel-init-guest
    line 542: It's not recommended to have unversioned Obsoletes: Obsoletes:	kernel-init-host
    line 542: It's not recommended to have unversioned Obsoletes: Obsoletes:	kernel-init-guest
    line 542: It's not recommended to have unversioned Obsoletes: Obsoletes:	kernel-init-host
    Could not canonicalize hostname: ymir

RPM build errors:
    Bad exit status from /tmp/B.e3vtk6dg/BUILD/tmp/rpm-tmp.97Y43s (%build)
ended at: Fri May 24 22:42:37 2024, done in 0:00:50.182279
error: No files produced.
+ chmod -R u+rwX /tmp/B.e3vtk6dg/BUILD
+ rm -rf /tmp/B.e3vtk6dg/tmp /tmp/B.e3vtk6dg/BUILD
+ rm -rf /tmp/B.e3vtk6dg
Begin-PLD-Builder-Info
Build-Time: user:68.44s sys:31.50s real:106.23s (faults io:1 non-io:2194414)

End-PLD-Builder-Info
[Back to list of logs] [View rpm -qa of builder]