FailedOk

th/SRPMS[OK]
th/x32[OK]
th/i686[OK]
th/x86_64[OK]

ac/SRPMS[OK]
ac/i386[OK]
ac/i586[OK]
ac/i686[OK]
ac/alpha[OK]
ac/amd64[OK]
ac/athlon[OK]
ac/ppc[OK]
ac/sparc[OK]
ac/sparc64[OK]

Advanced Search
main()
Powered by PLD Linux
(c) 2002-2021 PLD Team
$Revision: 1.37 $
Powered by The Golden Path.
Your IP: 52.23.219.12

abseil-cpp 450206f2-6545-4bf6-a8f5-01845e8573df

Status:Failed
Source URL:https://buildlogs.pld-linux.org/pld/th/x86_64/FAIL/abseil-cpp,450206f2-6545-4bf6-a8f5-01845e8573df.bz2
text/plain URL:View!
full text:View!
rpm -qa of builder:View!
Date:2021/11/20 23:07:36
Runtime:0:00:17.478112

Toc:

  • error 1
  • /tmp/B.vjset3iy/BUILD/abseil-cpp-20200923.3/absl/debugging/failure_signal_handler.cc:138:32: error: no matching function for call to 'max(long int, int)'
  • error 2
  • make[2]: *** [absl/debugging/CMakeFiles/failure_signal_handler.dir/build.make:86: absl/debugging/CMakeFiles/failure_signal_handler.dir/failure_signal_handler.cc.o] Error 1
  • error 3
  • make[1]: *** [CMakeFiles/Makefile2:1166: absl/debugging/CMakeFiles/failure_signal_handler.dir/all] Error 2
  • error 4
  • error: Bad exit status from /tmp/B.vjset3iy/BUILD/tmp/rpm-tmp.8sKT1q (%build)
  • error 5
  • RPM build errors:
  • error 6
  • error: No files produced.

Content:

cd /tmp/B.vjset3iy/BUILD/abseil-cpp-20200923.3/build-static/absl/time && /usr/bin/cmake -E cmake_link_script CMakeFiles/time.dir/link.txt --verbose=1
/usr/bin/ar qc libabsl_time.a  CMakeFiles/time.dir/civil_time.cc.o CMakeFiles/time.dir/clock.cc.o CMakeFiles/time.dir/duration.cc.o CMakeFiles/time.dir/format.cc.o CMakeFiles/time.dir/time.cc.o
/usr/bin/ranlib libabsl_time.a
make[2]: Leaving directory '/tmp/B.vjset3iy/BUILD/abseil-cpp-20200923.3/build-static'
make[1]: Entering directory '/tmp/B.vjset3iy/BUILD/abseil-cpp-20200923.3/build-static'
[ 71%] Built target time
make[1]: Leaving directory '/tmp/B.vjset3iy/BUILD/abseil-cpp-20200923.3/build-static'
/usr/bin/make  -f absl/synchronization/CMakeFiles/synchronization.dir/build.make absl/synchronization/CMakeFiles/synchronization.dir/depend
make[2]: Entering directory '/tmp/B.vjset3iy/BUILD/abseil-cpp-20200923.3/build-static'
cd /tmp/B.vjset3iy/BUILD/abseil-cpp-20200923.3/build-static && /usr/bin/cmake -E cmake_depends "Unix Makefiles" /tmp/B.vjset3iy/BUILD/abseil-cpp-20200923.3 /tmp/B.vjset3iy/BUILD/abseil-cpp-20200923.3/absl/synchronization /tmp/B.vjset3iy/BUILD/abseil-cpp-20200923.3/build-static /tmp/B.vjset3iy/BUILD/abseil-cpp-20200923.3/build-static/absl/synchronization /tmp/B.vjset3iy/BUILD/abseil-cpp-20200923.3/build-static/absl/synchronization/CMakeFiles/synchronization.dir/DependInfo.cmake --color=
Scanning dependencies of target synchronization
make[2]: Leaving directory '/tmp/B.vjset3iy/BUILD/abseil-cpp-20200923.3/build-static'
/usr/bin/make  -f absl/synchronization/CMakeFiles/synchronization.dir/build.make absl/synchronization/CMakeFiles/synchronization.dir/build
make[2]: Entering directory '/tmp/B.vjset3iy/BUILD/abseil-cpp-20200923.3/build-static'
[ 58%] Building CXX object absl/strings/CMakeFiles/cord.dir/cord.cc.o
cd /tmp/B.vjset3iy/BUILD/abseil-cpp-20200923.3/build-static/absl/strings && /usr/bin/x86_64-pld-linux-g++   -I/tmp/B.vjset3iy/BUILD/abseil-cpp-20200923.3  -O2 -fwrapv -pipe -Wformat -Werror=format-security -gdwarf-4 -fno-debug-types-section -fvar-tracking-assignments -g2 -Wp,-D_FORTIFY_SOURCE=2 -fstack-protector-strong --param=ssp-buffer-size=4 -Werror=trampolines -fPIC -march=x86-64 -mtune=generic -gdwarf-4 -fno-debug-types-section -fvar-tracking-assignments -g2  -DNDEBUG -DQT_NO_DEBUG   -Wall -Wextra -Wcast-qual -Wconversion-null -Wmissing-declarations -Woverlength-strings -Wpointer-arith -Wundef -Wunused-local-typedefs -Wunused-result -Wvarargs -Wvla -Wwrite-strings -Wno-missing-field-initializers -Wno-sign-compare -DNOMINMAX -o CMakeFiles/cord.dir/cord.cc.o -c /tmp/B.vjset3iy/BUILD/abseil-cpp-20200923.3/absl/strings/cord.cc
make[2]: Leaving directory '/tmp/B.vjset3iy/BUILD/abseil-cpp-20200923.3/build-static'
make[2]: Entering directory '/tmp/B.vjset3iy/BUILD/abseil-cpp-20200923.3/build-static'
[ 69%] Building CXX object absl/debugging/CMakeFiles/examine_stack.dir/internal/examine_stack.cc.o
cd /tmp/B.vjset3iy/BUILD/abseil-cpp-20200923.3/build-static/absl/debugging && /usr/bin/x86_64-pld-linux-g++   -I/tmp/B.vjset3iy/BUILD/abseil-cpp-20200923.3  -O2 -fwrapv -pipe -Wformat -Werror=format-security -gdwarf-4 -fno-debug-types-section -fvar-tracking-assignments -g2 -Wp,-D_FORTIFY_SOURCE=2 -fstack-protector-strong --param=ssp-buffer-size=4 -Werror=trampolines -fPIC -march=x86-64 -mtune=generic -gdwarf-4 -fno-debug-types-section -fvar-tracking-assignments -g2  -DNDEBUG -DQT_NO_DEBUG   -Wall -Wextra -Wcast-qual -Wconversion-null -Wmissing-declarations -Woverlength-strings -Wpointer-arith -Wundef -Wunused-local-typedefs -Wunused-result -Wvarargs -Wvla -Wwrite-strings -Wno-missing-field-initializers -Wno-sign-compare -DNOMINMAX -o CMakeFiles/examine_stack.dir/internal/examine_stack.cc.o -c /tmp/B.vjset3iy/BUILD/abseil-cpp-20200923.3/absl/debugging/internal/examine_stack.cc
make[2]: Leaving directory '/tmp/B.vjset3iy/BUILD/abseil-cpp-20200923.3/build-static'
make[2]: Entering directory '/tmp/B.vjset3iy/BUILD/abseil-cpp-20200923.3/build-static'
[ 73%] Linking CXX static library libabsl_cord.a
cd /tmp/B.vjset3iy/BUILD/abseil-cpp-20200923.3/build-static/absl/strings && /usr/bin/cmake -P CMakeFiles/cord.dir/cmake_clean_target.cmake
cd /tmp/B.vjset3iy/BUILD/abseil-cpp-20200923.3/build-static/absl/strings && /usr/bin/cmake -E cmake_link_script CMakeFiles/cord.dir/link.txt --verbose=1
/usr/bin/ar qc libabsl_cord.a  CMakeFiles/cord.dir/cord.cc.o
/usr/bin/ranlib libabsl_cord.a
make[2]: Leaving directory '/tmp/B.vjset3iy/BUILD/abseil-cpp-20200923.3/build-static'
make[1]: Entering directory '/tmp/B.vjset3iy/BUILD/abseil-cpp-20200923.3/build-static'
[ 74%] Built target cord
make[1]: Leaving directory '/tmp/B.vjset3iy/BUILD/abseil-cpp-20200923.3/build-static'
make[2]: Entering directory '/tmp/B.vjset3iy/BUILD/abseil-cpp-20200923.3/build-static'
[ 74%] Linking CXX static library libabsl_examine_stack.a
cd /tmp/B.vjset3iy/BUILD/abseil-cpp-20200923.3/build-static/absl/debugging && /usr/bin/cmake -P CMakeFiles/examine_stack.dir/cmake_clean_target.cmake
cd /tmp/B.vjset3iy/BUILD/abseil-cpp-20200923.3/build-static/absl/debugging && /usr/bin/cmake -E cmake_link_script CMakeFiles/examine_stack.dir/link.txt --verbose=1
/usr/bin/ar qc libabsl_examine_stack.a  CMakeFiles/examine_stack.dir/internal/examine_stack.cc.o
/usr/bin/ranlib libabsl_examine_stack.a
make[2]: Leaving directory '/tmp/B.vjset3iy/BUILD/abseil-cpp-20200923.3/build-static'
make[1]: Entering directory '/tmp/B.vjset3iy/BUILD/abseil-cpp-20200923.3/build-static'
[ 75%] Built target examine_stack
make[1]: Leaving directory '/tmp/B.vjset3iy/BUILD/abseil-cpp-20200923.3/build-static'
/usr/bin/make  -f absl/debugging/CMakeFiles/failure_signal_handler.dir/build.make absl/debugging/CMakeFiles/failure_signal_handler.dir/depend
make[2]: Entering directory '/tmp/B.vjset3iy/BUILD/abseil-cpp-20200923.3/build-static'
cd /tmp/B.vjset3iy/BUILD/abseil-cpp-20200923.3/build-static && /usr/bin/cmake -E cmake_depends "Unix Makefiles" /tmp/B.vjset3iy/BUILD/abseil-cpp-20200923.3 /tmp/B.vjset3iy/BUILD/abseil-cpp-20200923.3/absl/debugging /tmp/B.vjset3iy/BUILD/abseil-cpp-20200923.3/build-static /tmp/B.vjset3iy/BUILD/abseil-cpp-20200923.3/build-static/absl/debugging /tmp/B.vjset3iy/BUILD/abseil-cpp-20200923.3/build-static/absl/debugging/CMakeFiles/failure_signal_handler.dir/DependInfo.cmake --color=
Scanning dependencies of target failure_signal_handler
make[2]: Leaving directory '/tmp/B.vjset3iy/BUILD/abseil-cpp-20200923.3/build-static'
/usr/bin/make  -f absl/debugging/CMakeFiles/failure_signal_handler.dir/build.make absl/debugging/CMakeFiles/failure_signal_handler.dir/build
make[2]: Entering directory '/tmp/B.vjset3iy/BUILD/abseil-cpp-20200923.3/build-static'
[ 70%] Building CXX object absl/random/CMakeFiles/random_seed_sequences.dir/seed_sequences.cc.o
cd /tmp/B.vjset3iy/BUILD/abseil-cpp-20200923.3/build-static/absl/random && /usr/bin/x86_64-pld-linux-g++   -I/tmp/B.vjset3iy/BUILD/abseil-cpp-20200923.3  -O2 -fwrapv -pipe -Wformat -Werror=format-security -gdwarf-4 -fno-debug-types-section -fvar-tracking-assignments -g2 -Wp,-D_FORTIFY_SOURCE=2 -fstack-protector-strong --param=ssp-buffer-size=4 -Werror=trampolines -fPIC -march=x86-64 -mtune=generic -gdwarf-4 -fno-debug-types-section -fvar-tracking-assignments -g2  -DNDEBUG -DQT_NO_DEBUG   -Wall -Wextra -Wcast-qual -Wconversion-null -Wmissing-declarations -Woverlength-strings -Wpointer-arith -Wundef -Wunused-local-typedefs -Wunused-result -Wvarargs -Wvla -Wwrite-strings -Wno-missing-field-initializers -Wno-sign-compare -DNOMINMAX -o CMakeFiles/random_seed_sequences.dir/seed_sequences.cc.o -c /tmp/B.vjset3iy/BUILD/abseil-cpp-20200923.3/absl/random/seed_sequences.cc
make[2]: Leaving directory '/tmp/B.vjset3iy/BUILD/abseil-cpp-20200923.3/build-static'
make[2]: Entering directory '/tmp/B.vjset3iy/BUILD/abseil-cpp-20200923.3/build-static'
[ 71%] Building CXX object absl/synchronization/CMakeFiles/synchronization.dir/internal/per_thread_sem.cc.o
cd /tmp/B.vjset3iy/BUILD/abseil-cpp-20200923.3/build-static/absl/synchronization && /usr/bin/x86_64-pld-linux-g++   -I/tmp/B.vjset3iy/BUILD/abseil-cpp-20200923.3  -O2 -fwrapv -pipe -Wformat -Werror=format-security -gdwarf-4 -fno-debug-types-section -fvar-tracking-assignments -g2 -Wp,-D_FORTIFY_SOURCE=2 -fstack-protector-strong --param=ssp-buffer-size=4 -Werror=trampolines -fPIC -march=x86-64 -mtune=generic -gdwarf-4 -fno-debug-types-section -fvar-tracking-assignments -g2  -DNDEBUG -DQT_NO_DEBUG   -Wall -Wextra -Wcast-qual -Wconversion-null -Wmissing-declarations -Woverlength-strings -Wpointer-arith -Wundef -Wunused-local-typedefs -Wunused-result -Wvarargs -Wvla -Wwrite-strings -Wno-missing-field-initializers -Wno-sign-compare -DNOMINMAX -o CMakeFiles/synchronization.dir/internal/per_thread_sem.cc.o -c /tmp/B.vjset3iy/BUILD/abseil-cpp-20200923.3/absl/synchronization/internal/per_thread_sem.cc
make[2]: Leaving directory '/tmp/B.vjset3iy/BUILD/abseil-cpp-20200923.3/build-static'
make[2]: Entering directory '/tmp/B.vjset3iy/BUILD/abseil-cpp-20200923.3/build-static'
[ 67%] Building CXX object absl/strings/CMakeFiles/str_format_internal.dir/internal/str_format/float_conversion.cc.o
cd /tmp/B.vjset3iy/BUILD/abseil-cpp-20200923.3/build-static/absl/strings && /usr/bin/x86_64-pld-linux-g++   -I/tmp/B.vjset3iy/BUILD/abseil-cpp-20200923.3  -O2 -fwrapv -pipe -Wformat -Werror=format-security -gdwarf-4 -fno-debug-types-section -fvar-tracking-assignments -g2 -Wp,-D_FORTIFY_SOURCE=2 -fstack-protector-strong --param=ssp-buffer-size=4 -Werror=trampolines -fPIC -march=x86-64 -mtune=generic -gdwarf-4 -fno-debug-types-section -fvar-tracking-assignments -g2  -DNDEBUG -DQT_NO_DEBUG   -Wall -Wextra -Wcast-qual -Wconversion-null -Wmissing-declarations -Woverlength-strings -Wpointer-arith -Wundef -Wunused-local-typedefs -Wunused-result -Wvarargs -Wvla -Wwrite-strings -Wno-missing-field-initializers -Wno-sign-compare -DNOMINMAX -o CMakeFiles/str_format_internal.dir/internal/str_format/float_conversion.cc.o -c /tmp/B.vjset3iy/BUILD/abseil-cpp-20200923.3/absl/strings/internal/str_format/float_conversion.cc
make[2]: Leaving directory '/tmp/B.vjset3iy/BUILD/abseil-cpp-20200923.3/build-static'
make[2]: Entering directory '/tmp/B.vjset3iy/BUILD/abseil-cpp-20200923.3/build-static'
[ 73%] Building CXX object absl/synchronization/CMakeFiles/synchronization.dir/barrier.cc.o
cd /tmp/B.vjset3iy/BUILD/abseil-cpp-20200923.3/build-static/absl/synchronization && /usr/bin/x86_64-pld-linux-g++   -I/tmp/B.vjset3iy/BUILD/abseil-cpp-20200923.3  -O2 -fwrapv -pipe -Wformat -Werror=format-security -gdwarf-4 -fno-debug-types-section -fvar-tracking-assignments -g2 -Wp,-D_FORTIFY_SOURCE=2 -fstack-protector-strong --param=ssp-buffer-size=4 -Werror=trampolines -fPIC -march=x86-64 -mtune=generic -gdwarf-4 -fno-debug-types-section -fvar-tracking-assignments -g2  -DNDEBUG -DQT_NO_DEBUG   -Wall -Wextra -Wcast-qual -Wconversion-null -Wmissing-declarations -Woverlength-strings -Wpointer-arith -Wundef -Wunused-local-typedefs -Wunused-result -Wvarargs -Wvla -Wwrite-strings -Wno-missing-field-initializers -Wno-sign-compare -DNOMINMAX -o CMakeFiles/synchronization.dir/barrier.cc.o -c /tmp/B.vjset3iy/BUILD/abseil-cpp-20200923.3/absl/synchronization/barrier.cc
make[2]: Leaving directory '/tmp/B.vjset3iy/BUILD/abseil-cpp-20200923.3/build-static'
make[2]: Entering directory '/tmp/B.vjset3iy/BUILD/abseil-cpp-20200923.3/build-static'
[ 77%] Linking CXX static library libabsl_random_seed_sequences.a
cd /tmp/B.vjset3iy/BUILD/abseil-cpp-20200923.3/build-static/absl/random && /usr/bin/cmake -P CMakeFiles/random_seed_sequences.dir/cmake_clean_target.cmake
cd /tmp/B.vjset3iy/BUILD/abseil-cpp-20200923.3/build-static/absl/random && /usr/bin/cmake -E cmake_link_script CMakeFiles/random_seed_sequences.dir/link.txt --verbose=1
/usr/bin/ar qc libabsl_random_seed_sequences.a  CMakeFiles/random_seed_sequences.dir/seed_sequences.cc.o
/usr/bin/ranlib libabsl_random_seed_sequences.a
make[2]: Leaving directory '/tmp/B.vjset3iy/BUILD/abseil-cpp-20200923.3/build-static'
make[1]: Entering directory '/tmp/B.vjset3iy/BUILD/abseil-cpp-20200923.3/build-static'
[ 78%] Built target random_seed_sequences
make[1]: Leaving directory '/tmp/B.vjset3iy/BUILD/abseil-cpp-20200923.3/build-static'
make[2]: Entering directory '/tmp/B.vjset3iy/BUILD/abseil-cpp-20200923.3/build-static'
[ 72%] Building CXX object absl/synchronization/CMakeFiles/synchronization.dir/internal/create_thread_identity.cc.o
cd /tmp/B.vjset3iy/BUILD/abseil-cpp-20200923.3/build-static/absl/synchronization && /usr/bin/x86_64-pld-linux-g++   -I/tmp/B.vjset3iy/BUILD/abseil-cpp-20200923.3  -O2 -fwrapv -pipe -Wformat -Werror=format-security -gdwarf-4 -fno-debug-types-section -fvar-tracking-assignments -g2 -Wp,-D_FORTIFY_SOURCE=2 -fstack-protector-strong --param=ssp-buffer-size=4 -Werror=trampolines -fPIC -march=x86-64 -mtune=generic -gdwarf-4 -fno-debug-types-section -fvar-tracking-assignments -g2  -DNDEBUG -DQT_NO_DEBUG   -Wall -Wextra -Wcast-qual -Wconversion-null -Wmissing-declarations -Woverlength-strings -Wpointer-arith -Wundef -Wunused-local-typedefs -Wunused-result -Wvarargs -Wvla -Wwrite-strings -Wno-missing-field-initializers -Wno-sign-compare -DNOMINMAX -o CMakeFiles/synchronization.dir/internal/create_thread_identity.cc.o -c /tmp/B.vjset3iy/BUILD/abseil-cpp-20200923.3/absl/synchronization/internal/create_thread_identity.cc
make[2]: Leaving directory '/tmp/B.vjset3iy/BUILD/abseil-cpp-20200923.3/build-static'
make[2]: Entering directory '/tmp/B.vjset3iy/BUILD/abseil-cpp-20200923.3/build-static'
[ 73%] Building CXX object absl/synchronization/CMakeFiles/synchronization.dir/blocking_counter.cc.o
cd /tmp/B.vjset3iy/BUILD/abseil-cpp-20200923.3/build-static/absl/synchronization && /usr/bin/x86_64-pld-linux-g++   -I/tmp/B.vjset3iy/BUILD/abseil-cpp-20200923.3  -O2 -fwrapv -pipe -Wformat -Werror=format-security -gdwarf-4 -fno-debug-types-section -fvar-tracking-assignments -g2 -Wp,-D_FORTIFY_SOURCE=2 -fstack-protector-strong --param=ssp-buffer-size=4 -Werror=trampolines -fPIC -march=x86-64 -mtune=generic -gdwarf-4 -fno-debug-types-section -fvar-tracking-assignments -g2  -DNDEBUG -DQT_NO_DEBUG   -Wall -Wextra -Wcast-qual -Wconversion-null -Wmissing-declarations -Woverlength-strings -Wpointer-arith -Wundef -Wunused-local-typedefs -Wunused-result -Wvarargs -Wvla -Wwrite-strings -Wno-missing-field-initializers -Wno-sign-compare -DNOMINMAX -o CMakeFiles/synchronization.dir/blocking_counter.cc.o -c /tmp/B.vjset3iy/BUILD/abseil-cpp-20200923.3/absl/synchronization/blocking_counter.cc
make[2]: Leaving directory '/tmp/B.vjset3iy/BUILD/abseil-cpp-20200923.3/build-static'
make[2]: Entering directory '/tmp/B.vjset3iy/BUILD/abseil-cpp-20200923.3/build-static'
[ 69%] Building CXX object absl/strings/CMakeFiles/str_format_internal.dir/internal/str_format/parser.cc.o
cd /tmp/B.vjset3iy/BUILD/abseil-cpp-20200923.3/build-static/absl/strings && /usr/bin/x86_64-pld-linux-g++   -I/tmp/B.vjset3iy/BUILD/abseil-cpp-20200923.3  -O2 -fwrapv -pipe -Wformat -Werror=format-security -gdwarf-4 -fno-debug-types-section -fvar-tracking-assignments -g2 -Wp,-D_FORTIFY_SOURCE=2 -fstack-protector-strong --param=ssp-buffer-size=4 -Werror=trampolines -fPIC -march=x86-64 -mtune=generic -gdwarf-4 -fno-debug-types-section -fvar-tracking-assignments -g2  -DNDEBUG -DQT_NO_DEBUG   -Wall -Wextra -Wcast-qual -Wconversion-null -Wmissing-declarations -Woverlength-strings -Wpointer-arith -Wundef -Wunused-local-typedefs -Wunused-result -Wvarargs -Wvla -Wwrite-strings -Wno-missing-field-initializers -Wno-sign-compare -DNOMINMAX -o CMakeFiles/str_format_internal.dir/internal/str_format/parser.cc.o -c /tmp/B.vjset3iy/BUILD/abseil-cpp-20200923.3/absl/strings/internal/str_format/parser.cc
make[2]: Leaving directory '/tmp/B.vjset3iy/BUILD/abseil-cpp-20200923.3/build-static'
make[2]: Entering directory '/tmp/B.vjset3iy/BUILD/abseil-cpp-20200923.3/build-static'
[ 79%] Linking CXX static library libabsl_str_format_internal.a
cd /tmp/B.vjset3iy/BUILD/abseil-cpp-20200923.3/build-static/absl/strings && /usr/bin/cmake -P CMakeFiles/str_format_internal.dir/cmake_clean_target.cmake
cd /tmp/B.vjset3iy/BUILD/abseil-cpp-20200923.3/build-static/absl/strings && /usr/bin/cmake -E cmake_link_script CMakeFiles/str_format_internal.dir/link.txt --verbose=1
/usr/bin/ar qc libabsl_str_format_internal.a  CMakeFiles/str_format_internal.dir/internal/str_format/arg.cc.o CMakeFiles/str_format_internal.dir/internal/str_format/bind.cc.o CMakeFiles/str_format_internal.dir/internal/str_format/extension.cc.o CMakeFiles/str_format_internal.dir/internal/str_format/float_conversion.cc.o CMakeFiles/str_format_internal.dir/internal/str_format/output.cc.o CMakeFiles/str_format_internal.dir/internal/str_format/parser.cc.o
/usr/bin/ranlib libabsl_str_format_internal.a
make[2]: Leaving directory '/tmp/B.vjset3iy/BUILD/abseil-cpp-20200923.3/build-static'
make[1]: Entering directory '/tmp/B.vjset3iy/BUILD/abseil-cpp-20200923.3/build-static'
[ 79%] Built target str_format_internal
make[1]: Leaving directory '/tmp/B.vjset3iy/BUILD/abseil-cpp-20200923.3/build-static'
make[2]: Entering directory '/tmp/B.vjset3iy/BUILD/abseil-cpp-20200923.3/build-static'
[ 76%] Building CXX object absl/debugging/CMakeFiles/failure_signal_handler.dir/failure_signal_handler.cc.o
cd /tmp/B.vjset3iy/BUILD/abseil-cpp-20200923.3/build-static/absl/debugging && /usr/bin/x86_64-pld-linux-g++   -I/tmp/B.vjset3iy/BUILD/abseil-cpp-20200923.3  -O2 -fwrapv -pipe -Wformat -Werror=format-security -gdwarf-4 -fno-debug-types-section -fvar-tracking-assignments -g2 -Wp,-D_FORTIFY_SOURCE=2 -fstack-protector-strong --param=ssp-buffer-size=4 -Werror=trampolines -fPIC -march=x86-64 -mtune=generic -gdwarf-4 -fno-debug-types-section -fvar-tracking-assignments -g2  -DNDEBUG -DQT_NO_DEBUG   -Wall -Wextra -Wcast-qual -Wconversion-null -Wmissing-declarations -Woverlength-strings -Wpointer-arith -Wundef -Wunused-local-typedefs -Wunused-result -Wvarargs -Wvla -Wwrite-strings -Wno-missing-field-initializers -Wno-sign-compare -DNOMINMAX -o CMakeFiles/failure_signal_handler.dir/failure_signal_handler.cc.o -c /tmp/B.vjset3iy/BUILD/abseil-cpp-20200923.3/absl/debugging/failure_signal_handler.cc
/tmp/B.vjset3iy/BUILD/abseil-cpp-20200923.3/absl/debugging/failure_signal_handler.cc: In function 'bool absl::lts_2020_09_23::SetupAlternateStackOnce()':
/tmp/B.vjset3iy/BUILD/abseil-cpp-20200923.3/absl/debugging/failure_signal_handler.cc:138:32: error: no matching function for call to 'max(long int, int)'
  138 |   size_t stack_size = (std::max(SIGSTKSZ, 65536) + page_mask) & ~page_mask;
      |                        ~~~~~~~~^~~~~~~~~~~~~~~~~
In file included from /usr/include/c++/11.2.0/algorithm:61,
                 from /tmp/B.vjset3iy/BUILD/abseil-cpp-20200923.3/absl/debugging/failure_signal_handler.cc:35:
/usr/include/c++/11.2.0/bits/stl_algobase.h:254:5: note: candidate: 'template<class _Tp> constexpr const _Tp& std::max(const _Tp&, const _Tp&)'
  254 |     max(const _Tp& __a, const _Tp& __b)
      |     ^~~
/usr/include/c++/11.2.0/bits/stl_algobase.h:254:5: note:   template argument deduction/substitution failed:
/tmp/B.vjset3iy/BUILD/abseil-cpp-20200923.3/absl/debugging/failure_signal_handler.cc:138:32: note:   deduced conflicting types for parameter 'const _Tp' ('long int' and 'int')
  138 |   size_t stack_size = (std::max(SIGSTKSZ, 65536) + page_mask) & ~page_mask;
      |                        ~~~~~~~~^~~~~~~~~~~~~~~~~
In file included from /usr/include/c++/11.2.0/algorithm:61,
                 from /tmp/B.vjset3iy/BUILD/abseil-cpp-20200923.3/absl/debugging/failure_signal_handler.cc:35:
/usr/include/c++/11.2.0/bits/stl_algobase.h:300:5: note: candidate: 'template<class _Tp, class _Compare> constexpr const _Tp& std::max(const _Tp&, const _Tp&, _Compare)'
  300 |     max(const _Tp& __a, const _Tp& __b, _Compare __comp)
      |     ^~~
/usr/include/c++/11.2.0/bits/stl_algobase.h:300:5: note:   template argument deduction/substitution failed:
/tmp/B.vjset3iy/BUILD/abseil-cpp-20200923.3/absl/debugging/failure_signal_handler.cc:138:32: note:   deduced conflicting types for parameter 'const _Tp' ('long int' and 'int')
  138 |   size_t stack_size = (std::max(SIGSTKSZ, 65536) + page_mask) & ~page_mask;
      |                        ~~~~~~~~^~~~~~~~~~~~~~~~~
In file included from /usr/include/c++/11.2.0/algorithm:62,
                 from /tmp/B.vjset3iy/BUILD/abseil-cpp-20200923.3/absl/debugging/failure_signal_handler.cc:35:
/usr/include/c++/11.2.0/bits/stl_algo.h:3461:5: note: candidate: 'template<class _Tp> constexpr _Tp std::max(std::initializer_list<_Tp>)'
 3461 |     max(initializer_list<_Tp> __l)
      |     ^~~
/usr/include/c++/11.2.0/bits/stl_algo.h:3461:5: note:   template argument deduction/substitution failed:
/tmp/B.vjset3iy/BUILD/abseil-cpp-20200923.3/absl/debugging/failure_signal_handler.cc:138:32: note:   mismatched types 'std::initializer_list<_Tp>' and 'long int'
  138 |   size_t stack_size = (std::max(SIGSTKSZ, 65536) + page_mask) & ~page_mask;
      |                        ~~~~~~~~^~~~~~~~~~~~~~~~~
In file included from /usr/include/c++/11.2.0/algorithm:62,
                 from /tmp/B.vjset3iy/BUILD/abseil-cpp-20200923.3/absl/debugging/failure_signal_handler.cc:35:
/usr/include/c++/11.2.0/bits/stl_algo.h:3467:5: note: candidate: 'template<class _Tp, class _Compare> constexpr _Tp std::max(std::initializer_list<_Tp>, _Compare)'
 3467 |     max(initializer_list<_Tp> __l, _Compare __comp)
      |     ^~~
/usr/include/c++/11.2.0/bits/stl_algo.h:3467:5: note:   template argument deduction/substitution failed:
/tmp/B.vjset3iy/BUILD/abseil-cpp-20200923.3/absl/debugging/failure_signal_handler.cc:138:32: note:   mismatched types 'std::initializer_list<_Tp>' and 'long int'
  138 |   size_t stack_size = (std::max(SIGSTKSZ, 65536) + page_mask) & ~page_mask;
      |                        ~~~~~~~~^~~~~~~~~~~~~~~~~
make[2]: *** [absl/debugging/CMakeFiles/failure_signal_handler.dir/build.make:86: absl/debugging/CMakeFiles/failure_signal_handler.dir/failure_signal_handler.cc.o] Error 1
make[2]: Leaving directory '/tmp/B.vjset3iy/BUILD/abseil-cpp-20200923.3/build-static'
make[1]: *** [CMakeFiles/Makefile2:1166: absl/debugging/CMakeFiles/failure_signal_handler.dir/all] Error 2
make[1]: *** Waiting for unfinished jobs....
make[2]: Entering directory '/tmp/B.vjset3iy/BUILD/abseil-cpp-20200923.3/build-static'
[ 75%] Building CXX object absl/synchronization/CMakeFiles/synchronization.dir/internal/waiter.cc.o
cd /tmp/B.vjset3iy/BUILD/abseil-cpp-20200923.3/build-static/absl/synchronization && /usr/bin/x86_64-pld-linux-g++   -I/tmp/B.vjset3iy/BUILD/abseil-cpp-20200923.3  -O2 -fwrapv -pipe -Wformat -Werror=format-security -gdwarf-4 -fno-debug-types-section -fvar-tracking-assignments -g2 -Wp,-D_FORTIFY_SOURCE=2 -fstack-protector-strong --param=ssp-buffer-size=4 -Werror=trampolines -fPIC -march=x86-64 -mtune=generic -gdwarf-4 -fno-debug-types-section -fvar-tracking-assignments -g2  -DNDEBUG -DQT_NO_DEBUG   -Wall -Wextra -Wcast-qual -Wconversion-null -Wmissing-declarations -Woverlength-strings -Wpointer-arith -Wundef -Wunused-local-typedefs -Wunused-result -Wvarargs -Wvla -Wwrite-strings -Wno-missing-field-initializers -Wno-sign-compare -DNOMINMAX -o CMakeFiles/synchronization.dir/internal/waiter.cc.o -c /tmp/B.vjset3iy/BUILD/abseil-cpp-20200923.3/absl/synchronization/internal/waiter.cc
make[2]: Leaving directory '/tmp/B.vjset3iy/BUILD/abseil-cpp-20200923.3/build-static'
make[2]: Entering directory '/tmp/B.vjset3iy/BUILD/abseil-cpp-20200923.3/build-static'
[ 78%] Building CXX object absl/synchronization/CMakeFiles/synchronization.dir/notification.cc.o
cd /tmp/B.vjset3iy/BUILD/abseil-cpp-20200923.3/build-static/absl/synchronization && /usr/bin/x86_64-pld-linux-g++   -I/tmp/B.vjset3iy/BUILD/abseil-cpp-20200923.3  -O2 -fwrapv -pipe -Wformat -Werror=format-security -gdwarf-4 -fno-debug-types-section -fvar-tracking-assignments -g2 -Wp,-D_FORTIFY_SOURCE=2 -fstack-protector-strong --param=ssp-buffer-size=4 -Werror=trampolines -fPIC -march=x86-64 -mtune=generic -gdwarf-4 -fno-debug-types-section -fvar-tracking-assignments -g2  -DNDEBUG -DQT_NO_DEBUG   -Wall -Wextra -Wcast-qual -Wconversion-null -Wmissing-declarations -Woverlength-strings -Wpointer-arith -Wundef -Wunused-local-typedefs -Wunused-result -Wvarargs -Wvla -Wwrite-strings -Wno-missing-field-initializers -Wno-sign-compare -DNOMINMAX -o CMakeFiles/synchronization.dir/notification.cc.o -c /tmp/B.vjset3iy/BUILD/abseil-cpp-20200923.3/absl/synchronization/notification.cc
make[2]: Leaving directory '/tmp/B.vjset3iy/BUILD/abseil-cpp-20200923.3/build-static'
make[2]: Entering directory '/tmp/B.vjset3iy/BUILD/abseil-cpp-20200923.3/build-static'
[ 78%] Building CXX object absl/synchronization/CMakeFiles/synchronization.dir/mutex.cc.o
cd /tmp/B.vjset3iy/BUILD/abseil-cpp-20200923.3/build-static/absl/synchronization && /usr/bin/x86_64-pld-linux-g++   -I/tmp/B.vjset3iy/BUILD/abseil-cpp-20200923.3  -O2 -fwrapv -pipe -Wformat -Werror=format-security -gdwarf-4 -fno-debug-types-section -fvar-tracking-assignments -g2 -Wp,-D_FORTIFY_SOURCE=2 -fstack-protector-strong --param=ssp-buffer-size=4 -Werror=trampolines -fPIC -march=x86-64 -mtune=generic -gdwarf-4 -fno-debug-types-section -fvar-tracking-assignments -g2  -DNDEBUG -DQT_NO_DEBUG   -Wall -Wextra -Wcast-qual -Wconversion-null -Wmissing-declarations -Woverlength-strings -Wpointer-arith -Wundef -Wunused-local-typedefs -Wunused-result -Wvarargs -Wvla -Wwrite-strings -Wno-missing-field-initializers -Wno-sign-compare -DNOMINMAX -o CMakeFiles/synchronization.dir/mutex.cc.o -c /tmp/B.vjset3iy/BUILD/abseil-cpp-20200923.3/absl/synchronization/mutex.cc
make[2]: Leaving directory '/tmp/B.vjset3iy/BUILD/abseil-cpp-20200923.3/build-static'
make[2]: Entering directory '/tmp/B.vjset3iy/BUILD/abseil-cpp-20200923.3/build-static'
[ 80%] Linking CXX static library libabsl_synchronization.a
cd /tmp/B.vjset3iy/BUILD/abseil-cpp-20200923.3/build-static/absl/synchronization && /usr/bin/cmake -P CMakeFiles/synchronization.dir/cmake_clean_target.cmake
cd /tmp/B.vjset3iy/BUILD/abseil-cpp-20200923.3/build-static/absl/synchronization && /usr/bin/cmake -E cmake_link_script CMakeFiles/synchronization.dir/link.txt --verbose=1
/usr/bin/ar qc libabsl_synchronization.a  CMakeFiles/synchronization.dir/barrier.cc.o CMakeFiles/synchronization.dir/blocking_counter.cc.o CMakeFiles/synchronization.dir/internal/create_thread_identity.cc.o CMakeFiles/synchronization.dir/internal/per_thread_sem.cc.o CMakeFiles/synchronization.dir/internal/waiter.cc.o CMakeFiles/synchronization.dir/notification.cc.o CMakeFiles/synchronization.dir/mutex.cc.o
/usr/bin/ranlib libabsl_synchronization.a
make[2]: Leaving directory '/tmp/B.vjset3iy/BUILD/abseil-cpp-20200923.3/build-static'
make[1]: Entering directory '/tmp/B.vjset3iy/BUILD/abseil-cpp-20200923.3/build-static'
[ 80%] Built target synchronization
make[1]: Leaving directory '/tmp/B.vjset3iy/BUILD/abseil-cpp-20200923.3/build-static'
make: *** [Makefile:153: all] Error 2
error: Bad exit status from /tmp/B.vjset3iy/BUILD/tmp/rpm-tmp.8sKT1q (%build)


RPM build errors:
    Could not canonicalize hostname: ymir
    Bad exit status from /tmp/B.vjset3iy/BUILD/tmp/rpm-tmp.8sKT1q (%build)
ended at: Sat Nov 20 23:07:36 2021, done in 0:00:17.478112
error: No files produced.
+ chmod -R u+rwX /tmp/B.vjset3iy/BUILD
+ rm -rf /tmp/B.vjset3iy/tmp /tmp/B.vjset3iy/BUILD
+ rm -rf /tmp/B.vjset3iy
Begin-PLD-Builder-Info
Build-Time: user:93.98s sys:12.58s real:19.52s (faults io:353 non-io:2382690)

End-PLD-Builder-Info
[Back to list of logs] [View rpm -qa of builder]