FailedOk

th/SRPMS[OK]
th/x32[OK]
th/i686[OK]
th/x86_64[OK]

ac/SRPMS[OK]
ac/i386[OK]
ac/i586[OK]
ac/i686[OK]
ac/alpha[OK]
ac/amd64[OK]
ac/athlon[OK]
ac/ppc[OK]
ac/sparc[OK]
ac/sparc64[OK]

Advanced Search
main()
Powered by PLD Linux
(c) 2002-2021 PLD Team
$Revision: 1.37 $
Powered by The Bad Thing.
Your IP: 34.231.243.21

apache-mod_clamav efd9deba-68c6-4cdb-a170-f12d6bcb9608

Status:Failed
Source URL:https://buildlogs.pld-linux.org/pld/th/x86_64/FAIL/apache-mod_clamav,efd9deba-68c6-4cdb-a170-f12d6bcb9608.bz2
text/plain URL:View!
rpm -qa of builder:View!
Date:2021/10/09 10:22:19
Runtime:0:00:09.456574

Toc:

  • error 1
  • rpm: error: Failed build dependencies:
  • error 2
  • rpm: error: Failed build dependencies:
  • error 3
  • rpm: error: Failed build dependencies:
  • prep
  • Executing(%prep): /bin/sh -e /tmp/B.10x4x0c_/BUILD/tmp/rpm-tmp.MvJO8L
  • build
  • Executing(%build): /bin/sh -e /tmp/B.10x4x0c_/BUILD/tmp/rpm-tmp.ihMIck
  • error 4
  • collect2: error: ld returned 1 exit status
  • error 5
  • make[1]: *** [Makefile:459: mod_clamav.la] Error 1
  • error 6
  • error: Bad exit status from /tmp/B.10x4x0c_/BUILD/tmp/rpm-tmp.ihMIck (%build)
  • error 7
  • RPM build errors:
  • error 8
  • error: No files produced.

Content:

request from: baggins
checking if we should skip the build
started at: Sat Oct  9 10:21:56 2021
killing old processes on a builder
sending signal 9 to pid -1
cleaning up /tmp
fetching https://srcbuilder.pld-linux.org/th//srpms/efd9deba-68c6-4cdb-a170-f12d6bcb9608/apache-mod_clamav-0.23-4.src.rpm
fetched 355254 bytes, 893.5 K/s
installing srpm: apache-mod_clamav-0.23-4.src.rpm
+ install -d /tmp/B.10x4x0c_/BUILD /tmp/B.10x4x0c_/RPMS
+ LC_ALL=en_US.UTF-8
+ rpm -qp --changelog apache-mod_clamav-0.23-4.src.rpm
* Sat Oct 09 2021 PLD Linux Team <feedback@pld-linux.org>
- For complete changelog see: http://git.pld-linux.org/?p=packages/apache-mod_clamav.git;a=log;h=master
* Sat Oct 09 2021 Jan Rękorajski <baggins@pld-linux.org> 51dc817
- Release 4 (by relup.sh) * Tue Dec 11 2018 Jakub Bogusz <qboosh@pld-linux.org> 971c2e7
- added clamav patch (fix build with clamav 0.101); release 3 * Fri Mar 18 2016 Jan Rękorajski <baggins@pld-linux.org> 45d9e9b
- release 2 (by relup.sh) * Sun May 19 2013 Jan Rękorajski <baggins@pld-linux.org> 71357e6
- migrate to apache 2.4 - rel 1 * Sat Feb 11 2012 zbyniu <zbyniu@pld-linux.org> dbef411
- up to 0.23; libtool-tag.patch obsoleted * Fri Dec 09 2011 Elan Ruusamäe <glen@pld-linux.org> b5658c7
- fix config dir * Sat Oct 25 2008 Paweł Gołaszewski <blues@pld-linux.org> 0de851f
- HTTP group * Sun Dec 09 2007 Elan Ruusamäe <glen@pld-linux.org> 9d6893b
- apache-apxs -> %{apxs} in BR * Thu Jun 07 2007 shadzik <shadzik@pld-linux.org> c6a566c
- BR s@%{apxs}@apache-apxs@g * Mon Feb 12 2007 Elan Ruusamäe <glen@pld-linux.org> ac3d21b
- tabs in preamble * Mon Feb 12 2007 Jan Rękorajski <baggins@pld-linux.org> 9074edc
- converted to UTF-8 * Fri Apr 14 2006 Elan Ruusamäe <glen@pld-linux.org> fd95999
- restart apache in %postun rather in %preun as the config file, loading module is still there and module will be loaded after package is uninstalled, which later causes missing configuration file errors. * Mon Jan 30 2006 Elan Ruusamäe <glen@pld-linux.org> 774081d
- use %service * Tue Dec 27 2005 Elan Ruusamäe <glen@pld-linux.org> 4a9bbba
- unified files * Mon Dec 26 2005 Elan Ruusamäe <glen@pld-linux.org> 770a939
- -avoid-version * Mon Dec 26 2005 Elan Ruusamäe <glen@pld-linux.org> 2488ddd
- unified * Mon Dec 12 2005 Elan Ruusamäe <glen@pld-linux.org> 54d75f8
- adapterized (sorted %verify attrs) * Fri Oct 29 2004 paladine <paladine@pld-linux.org> 36d45bf
- "HTTP" unification * Fri Oct 15 2004 radek <radek@pld-linux.org> da9fa9f
- added Id cvs tag and vim modeline * Sun Sep 05 2004 radek <radek@pld-linux.org> eba5179
- use "%(%{apxs} -q SYSCONFDIR)" for _sysconfdir definition + rpm -Uhv --nodeps --define '_topdir /tmp/B.10x4x0c_' --define '_specdir %{_topdir}' --define '_sourcedir %{_specdir}' --define '_rpmdir %{_topdir}/RPMS' --define '_builddir %{_topdir}/BUILD' apache-mod_clamav-0.23-4.src.rpm Updating / installing... apache-mod_clamav-0.23-4 ######################################## + rm -f apache-mod_clamav-0.23-4.src.rpm + install -m 700 -d /tmp/B.10x4x0c_/BUILD/tmp + TMPDIR=/tmp/B.10x4x0c_/BUILD/tmp + exec nice -n 0 rpmbuild -bp --short-circuit --nodeps --define '_topdir /tmp/B.10x4x0c_' --define '_specdir %{_topdir}' --define '_sourcedir %{_specdir}' --define '_rpmdir %{_topdir}/RPMS' --define '_builddir %{_topdir}/BUILD' --target x86_64-pld-linux --define 'prep exit 0' /tmp/B.10x4x0c_/apache-mod_clamav.spec warning: Could not canonicalize hostname: ymir Building target platforms: x86_64-pld-linux Building for target x86_64-pld-linux checking BuildConflict-ing packages rpm: warning: Could not canonicalize hostname: ymir rpm: error: Failed build dependencies: rpm: clamav-devel is needed by apache-mod_clamav-0.23-4.x86_64 rpm: Building target platforms: x86_64-pld-linux rpm: Building for target x86_64-pld-linux no BuildConflicts found checking BR rpm: warning: Could not canonicalize hostname: ymir rpm: error: Failed build dependencies: rpm: clamav-devel is needed by apache-mod_clamav-0.23-4.x86_64 rpm: Building target platforms: x86_64-pld-linux rpm: Building for target x86_64-pld-linux updating poldek cache... ready is up to date th is up to date th is up to date th-ready is up to date th-ready is up to date th-test is up to date Retrieving th-test::packages.ndir.diff.toc.gz..............................................done Retrieving diff::packages.ndir.2021.10.08-19.35.02.gz......................................done Loading [pndir]th-test... Applying packages.ndir.2021.10.08-19.35.02.gz... Writing /root/.poldek-cache/[...]/packages.ndir.gz... checking conflicting packages in BRed packages poldek: Loading [pndir]ready... poldek: Loading [pndir]th-test... poldek: Loading [pndir]th-test... poldek: Loading [pndir]th-ready... poldek: Loading [pndir]th-ready... poldek: Loading [pndir]th... poldek: Loading [pndir]th... poldek: 32341 packages read poldek: Removed 2742 duplicate packages from available set poldek: Processing dependencies... poldek: clamav-devel-0.104.0-1.x86_64 marks clamav-libs-0.104.0-1.x86_64 (cap clamav-libs = 0.104.0-1) poldek: There are 2 packages to install (1 marked by dependencies): poldek: A clamav-devel-0.104.0-1.x86_64 clamav-libs-0.104.0-1.x86_64 poldek: This operation will use 2.6MB of disk space. poldek: Need to get 908.9KB of archives. poldek: clamav-libs-0.104.0-1.x86_64.rpm: digests OK poldek: clamav-devel-0.104.0-1.x86_64.rpm: digests OK poldek: Executing pm-command.sh --upgrade -vh --test --root / --define _check_dirname_deps 0... poldek: Verifying... ######################################## poldek: Preparing... ######################################## no conflicts found checking BR rpm: warning: Could not canonicalize hostname: ymir rpm: error: Failed build dependencies: rpm: clamav-devel is needed by apache-mod_clamav-0.23-4.x86_64 rpm: Building target platforms: x86_64-pld-linux rpm: Building for target x86_64-pld-linux installing BR: clamav\-devel + poldek --noask --caplookup -Q -v '--ignore=hhvm-*' '--ignore=php4-*' '--ignore=php52-*' '--ignore=php54-*' '--ignore=php55-*' '--ignore=php56-*' '--ignore=php70-*' '--ignore=php71-*' '--ignore=php72-*' '--ignore=php73-*' '--ignore=php74-*' '--ignore=php80-*' --upgrade clamav-devel Loading [pndir]ready... Loading [pndir]th-test... Loading [pndir]th-test... Loading [pndir]th-ready... Loading [pndir]th-ready... Loading [pndir]th... Loading [pndir]th... 32341 packages read Removed 2742 duplicate packages from available set Processing dependencies... clamav-devel-0.104.0-1.x86_64 marks clamav-libs-0.104.0-1.x86_64 (cap clamav-libs = 0.104.0-1) There are 2 packages to install (1 marked by dependencies): A clamav-devel-0.104.0-1.x86_64 clamav-libs-0.104.0-1.x86_64 This operation will use 2.6MB of disk space. Need to get 908.9KB of archives. clamav-libs-0.104.0-1.x86_64.rpm: digests OK clamav-devel-0.104.0-1.x86_64.rpm: digests OK Executing pm-command.sh --upgrade -vh --root / --define _check_dirname_deps 0... Verifying... ######################################## Preparing... ######################################## Updating / installing... clamav-libs-0.104.0-1 ######################################## clamav-devel-0.104.0-1 ######################################## building RPM using: set -ex; : build-id: efd9deba-68c6-4cdb-a170-f12d6bcb9608; TMPDIR=/tmp/B.10x4x0c_/BUILD/tmp exec nice -n 0 rpmbuild -bb --define '_smp_mflags -j9' --define '_make_opts -Otarget' --define '_pld_builder 1' --define '_topdir /tmp/B.10x4x0c_' --define '_specdir %{_topdir}' --define '_sourcedir %{_specdir}' --define '_rpmdir %{_topdir}/RPMS' --define '_builddir %{_topdir}/BUILD' --target x86_64-pld-linux /tmp/B.10x4x0c_/apache-mod_clamav.spec + : build-id: efd9deba-68c6-4cdb-a170-f12d6bcb9608 + TMPDIR=/tmp/B.10x4x0c_/BUILD/tmp + exec nice -n 0 rpmbuild -bb --define '_smp_mflags -j9' --define '_make_opts -Otarget' --define '_pld_builder 1' --define '_topdir /tmp/B.10x4x0c_' --define '_specdir %{_topdir}' --define '_sourcedir %{_specdir}' --define '_rpmdir %{_topdir}/RPMS' --define '_builddir %{_topdir}/BUILD' --target x86_64-pld-linux /tmp/B.10x4x0c_/apache-mod_clamav.spec warning: Could not canonicalize hostname: ymir Building target platforms: x86_64-pld-linux Building for target x86_64-pld-linux Executing(%prep): /bin/sh -e /tmp/B.10x4x0c_/BUILD/tmp/rpm-tmp.MvJO8L + umask 022 + cd /tmp/B.10x4x0c_/BUILD + cd /tmp/B.10x4x0c_/BUILD + rm -rf mod_clamav-0.23 + /bin/gzip -dc /tmp/B.10x4x0c_/mod_clamav-0.23.tar.gz + /bin/tar -xof - + STATUS=0 + '[' 0 -ne 0 ']' + cd mod_clamav-0.23 + /bin/chmod -Rf a+rX,u+w,g-w,o-w . + echo 'Patch #0 (apache-mod_clamav-clamav.patch):' Patch #0 (apache-mod_clamav-clamav.patch): + </tmp/B.10x4x0c_/apache-mod_clamav-clamav.patch + /usr/bin/patch -s -p1 '--fuzz=0' + RPM_EC=0 + jobs -p + exit 0 Executing(%build): /bin/sh -e /tmp/B.10x4x0c_/BUILD/tmp/rpm-tmp.ihMIck TMP=/home/users/builder/tmp HOME=/home/users/builder PATH=/home/users/builder/GNUstep/Tools:/bin:/usr/bin:/usr/local/bin:/home/users/builder/bin TMPDIR=/tmp/B.10x4x0c_/BUILD/tmp + umask 022 + cd /tmp/B.10x4x0c_/BUILD + cd mod_clamav-0.23 + libtoolize --copy --force --install libtoolize: putting auxiliary files in '.'. libtoolize: copying file './config.guess' libtoolize: copying file './config.sub' libtoolize: copying file './install-sh' libtoolize: copying file './ltmain.sh' libtoolize: You should add the contents of the following files to 'aclocal.m4': libtoolize: '/usr/share/aclocal/libtool.m4' libtoolize: '/usr/share/aclocal/ltoptions.m4' libtoolize: '/usr/share/aclocal/ltsugar.m4' libtoolize: '/usr/share/aclocal/ltversion.m4' libtoolize: '/usr/share/aclocal/lt~obsolete.m4' libtoolize: Consider adding 'AC_CONFIG_MACRO_DIRS([m4])' to configure.in, libtoolize: and rerunning libtoolize and aclocal. libtoolize: Consider adding '-I m4' to ACLOCAL_AMFLAGS in Makefile.am. + aclocal aclocal: warning: autoconf input should be named 'configure.ac', not 'configure.in' + autoconf configure.in:10: warning: AM_INIT_AUTOMAKE: two- and three-arguments forms are deprecated. ./lib/autoconf/general.m4:2434: AC_DIAGNOSE is expanded from... aclocal.m4:9496: AM_INIT_AUTOMAKE is expanded from... configure.in:10: the top level configure.in:11: warning: The macro `AC_CONFIG_HEADER' is obsolete. configure.in:11: You should run autoupdate. ./lib/autoconf/status.m4:719: AC_CONFIG_HEADER is expanded from... configure.in:11: the top level configure.in:59: warning: The macro `AM_DISABLE_STATIC' is obsolete. configure.in:59: You should run autoupdate. aclocal.m4:8665: AM_DISABLE_STATIC is expanded from... configure.in:59: the top level configure.in:60: warning: The macro `AC_PROG_LIBTOOL' is obsolete. configure.in:60: You should run autoupdate. aclocal.m4:121: AC_PROG_LIBTOOL is expanded from... configure.in:60: the top level configure.in:73: warning: AC_OUTPUT should be used without arguments. configure.in:73: You should run autoupdate. + automake -a -c -f --foreign automake: warning: autoconf input should be named 'configure.ac', not 'configure.in' configure.in:10: warning: AM_INIT_AUTOMAKE: two- and three-arguments forms are deprecated. For more info, see: configure.in:10: https://www.gnu.org/software/automake/manual/automake.html#Modernize-AM_005fINIT_005fAUTOMAKE-invocation configure.in:58: installing './compile' configure.in:10: installing './missing' automake: warning: autoconf input should be named 'configure.ac', not 'configure.in' Makefile.am: installing './depcomp' + /usr/bin/apr-1-config --includedir + /usr/bin/apu-1-config --includedir + pkg-config --cflags libclamav + CPPFLAGS='-I/usr/include/apr -I/usr/include/apr-util -I/usr/include/clamav' + ./configure 'LDFLAGS=-Wl,--as-needed -Wl,--no-copy-dt-needed-entries -Wl,-z,relro -Wl,-z,combreloc ' 'CFLAGS=-O2 -fwrapv -pipe -Wformat -Werror=format-security -gdwarf-4 -fno-debug-types-section -fvar-tracking-assignments -g2 -Wp,-D_FORTIFY_SOURCE=2 -fstack-protector-strong --param=ssp-buffer-size=4 -Werror=trampolines -fPIC -march=x86-64 -mtune=generic -gdwarf-4 -fno-debug-types-section -fvar-tracking-assignments -g2 ' 'CXXFLAGS=-O2 -fwrapv -pipe -Wformat -Werror=format-security -gdwarf-4 -fno-debug-types-section -fvar-tracking-assignments -g2 -Wp,-D_FORTIFY_SOURCE=2 -fstack-protector-strong --param=ssp-buffer-size=4 -Werror=trampolines -fPIC -march=x86-64 -mtune=generic -gdwarf-4 -fno-debug-types-section -fvar-tracking-assignments -g2 ' 'FFLAGS=-O2 -fwrapv -pipe -Wformat -Werror=format-security -gdwarf-4 -fno-debug-types-section -fvar-tracking-assignments -g2 -Wp,-D_FORTIFY_SOURCE=2 -fstack-protector-strong --param=ssp-buffer-size=4 -Werror=trampolines -fPIC -march=x86-64 -mtune=generic -gdwarf-4 -fno-debug-types-section -fvar-tracking-assignments -g2 ' 'FCFLAGS=-O2 -fwrapv -pipe -Wformat -Werror=format-security -gdwarf-4 -fno-debug-types-section -fvar-tracking-assignments -g2 -Wp,-D_FORTIFY_SOURCE=2 -fstack-protector-strong --param=ssp-buffer-size=4 -Werror=trampolines -fPIC -march=x86-64 -mtune=generic -gdwarf-4 -fno-debug-types-section -fvar-tracking-assignments -g2 ' 'CPPFLAGS=-I/usr/include/apr -I/usr/include/apr-util -I/usr/include/clamav' 'CC=x86_64-pld-linux-gcc' 'CXX=x86_64-pld-linux-g++' '--host=x86_64-pld-linux' '--build=x86_64-pld-linux' '--prefix=/usr' '--exec-prefix=/usr' '--bindir=/usr/bin' '--sbindir=/usr/sbin' '--sysconfdir=/etc/httpd/conf.d' '--datadir=/usr/share' '--includedir=/usr/include' '--libdir=/usr/lib64' '--libexecdir=/usr/libexec' '--localstatedir=/var' '--sharedstatedir=/var/lib' '--mandir=/usr/share/man' '--infodir=/usr/share/info' '--x-libraries=/usr/lib64' '--with-apxs=/usr/sbin/apxs' checking for a BSD-compatible install... /usr/bin/install -c checking whether build environment is sane... yes checking for a race-free mkdir -p... /bin/mkdir -p checking for mawk... mawk checking whether make sets $(MAKE)... yes checking whether make supports nested variables... yes checking for APXS tool... using /usr/sbin/apxs checking for apr-1-config tool... checking for x86_64-pld-linux-gcc... x86_64-pld-linux-gcc checking whether the C compiler works... yes checking for C compiler default output file name... a.out checking for suffix of executables... checking whether we are cross compiling... no checking for suffix of object files... o checking whether the compiler supports GNU C... yes checking whether x86_64-pld-linux-gcc accepts -g... yes checking for x86_64-pld-linux-gcc option to enable C11 features... none needed checking whether x86_64-pld-linux-gcc understands -c and -o together... yes checking whether make supports the include directive... yes (GNU style) checking dependency style of x86_64-pld-linux-gcc... gcc3 checking build system type... x86_64-pld-linux-gnu checking host system type... x86_64-pld-linux-gnu checking how to print strings... print -r checking for a sed that does not truncate output... /bin/sed checking for grep that handles long lines and -e... /bin/grep checking for egrep... /bin/grep -E checking for fgrep... /bin/grep -F checking for ld used by x86_64-pld-linux-gcc... /usr/bin/ld checking if the linker (/usr/bin/ld) is GNU ld... yes checking for BSD- or MS-compatible name lister (nm)... /usr/bin/nm -B checking the name lister (/usr/bin/nm -B) interface... BSD nm checking whether ln -s works... yes checking the maximum length of command line arguments... 1572864 checking how to convert x86_64-pld-linux-gnu file names to x86_64-pld-linux-gnu format... func_convert_file_noop checking how to convert x86_64-pld-linux-gnu file names to toolchain format... func_convert_file_noop checking for /usr/bin/ld option to reload object files... -r checking for x86_64-pld-linux-objdump... no checking for objdump... objdump checking how to recognize dependent libraries... pass_all checking for x86_64-pld-linux-dlltool... no checking for dlltool... no checking how to associate runtime and link libraries... print -r -- checking for x86_64-pld-linux-ar... no checking for ar... ar checking for archiver @FILE support... @ checking for x86_64-pld-linux-strip... no checking for strip... strip checking for x86_64-pld-linux-ranlib... no checking for ranlib... ranlib checking command to parse /usr/bin/nm -B output from x86_64-pld-linux-gcc object... ok checking for sysroot... no checking for a working dd... /bin/dd checking how to truncate binary pipes... /bin/dd bs=4096 count=1 checking for x86_64-pld-linux-mt... no checking for mt... no checking if : is a manifest tool... no checking for stdio.h... yes checking for stdlib.h... yes checking for string.h... yes checking for inttypes.h... yes checking for stdint.h... yes checking for strings.h... yes checking for sys/stat.h... yes checking for sys/types.h... yes checking for unistd.h... yes checking for dlfcn.h... yes checking for objdir... .libs checking if x86_64-pld-linux-gcc supports -fno-rtti -fno-exceptions... no checking for x86_64-pld-linux-gcc option to produce PIC... -fPIC -DPIC checking if x86_64-pld-linux-gcc PIC flag -fPIC -DPIC works... yes checking if x86_64-pld-linux-gcc static flag -static works... yes checking if x86_64-pld-linux-gcc supports -c -o file.o... yes checking if x86_64-pld-linux-gcc supports -c -o file.o... (cached) yes checking whether the x86_64-pld-linux-gcc linker (/usr/bin/ld -m elf_x86_64) supports shared libraries... yes checking whether -lc should be explicitly linked in... no checking dynamic linker characteristics... GNU/Linux ld.so checking how to hardcode library paths into programs... immediate checking whether stripping libraries is possible... yes checking if libtool supports shared libraries... yes checking whether to build shared libraries... yes checking whether to build static libraries... no checking for cl_scanfile in -lclamav... yes checking for mkstemp... yes checking for alloca.h... yes checking for regex.h... yes checking for sys/time.h... yes checking for ctype.h... yes checking for sys/un.h... yes checking for sys/socket.h... yes checking for string.h... (cached) yes checking for errno.h... yes checking for fcntl.h... yes checking for clamav.h... yes checking for arpa/inet.h... yes checking for netinet/in.h... yes checking that generated files are newer than configure... done configure: creating ./config.status config.status: creating Makefile config.status: creating mod_clamav_version.h config.status: creating mod_clamav.html config.status: creating config.h config.status: executing depfiles commands config.status: executing libtool commands + /usr/bin/make -Otarget -j9 (CDPATH="${ZSH_VERSION+.}:" && cd . && /bin/sh '/tmp/B.10x4x0c_/BUILD/mod_clamav-0.23/missing' autoheader) autoheader: warning: autoconf input should be named 'configure.ac', not 'configure.in' rm -f stamp-h1 touch config.h.in cd . && /bin/sh ./config.status config.h config.status: creating config.h /usr/bin/make all-am make[1]: Entering directory '/tmp/B.10x4x0c_/BUILD/mod_clamav-0.23' /bin/sh ./libtool --tag=CC --mode=compile `/usr/sbin/apxs -q CC` -DHAVE_CONFIG_H -I. `apr-1-config --cppflags` `apr-1-config --includes` -I`/usr/sbin/apxs -q INCLUDEDIR` -I/usr/include/apr -I/usr/include/apr-util -I/usr/include/clamav `apr-1-config --cflags` `/usr/sbin/apxs -q CFLAGS_SHLIB` -O2 -fwrapv -pipe -Wformat -Werror=format-security -gdwarf-4 -fno-debug-types-section -fvar-tracking-assignments -g2 -Wp,-D_FORTIFY_SOURCE=2 -fstack-protector-strong --param=ssp-buffer-size=4 -Werror=trampolines -fPIC -march=x86-64 -mtune=generic -gdwarf-4 -fno-debug-types-section -fvar-tracking-assignments -g2 -MT mod_clamav_la-mod_clamav.lo -MD -MP -MF .deps/mod_clamav_la-mod_clamav.Tpo -c -o mod_clamav_la-mod_clamav.lo `test -f 'mod_clamav.c' || echo './'`mod_clamav.c libtool: compile: x86_64-pld-linux-gcc -DHAVE_CONFIG_H -I. -DLINUX -D_REENTRANT -D_GNU_SOURCE -I/usr/include/apr -I/usr/include/apache -I/usr/include/apr -I/usr/include/apr-util -I/usr/include/clamav -pthread -O2 -fwrapv -pipe -Wformat -Werror=format-security -gdwarf-4 -fno-debug-types-section -fvar-tracking-assignments -g2 -Wp,-D_FORTIFY_SOURCE=2 -fstack-protector-strong --param=ssp-buffer-size=4 -Werror=trampolines -fPIC -march=x86-64 -mtune=generic -gdwarf-4 -fno-debug-types-section -fvar-tracking-assignments -g2 -MT mod_clamav_la-mod_clamav.lo -MD -MP -MF .deps/mod_clamav_la-mod_clamav.Tpo -c mod_clamav.c -fPIC -DPIC -o .libs/mod_clamav_la-mod_clamav.o mv -f .deps/mod_clamav_la-mod_clamav.Tpo .deps/mod_clamav_la-mod_clamav.Plo make[1]: Leaving directory '/tmp/B.10x4x0c_/BUILD/mod_clamav-0.23' make[1]: Entering directory '/tmp/B.10x4x0c_/BUILD/mod_clamav-0.23' /bin/sh ./libtool --tag=CC --mode=compile `/usr/sbin/apxs -q CC` -DHAVE_CONFIG_H -I. `apr-1-config --cppflags` `apr-1-config --includes` -I`/usr/sbin/apxs -q INCLUDEDIR` -I/usr/include/apr -I/usr/include/apr-util -I/usr/include/clamav `apr-1-config --cflags` `/usr/sbin/apxs -q CFLAGS_SHLIB` -O2 -fwrapv -pipe -Wformat -Werror=format-security -gdwarf-4 -fno-debug-types-section -fvar-tracking-assignments -g2 -Wp,-D_FORTIFY_SOURCE=2 -fstack-protector-strong --param=ssp-buffer-size=4 -Werror=trampolines -fPIC -march=x86-64 -mtune=generic -gdwarf-4 -fno-debug-types-section -fvar-tracking-assignments -g2 -MT mod_clamav_la-locking.lo -MD -MP -MF .deps/mod_clamav_la-locking.Tpo -c -o mod_clamav_la-locking.lo `test -f 'locking.c' || echo './'`locking.c libtool: compile: x86_64-pld-linux-gcc -DHAVE_CONFIG_H -I. -DLINUX -D_REENTRANT -D_GNU_SOURCE -I/usr/include/apr -I/usr/include/apache -I/usr/include/apr -I/usr/include/apr-util -I/usr/include/clamav -pthread -O2 -fwrapv -pipe -Wformat -Werror=format-security -gdwarf-4 -fno-debug-types-section -fvar-tracking-assignments -g2 -Wp,-D_FORTIFY_SOURCE=2 -fstack-protector-strong --param=ssp-buffer-size=4 -Werror=trampolines -fPIC -march=x86-64 -mtune=generic -gdwarf-4 -fno-debug-types-section -fvar-tracking-assignments -g2 -MT mod_clamav_la-locking.lo -MD -MP -MF .deps/mod_clamav_la-locking.Tpo -c locking.c -fPIC -DPIC -o .libs/mod_clamav_la-locking.o mv -f .deps/mod_clamav_la-locking.Tpo .deps/mod_clamav_la-locking.Plo make[1]: Leaving directory '/tmp/B.10x4x0c_/BUILD/mod_clamav-0.23' make[1]: Entering directory '/tmp/B.10x4x0c_/BUILD/mod_clamav-0.23' /bin/sh ./libtool --tag=CC --mode=compile `/usr/sbin/apxs -q CC` -DHAVE_CONFIG_H -I. `apr-1-config --cppflags` `apr-1-config --includes` -I`/usr/sbin/apxs -q INCLUDEDIR` -I/usr/include/apr -I/usr/include/apr-util -I/usr/include/clamav `apr-1-config --cflags` `/usr/sbin/apxs -q CFLAGS_SHLIB` -O2 -fwrapv -pipe -Wformat -Werror=format-security -gdwarf-4 -fno-debug-types-section -fvar-tracking-assignments -g2 -Wp,-D_FORTIFY_SOURCE=2 -fstack-protector-strong --param=ssp-buffer-size=4 -Werror=trampolines -fPIC -march=x86-64 -mtune=generic -gdwarf-4 -fno-debug-types-section -fvar-tracking-assignments -g2 -MT mod_clamav_la-shmem.lo -MD -MP -MF .deps/mod_clamav_la-shmem.Tpo -c -o mod_clamav_la-shmem.lo `test -f 'shmem.c' || echo './'`shmem.c libtool: compile: x86_64-pld-linux-gcc -DHAVE_CONFIG_H -I. -DLINUX -D_REENTRANT -D_GNU_SOURCE -I/usr/include/apr -I/usr/include/apache -I/usr/include/apr -I/usr/include/apr-util -I/usr/include/clamav -pthread -O2 -fwrapv -pipe -Wformat -Werror=format-security -gdwarf-4 -fno-debug-types-section -fvar-tracking-assignments -g2 -Wp,-D_FORTIFY_SOURCE=2 -fstack-protector-strong --param=ssp-buffer-size=4 -Werror=trampolines -fPIC -march=x86-64 -mtune=generic -gdwarf-4 -fno-debug-types-section -fvar-tracking-assignments -g2 -MT mod_clamav_la-shmem.lo -MD -MP -MF .deps/mod_clamav_la-shmem.Tpo -c shmem.c -fPIC -DPIC -o .libs/mod_clamav_la-shmem.o mv -f .deps/mod_clamav_la-shmem.Tpo .deps/mod_clamav_la-shmem.Plo make[1]: Leaving directory '/tmp/B.10x4x0c_/BUILD/mod_clamav-0.23' make[1]: Entering directory '/tmp/B.10x4x0c_/BUILD/mod_clamav-0.23' /bin/sh ./libtool --tag=CC --mode=compile `/usr/sbin/apxs -q CC` -DHAVE_CONFIG_H -I. `apr-1-config --cppflags` `apr-1-config --includes` -I`/usr/sbin/apxs -q INCLUDEDIR` -I/usr/include/apr -I/usr/include/apr-util -I/usr/include/clamav `apr-1-config --cflags` `/usr/sbin/apxs -q CFLAGS_SHLIB` -O2 -fwrapv -pipe -Wformat -Werror=format-security -gdwarf-4 -fno-debug-types-section -fvar-tracking-assignments -g2 -Wp,-D_FORTIFY_SOURCE=2 -fstack-protector-strong --param=ssp-buffer-size=4 -Werror=trampolines -fPIC -march=x86-64 -mtune=generic -gdwarf-4 -fno-debug-types-section -fvar-tracking-assignments -g2 -MT mod_clamav_la-bypass.lo -MD -MP -MF .deps/mod_clamav_la-bypass.Tpo -c -o mod_clamav_la-bypass.lo `test -f 'bypass.c' || echo './'`bypass.c libtool: compile: x86_64-pld-linux-gcc -DHAVE_CONFIG_H -I. -DLINUX -D_REENTRANT -D_GNU_SOURCE -I/usr/include/apr -I/usr/include/apache -I/usr/include/apr -I/usr/include/apr-util -I/usr/include/clamav -pthread -O2 -fwrapv -pipe -Wformat -Werror=format-security -gdwarf-4 -fno-debug-types-section -fvar-tracking-assignments -g2 -Wp,-D_FORTIFY_SOURCE=2 -fstack-protector-strong --param=ssp-buffer-size=4 -Werror=trampolines -fPIC -march=x86-64 -mtune=generic -gdwarf-4 -fno-debug-types-section -fvar-tracking-assignments -g2 -MT mod_clamav_la-bypass.lo -MD -MP -MF .deps/mod_clamav_la-bypass.Tpo -c bypass.c -fPIC -DPIC -o .libs/mod_clamav_la-bypass.o mv -f .deps/mod_clamav_la-bypass.Tpo .deps/mod_clamav_la-bypass.Plo make[1]: Leaving directory '/tmp/B.10x4x0c_/BUILD/mod_clamav-0.23' make[1]: Entering directory '/tmp/B.10x4x0c_/BUILD/mod_clamav-0.23' /bin/sh ./libtool --tag=CC --mode=compile `/usr/sbin/apxs -q CC` -DHAVE_CONFIG_H -I. `apr-1-config --cppflags` `apr-1-config --includes` -I`/usr/sbin/apxs -q INCLUDEDIR` -I/usr/include/apr -I/usr/include/apr-util -I/usr/include/clamav `apr-1-config --cflags` `/usr/sbin/apxs -q CFLAGS_SHLIB` -O2 -fwrapv -pipe -Wformat -Werror=format-security -gdwarf-4 -fno-debug-types-section -fvar-tracking-assignments -g2 -Wp,-D_FORTIFY_SOURCE=2 -fstack-protector-strong --param=ssp-buffer-size=4 -Werror=trampolines -fPIC -march=x86-64 -mtune=generic -gdwarf-4 -fno-debug-types-section -fvar-tracking-assignments -g2 -MT mod_clamav_la-init.lo -MD -MP -MF .deps/mod_clamav_la-init.Tpo -c -o mod_clamav_la-init.lo `test -f 'init.c' || echo './'`init.c libtool: compile: x86_64-pld-linux-gcc -DHAVE_CONFIG_H -I. -DLINUX -D_REENTRANT -D_GNU_SOURCE -I/usr/include/apr -I/usr/include/apache -I/usr/include/apr -I/usr/include/apr-util -I/usr/include/clamav -pthread -O2 -fwrapv -pipe -Wformat -Werror=format-security -gdwarf-4 -fno-debug-types-section -fvar-tracking-assignments -g2 -Wp,-D_FORTIFY_SOURCE=2 -fstack-protector-strong --param=ssp-buffer-size=4 -Werror=trampolines -fPIC -march=x86-64 -mtune=generic -gdwarf-4 -fno-debug-types-section -fvar-tracking-assignments -g2 -MT mod_clamav_la-init.lo -MD -MP -MF .deps/mod_clamav_la-init.Tpo -c init.c -fPIC -DPIC -o .libs/mod_clamav_la-init.o mv -f .deps/mod_clamav_la-init.Tpo .deps/mod_clamav_la-init.Plo make[1]: Leaving directory '/tmp/B.10x4x0c_/BUILD/mod_clamav-0.23' make[1]: Entering directory '/tmp/B.10x4x0c_/BUILD/mod_clamav-0.23' /bin/sh ./libtool --tag=CC --mode=compile `/usr/sbin/apxs -q CC` -DHAVE_CONFIG_H -I. `apr-1-config --cppflags` `apr-1-config --includes` -I`/usr/sbin/apxs -q INCLUDEDIR` -I/usr/include/apr -I/usr/include/apr-util -I/usr/include/clamav `apr-1-config --cflags` `/usr/sbin/apxs -q CFLAGS_SHLIB` -O2 -fwrapv -pipe -Wformat -Werror=format-security -gdwarf-4 -fno-debug-types-section -fvar-tracking-assignments -g2 -Wp,-D_FORTIFY_SOURCE=2 -fstack-protector-strong --param=ssp-buffer-size=4 -Werror=trampolines -fPIC -march=x86-64 -mtune=generic -gdwarf-4 -fno-debug-types-section -fvar-tracking-assignments -g2 -MT mod_clamav_la-config.lo -MD -MP -MF .deps/mod_clamav_la-config.Tpo -c -o mod_clamav_la-config.lo `test -f 'config.c' || echo './'`config.c libtool: compile: x86_64-pld-linux-gcc -DHAVE_CONFIG_H -I. -DLINUX -D_REENTRANT -D_GNU_SOURCE -I/usr/include/apr -I/usr/include/apache -I/usr/include/apr -I/usr/include/apr-util -I/usr/include/clamav -pthread -O2 -fwrapv -pipe -Wformat -Werror=format-security -gdwarf-4 -fno-debug-types-section -fvar-tracking-assignments -g2 -Wp,-D_FORTIFY_SOURCE=2 -fstack-protector-strong --param=ssp-buffer-size=4 -Werror=trampolines -fPIC -march=x86-64 -mtune=generic -gdwarf-4 -fno-debug-types-section -fvar-tracking-assignments -g2 -MT mod_clamav_la-config.lo -MD -MP -MF .deps/mod_clamav_la-config.Tpo -c config.c -fPIC -DPIC -o .libs/mod_clamav_la-config.o mv -f .deps/mod_clamav_la-config.Tpo .deps/mod_clamav_la-config.Plo make[1]: Leaving directory '/tmp/B.10x4x0c_/BUILD/mod_clamav-0.23' make[1]: Entering directory '/tmp/B.10x4x0c_/BUILD/mod_clamav-0.23' /bin/sh ./libtool --tag=CC --mode=compile `/usr/sbin/apxs -q CC` -DHAVE_CONFIG_H -I. `apr-1-config --cppflags` `apr-1-config --includes` -I`/usr/sbin/apxs -q INCLUDEDIR` -I/usr/include/apr -I/usr/include/apr-util -I/usr/include/clamav `apr-1-config --cflags` `/usr/sbin/apxs -q CFLAGS_SHLIB` -O2 -fwrapv -pipe -Wformat -Werror=format-security -gdwarf-4 -fno-debug-types-section -fvar-tracking-assignments -g2 -Wp,-D_FORTIFY_SOURCE=2 -fstack-protector-strong --param=ssp-buffer-size=4 -Werror=trampolines -fPIC -march=x86-64 -mtune=generic -gdwarf-4 -fno-debug-types-section -fvar-tracking-assignments -g2 -MT mod_clamav_la-handler.lo -MD -MP -MF .deps/mod_clamav_la-handler.Tpo -c -o mod_clamav_la-handler.lo `test -f 'handler.c' || echo './'`handler.c libtool: compile: x86_64-pld-linux-gcc -DHAVE_CONFIG_H -I. -DLINUX -D_REENTRANT -D_GNU_SOURCE -I/usr/include/apr -I/usr/include/apache -I/usr/include/apr -I/usr/include/apr-util -I/usr/include/clamav -pthread -O2 -fwrapv -pipe -Wformat -Werror=format-security -gdwarf-4 -fno-debug-types-section -fvar-tracking-assignments -g2 -Wp,-D_FORTIFY_SOURCE=2 -fstack-protector-strong --param=ssp-buffer-size=4 -Werror=trampolines -fPIC -march=x86-64 -mtune=generic -gdwarf-4 -fno-debug-types-section -fvar-tracking-assignments -g2 -MT mod_clamav_la-handler.lo -MD -MP -MF .deps/mod_clamav_la-handler.Tpo -c handler.c -fPIC -DPIC -o .libs/mod_clamav_la-handler.o mv -f .deps/mod_clamav_la-handler.Tpo .deps/mod_clamav_la-handler.Plo make[1]: Leaving directory '/tmp/B.10x4x0c_/BUILD/mod_clamav-0.23' make[1]: Entering directory '/tmp/B.10x4x0c_/BUILD/mod_clamav-0.23' /bin/sh ./libtool --tag=CC --mode=compile `/usr/sbin/apxs -q CC` -DHAVE_CONFIG_H -I. `apr-1-config --cppflags` `apr-1-config --includes` -I`/usr/sbin/apxs -q INCLUDEDIR` -I/usr/include/apr -I/usr/include/apr-util -I/usr/include/clamav `apr-1-config --cflags` `/usr/sbin/apxs -q CFLAGS_SHLIB` -O2 -fwrapv -pipe -Wformat -Werror=format-security -gdwarf-4 -fno-debug-types-section -fvar-tracking-assignments -g2 -Wp,-D_FORTIFY_SOURCE=2 -fstack-protector-strong --param=ssp-buffer-size=4 -Werror=trampolines -fPIC -march=x86-64 -mtune=generic -gdwarf-4 -fno-debug-types-section -fvar-tracking-assignments -g2 -MT mod_clamav_la-filter.lo -MD -MP -MF .deps/mod_clamav_la-filter.Tpo -c -o mod_clamav_la-filter.lo `test -f 'filter.c' || echo './'`filter.c libtool: compile: x86_64-pld-linux-gcc -DHAVE_CONFIG_H -I. -DLINUX -D_REENTRANT -D_GNU_SOURCE -I/usr/include/apr -I/usr/include/apache -I/usr/include/apr -I/usr/include/apr-util -I/usr/include/clamav -pthread -O2 -fwrapv -pipe -Wformat -Werror=format-security -gdwarf-4 -fno-debug-types-section -fvar-tracking-assignments -g2 -Wp,-D_FORTIFY_SOURCE=2 -fstack-protector-strong --param=ssp-buffer-size=4 -Werror=trampolines -fPIC -march=x86-64 -mtune=generic -gdwarf-4 -fno-debug-types-section -fvar-tracking-assignments -g2 -MT mod_clamav_la-filter.lo -MD -MP -MF .deps/mod_clamav_la-filter.Tpo -c filter.c -fPIC -DPIC -o .libs/mod_clamav_la-filter.o mv -f .deps/mod_clamav_la-filter.Tpo .deps/mod_clamav_la-filter.Plo make[1]: Leaving directory '/tmp/B.10x4x0c_/BUILD/mod_clamav-0.23' make[1]: Entering directory '/tmp/B.10x4x0c_/BUILD/mod_clamav-0.23' /bin/sh ./libtool --tag=CC --mode=link `/usr/sbin/apxs -q CC` `apr-1-config --cflags` `/usr/sbin/apxs -q CFLAGS_SHLIB` -O2 -fwrapv -pipe -Wformat -Werror=format-security -gdwarf-4 -fno-debug-types-section -fvar-tracking-assignments -g2 -Wp,-D_FORTIFY_SOURCE=2 -fstack-protector-strong --param=ssp-buffer-size=4 -Werror=trampolines -fPIC -march=x86-64 -mtune=generic -gdwarf-4 -fno-debug-types-section -fvar-tracking-assignments -g2 `apr-1-config --ldflags` -module `/usr/sbin/apxs -q LDFLAGS_SHLIB` -Wl,--as-needed -Wl,--no-copy-dt-needed-entries -Wl,-z,relro -Wl,-z,combreloc -o mod_clamav.la -rpath /usr/lib64 mod_clamav_la-config.lo mod_clamav_la-locking.lo mod_clamav_la-handler.lo mod_clamav_la-shmem.lo mod_clamav_la-init.lo mod_clamav_la-filter.lo mod_clamav_la-bypass.lo mod_clamav_la-mod_clamav.lo -lclamav libtool: link: x86_64-pld-linux-gcc -shared -fPIC -DPIC -pthread -O2 -gdwarf-4 -g2 -fstack-protector-strong -march=x86-64 -mtune=generic -gdwarf-4 -g2 -Wl,--as-needed -Wl,--no-copy-dt-needed-entries -Wl,-z -Wl,relro -Wl,-z -Wl,combreloc -pthread .libs/mod_clamav_la-config.o .libs/mod_clamav_la-locking.o .libs/mod_clamav_la-handler.o .libs/mod_clamav_la-shmem.o .libs/mod_clamav_la-init.o .libs/mod_clamav_la-filter.o .libs/mod_clamav_la-bypass.o .libs/mod_clamav_la-mod_clamav.o -lclamav -Wl,-soname -Wl,mod_clamav.so.0 -o .libs/mod_clamav.so.0.0.0 /usr/bin/ld: .libs/mod_clamav_la-locking.o:/tmp/B.10x4x0c_/BUILD/mod_clamav-0.23/./mod_clamav.h:101: multiple definition of `clamav_module'; .libs/mod_clamav_la-config.o:/tmp/B.10x4x0c_/BUILD/mod_clamav-0.23/./mod_clamav.h:101: first defined here /usr/bin/ld: .libs/mod_clamav_la-handler.o:/tmp/B.10x4x0c_/BUILD/mod_clamav-0.23/./mod_clamav.h:101: multiple definition of `clamav_module'; .libs/mod_clamav_la-config.o:/tmp/B.10x4x0c_/BUILD/mod_clamav-0.23/./mod_clamav.h:101: first defined here /usr/bin/ld: .libs/mod_clamav_la-shmem.o:/tmp/B.10x4x0c_/BUILD/mod_clamav-0.23/./mod_clamav.h:101: multiple definition of `clamav_module'; .libs/mod_clamav_la-config.o:/tmp/B.10x4x0c_/BUILD/mod_clamav-0.23/./mod_clamav.h:101: first defined here /usr/bin/ld: .libs/mod_clamav_la-init.o:/tmp/B.10x4x0c_/BUILD/mod_clamav-0.23/./mod_clamav.h:101: multiple definition of `clamav_module'; .libs/mod_clamav_la-config.o:/tmp/B.10x4x0c_/BUILD/mod_clamav-0.23/./mod_clamav.h:101: first defined here /usr/bin/ld: .libs/mod_clamav_la-filter.o:/tmp/B.10x4x0c_/BUILD/mod_clamav-0.23/./mod_clamav.h:101: multiple definition of `clamav_module'; .libs/mod_clamav_la-config.o:/tmp/B.10x4x0c_/BUILD/mod_clamav-0.23/./mod_clamav.h:101: first defined here /usr/bin/ld: .libs/mod_clamav_la-bypass.o:/tmp/B.10x4x0c_/BUILD/mod_clamav-0.23/./mod_clamav.h:101: multiple definition of `clamav_module'; .libs/mod_clamav_la-config.o:/tmp/B.10x4x0c_/BUILD/mod_clamav-0.23/./mod_clamav.h:101: first defined here /usr/bin/ld: .libs/mod_clamav_la-mod_clamav.o:/tmp/B.10x4x0c_/BUILD/mod_clamav-0.23/./mod_clamav.h:101: multiple definition of `clamav_module'; .libs/mod_clamav_la-config.o:/tmp/B.10x4x0c_/BUILD/mod_clamav-0.23/./mod_clamav.h:101: first defined here collect2: error: ld returned 1 exit status make[1]: *** [Makefile:459: mod_clamav.la] Error 1 make[1]: Leaving directory '/tmp/B.10x4x0c_/BUILD/mod_clamav-0.23' make: *** [Makefile:390: all] Error 2 error: Bad exit status from /tmp/B.10x4x0c_/BUILD/tmp/rpm-tmp.ihMIck (%build) RPM build errors: Could not canonicalize hostname: ymir Bad exit status from /tmp/B.10x4x0c_/BUILD/tmp/rpm-tmp.ihMIck (%build) ended at: Sat Oct 9 10:22:19 2021, done in 0:00:09.456574 error: No files produced. + chmod -R u+rwX /tmp/B.10x4x0c_/BUILD + rm -rf /tmp/B.10x4x0c_/tmp /tmp/B.10x4x0c_/BUILD + rm -rf /tmp/B.10x4x0c_ Begin-PLD-Builder-Info Build-Time: user:18.13s sys:4.81s real:23.71s (faults io:77 non-io:1209303) End-PLD-Builder-Info
[Back to list of logs] [View rpm -qa of builder]