FailedOk

th/SRPMS[OK]
th/x32[OK]
th/i686[OK]
th/x86_64[OK]

ac/SRPMS[OK]
ac/i386[OK]
ac/i586[OK]
ac/i686[OK]
ac/alpha[OK]
ac/amd64[OK]
ac/athlon[OK]
ac/ppc[OK]
ac/sparc[OK]
ac/sparc64[OK]

Advanced Search
main()
Powered by PLD Linux
(c) 2002-2024 PLD Team
$Revision: 1.37 $
Powered by Dark Side of the Force.
Your IP: 3.236.112.70

artanis 29428d06-f2e7-42b5-b3ae-c907b51cbd6d

Status:Failed
Source URL:https://buildlogs.pld-linux.org/pld/th/x86_64/FAIL/artanis,29428d06-f2e7-42b5-b3ae-c907b51cbd6d.bz2
text/plain URL:View!
full text:View!
rpm -qa of builder:View!
Date:2024/05/25 00:41:25
Runtime:0:00:02.061975

Toc:

  • error 1
  • rpm: error: Failed build dependencies:
  • error 2
  • rpm: error: Failed build dependencies:
  • error 3
  • rpm: error: Failed build dependencies:
  • prep
  • Executing(%prep): /bin/sh -e /tmp/B.0440zrnf/BUILD/tmp/rpm-tmp.hA9YLN
  • build
  • Executing(%build): /bin/sh -e /tmp/B.0440zrnf/BUILD/tmp/rpm-tmp.kSJY7Z
  • error 4
  • error: Bad exit status from /tmp/B.0440zrnf/BUILD/tmp/rpm-tmp.kSJY7Z (%build)
  • error 5
  • RPM build errors:
  • error 6
  • error: No files produced.

Content:

checking if we should skip the build
started at: Sat May 25 00:41:04 2024
killing old processes on a builder
sending signal 9 to pid -1
cleaning up /tmp
fetching https://srcbuilder.pld-linux.org/th//srpms/29428d06-f2e7-42b5-b3ae-c907b51cbd6d/artanis-0.6-1.src.rpm
fetched 483469 bytes, 1263.3 K/s
installing srpm: artanis-0.6-1.src.rpm
+ install -d /tmp/B.0440zrnf/BUILD /tmp/B.0440zrnf/RPMS
+ LC_ALL=en_US.UTF-8
+ rpm -qp --changelog artanis-0.6-1.src.rpm
* Fri May 24 2024 PLD Linux Team <feedback@pld-linux.org>
- For complete changelog see: http://git.pld-linux.org/?p=packages/artanis.git;a=log;h=master
* Fri May 24 2024 Jakub Bogusz <qboosh@pld-linux.org> 40c384e
- updated to 0.6 for guile 3.0 * Sat Jan 22 2022 Jakub Bogusz <qboosh@pld-linux.org> a81d185
- new + rpm -Uhv --nodeps --define '_topdir /tmp/B.0440zrnf' --define '_specdir %{_topdir}' --define '_sourcedir %{_specdir}' --define '_rpmdir %{_topdir}/RPMS' --define '_builddir %{_topdir}/BUILD' artanis-0.6-1.src.rpm Updating / installing... artanis-0.6-1 ######################################## + rm -f artanis-0.6-1.src.rpm + install -m 700 -d /tmp/B.0440zrnf/BUILD/tmp + TMPDIR=/tmp/B.0440zrnf/BUILD/tmp + exec nice -n 0 rpmbuild -bp --short-circuit --nodeps --define '_topdir /tmp/B.0440zrnf' --define '_specdir %{_topdir}' --define '_sourcedir %{_specdir}' --define '_rpmdir %{_topdir}/RPMS' --define '_builddir %{_topdir}/BUILD' --target x86_64-pld-linux --define 'prep exit 0' /tmp/B.0440zrnf/artanis.spec warning: Could not canonicalize hostname: ymir Building target platforms: x86_64-pld-linux Building for target x86_64-pld-linux RPM build warnings: Could not canonicalize hostname: ymir checking BuildConflict-ing packages rpm: warning: Could not canonicalize hostname: ymir rpm: error: Failed build dependencies: rpm: guile-curl is needed by artanis-0.6-1.x86_64 rpm: Building target platforms: x86_64-pld-linux rpm: Building for target x86_64-pld-linux rpm: rpm: RPM build warnings: rpm: Could not canonicalize hostname: ymir no BuildConflicts found checking BR rpm: warning: Could not canonicalize hostname: ymir rpm: error: Failed build dependencies: rpm: guile-curl is needed by artanis-0.6-1.x86_64 rpm: Building target platforms: x86_64-pld-linux rpm: Building for target x86_64-pld-linux rpm: rpm: RPM build warnings: rpm: Could not canonicalize hostname: ymir updating poldek cache... ready is up to date th is up to date th is up to date th-ready is up to date th-ready is up to date Retrieving th-test::packages.ndir.diff.toc.gz..............................................done Retrieving diff::packages.ndir.2024.05.24-20.24.01.gz......................................done Loading [pndir]th-test... Applying packages.ndir.2024.05.24-20.24.01.gz... Retrieving diff::packages.ndir.2024.05.24-20.33.03.gz......................................done Applying packages.ndir.2024.05.24-20.33.03.gz... Writing /root/.cache/poldek/[...]/packages.ndir.gz... Retrieving th-test::packages.ndir.diff.toc.gz..............................................done Retrieving diff::packages.ndir.2024.05.24-20.24.01.gz......................................done Retrieving diff::packages.ndir.dscr.2024.05.24-20.24.01.gz.................................done Loading [pndir]th-test... Applying packages.ndir.2024.05.24-20.24.01.gz... Applying packages.ndir.2024.05.24-20.33.03.gz... Retrieving diff::packages.ndir.2024.05.24-20.37.01.gz......................................done Applying packages.ndir.2024.05.24-20.37.01.gz... Writing /root/.cache/poldek/[...]/packages.ndir.gz... checking conflicting packages in BRed packages poldek: Loading [pndir]ready... poldek: Loading [pndir]th-test... poldek: Loading [pndir]th-test... poldek: Loading [pndir]th-ready... poldek: Loading [pndir]th-ready... poldek: Loading [pndir]th... poldek: Loading [pndir]th... poldek: 34563 packages read poldek: Removed 3363 duplicate packages from available set poldek: Processing dependencies... poldek: There are 1 package to install: poldek: A guile-curl-0.9-1.x86_64 poldek: This operation will use 291.1KB of disk space. poldek: Need to get 61.6KB of archives. poldek: guile-curl-0.9-1.x86_64.rpm: digests OK poldek: Executing pm-command.sh --upgrade -vh --test --root / --define _check_dirname_deps 0... poldek: Verifying... ######################################## poldek: Preparing... ######################################## no conflicts found checking BR rpm: warning: Could not canonicalize hostname: ymir rpm: error: Failed build dependencies: rpm: guile-curl is needed by artanis-0.6-1.x86_64 rpm: Building target platforms: x86_64-pld-linux rpm: Building for target x86_64-pld-linux rpm: rpm: RPM build warnings: rpm: Could not canonicalize hostname: ymir installing BR: guile\-curl + poldek --noask --caplookup -Q -v '--ignore=hhvm-*' '--ignore=php4-*' '--ignore=php52-*' '--ignore=php54-*' '--ignore=php55-*' '--ignore=php56-*' '--ignore=php70-*' '--ignore=php71-*' '--ignore=php72-*' '--ignore=php73-*' '--ignore=php74-*' '--ignore=php80-*' '--ignore=php81-*' '--ignore=php82-*' --upgrade guile-curl Loading [pndir]ready... Loading [pndir]th-test... Loading [pndir]th-test... Loading [pndir]th-ready... Loading [pndir]th-ready... Loading [pndir]th... Loading [pndir]th... 34563 packages read Removed 3363 duplicate packages from available set Processing dependencies... There are 1 package to install: A guile-curl-0.9-1.x86_64 This operation will use 291.1KB of disk space. Need to get 61.6KB of archives. guile-curl-0.9-1.x86_64.rpm: digests OK Executing pm-command.sh --upgrade -vh --root / --define _check_dirname_deps 0... Verifying... ######################################## Preparing... ######################################## Updating / installing... guile-curl-0.9-1 ######################################## building RPM using: set -ex; : build-id: 29428d06-f2e7-42b5-b3ae-c907b51cbd6d; TMPDIR=/tmp/B.0440zrnf/BUILD/tmp exec nice -n 0 rpmbuild -bb --define '__jobs 28' --define '_smp_mflags -j28' --define '_make_opts -Otarget' --define '_pld_builder 1' --define '_topdir /tmp/B.0440zrnf' --define '_specdir %{_topdir}' --define '_sourcedir %{_specdir}' --define '_rpmdir %{_topdir}/RPMS' --define '_builddir %{_topdir}/BUILD' --target x86_64-pld-linux /tmp/B.0440zrnf/artanis.spec + : build-id: 29428d06-f2e7-42b5-b3ae-c907b51cbd6d + TMPDIR=/tmp/B.0440zrnf/BUILD/tmp + exec nice -n 0 rpmbuild -bb --define '__jobs 28' --define '_smp_mflags -j28' --define '_make_opts -Otarget' --define '_pld_builder 1' --define '_topdir /tmp/B.0440zrnf' --define '_specdir %{_topdir}' --define '_sourcedir %{_specdir}' --define '_rpmdir %{_topdir}/RPMS' --define '_builddir %{_topdir}/BUILD' --target x86_64-pld-linux /tmp/B.0440zrnf/artanis.spec warning: Could not canonicalize hostname: ymir Building target platforms: x86_64-pld-linux Building for target x86_64-pld-linux Executing(%prep): /bin/sh -e /tmp/B.0440zrnf/BUILD/tmp/rpm-tmp.hA9YLN + umask 022 + cd /tmp/B.0440zrnf/BUILD + cd /tmp/B.0440zrnf/BUILD + rm -rf artanis-0.6 + /usr/bin/bzip2 -dc /tmp/B.0440zrnf/artanis-0.6.tar.bz2 + /bin/tar -xof - + STATUS=0 + '[' 0 -ne 0 ']' + cd artanis-0.6 + /bin/chmod -Rf a+rX,u+w,g-w,o-w . + RPM_EC=0 + jobs -p + exit 0 Executing(%build): /bin/sh -e /tmp/B.0440zrnf/BUILD/tmp/rpm-tmp.kSJY7Z TMP=/home/users/builder/tmp HOME=/home/users/builder PATH=/home/users/builder/GNUstep/Tools:/bin:/usr/bin:/usr/local/bin:/home/users/builder/bin TMPDIR=/tmp/B.0440zrnf/BUILD/tmp + umask 022 + cd /tmp/B.0440zrnf/BUILD + cd artanis-0.6 + ./configure 'LDFLAGS=-Wl,--as-needed -Wl,--no-copy-dt-needed-entries -Wl,-z,relro -Wl,-z,combreloc ' 'CFLAGS=-O2 -fwrapv -pipe -Wformat -Werror=format-security -gdwarf-4 -fno-debug-types-section -fvar-tracking-assignments -g2 -Wp,-D_FORTIFY_SOURCE=2 -fstack-protector-strong --param=ssp-buffer-size=4 -Werror=trampolines -fPIC -march=x86-64 -mtune=generic -gdwarf-4 -fno-debug-types-section -fvar-tracking-assignments -g2 ' 'CXXFLAGS=-O2 -fwrapv -pipe -Wformat -Werror=format-security -gdwarf-4 -fno-debug-types-section -fvar-tracking-assignments -g2 -Wp,-D_FORTIFY_SOURCE=2 -fstack-protector-strong --param=ssp-buffer-size=4 -Werror=trampolines -fPIC -march=x86-64 -mtune=generic -gdwarf-4 -fno-debug-types-section -fvar-tracking-assignments -g2 ' 'FFLAGS=-O2 -fwrapv -pipe -Wformat -Werror=format-security -gdwarf-4 -fno-debug-types-section -fvar-tracking-assignments -g2 -Wp,-D_FORTIFY_SOURCE=2 -fstack-protector-strong --param=ssp-buffer-size=4 -Werror=trampolines -fPIC -march=x86-64 -mtune=generic -gdwarf-4 -fno-debug-types-section -fvar-tracking-assignments -g2 ' 'FCFLAGS=-O2 -fwrapv -pipe -Wformat -Werror=format-security -gdwarf-4 -fno-debug-types-section -fvar-tracking-assignments -g2 -Wp,-D_FORTIFY_SOURCE=2 -fstack-protector-strong --param=ssp-buffer-size=4 -Werror=trampolines -fPIC -march=x86-64 -mtune=generic -gdwarf-4 -fno-debug-types-section -fvar-tracking-assignments -g2 ' 'CPPFLAGS=' 'CC=x86_64-pld-linux-gcc' 'CXX=x86_64-pld-linux-g++' '--host=x86_64-pld-linux' '--build=x86_64-pld-linux' '--prefix=/usr' '--exec-prefix=/usr' '--bindir=/usr/bin' '--sbindir=/usr/sbin' '--sysconfdir=/etc' '--datadir=/usr/share' '--includedir=/usr/include' '--libdir=/usr/lib64' '--libexecdir=/usr/libexec' '--localstatedir=/var' '--sharedstatedir=/var/lib' '--mandir=/usr/share/man' '--infodir=/usr/share/info' '--x-libraries=/usr/lib64' checking for a BSD-compatible install... /usr/bin/install -c checking whether ln -s works... yes checking whether make sets $(MAKE)... yes checking for x86_64-pld-linux-pkg-config... no checking for pkg-config... /usr/bin/pkg-config checking pkg-config is at least version 0.9.0... yes configure: checking for guile 3.0 configure: found guile 3.0 checking for guile-3.0... no checking for guile3.0... no checking for guile-3... no checking for guile3... no checking for guile... /usr/bin/guile checking for Guile version >= 3.0... 3.0.9 checking for guild... /usr/bin/guild checking for guile-config... /usr/bin/guile-config checking for x86_64-pld-linux-gcc... x86_64-pld-linux-gcc checking whether the C compiler works... yes checking for C compiler default output file name... a.out checking for suffix of executables... checking whether we are cross compiling... no checking for suffix of object files... o checking whether the compiler supports GNU C... yes checking whether x86_64-pld-linux-gcc accepts -g... yes checking for x86_64-pld-linux-gcc option to enable C11 features... none needed checking build system type... x86_64-pld-linux-gnu checking host system type... x86_64-pld-linux-gnu checking for ld used by x86_64-pld-linux-gcc... /usr/bin/ld checking if the linker (/usr/bin/ld) is GNU ld... yes checking for shared library run path origin... done checking 32-bit host C ABI... no checking how to run the C preprocessor... x86_64-pld-linux-gcc -E checking for grep that handles long lines and -e... /bin/grep checking for egrep... /bin/grep -E checking for ELF binary format... yes checking for the common suffixes of directories in the library search path... lib,lib,lib64 checking for guile-3.0... yes checking for Guile site directory... /usr/share/guile/site/3.0 checking for Guile site-ccache directory using pkgconfig... /usr/lib64/guile/3.0/site-ccache checking for Guile extensions directory... /usr/lib64/guile/3.0/extensions checking if (curl) is available... yes configure: creating ./config.status config.status: creating Makefile config.status: creating bin/art config.status: creating config.h + /usr/bin/make -Otarget -j28 + compiling artanis/artanis.scm script: failed to create pseudo-terminal: No such file or directory cat: build.err.artanis.go: No such file or directory make: *** [Makefile:75: obj/artanis/artanis.go] Error 1 make: *** Waiting for unfinished jobs.... Regenerating artanis/version.scm + compiling artanis/cache.scm script: failed to create pseudo-terminal: No such file or directory cat: build.err.cache.go: No such file or directory make: *** [Makefile:79: obj/artanis/cache.go] Error 1 + compiling artanis/client.scm script: failed to create pseudo-terminal: No such file or directory cat: build.err.client.go: No such file or directory make: *** [Makefile:79: obj/artanis/client.go] Error 1 + compiling artanis/commands.scm script: failed to create pseudo-terminal: No such file or directory cat: build.err.commands.go: No such file or directory make: *** [Makefile:79: obj/artanis/commands.go] Error 1 make[1]: 'artanis/version.scm' is up to date. error: Bad exit status from /tmp/B.0440zrnf/BUILD/tmp/rpm-tmp.kSJY7Z (%build) RPM build warnings: Could not canonicalize hostname: ymir RPM build errors: Bad exit status from /tmp/B.0440zrnf/BUILD/tmp/rpm-tmp.kSJY7Z (%build) ended at: Sat May 25 00:41:24 2024, done in 0:00:02.061975 error: No files produced. + chmod -R u+rwX /tmp/B.0440zrnf/BUILD + rm -rf /tmp/B.0440zrnf/tmp /tmp/B.0440zrnf/BUILD + rm -rf /tmp/B.0440zrnf Begin-PLD-Builder-Info Build-Time: user:9.16s sys:3.06s real:20.50s (faults io:0 non-io:519443) End-PLD-Builder-Info
[Back to list of logs] [View rpm -qa of builder]