FailedOk

th/SRPMS[OK]
th/x32[OK]
th/i686[OK]
th/x86_64[OK]

ac/SRPMS[OK]
ac/i386[OK]
ac/i586[OK]
ac/i686[OK]
ac/alpha[OK]
ac/amd64[OK]
ac/athlon[OK]
ac/ppc[OK]
ac/sparc[OK]
ac/sparc64[OK]

Advanced Search
main()
Powered by PLD Linux
(c) 2002-2022 PLD Team
$Revision: 1.37 $
Powered by Unix conspiracy.
Your IP: 54.224.117.125

bastet d415893b-e5c6-429d-a0b9-13209057829b

Status:Failed
Source URL:https://buildlogs.pld-linux.org/pld/th/x86_64/FAIL/bastet,d415893b-e5c6-429d-a0b9-13209057829b.bz2
text/plain URL:View!
full text:View!
rpm -qa of builder:View!
Date:2022/01/14 21:12:10
Runtime:0:00:09.612459

Toc:

  • error 1
  • Ui.cpp:186:14: error: format not a string literal and no format arguments [-Werror=format-security]
  • error 2
  • Ui.cpp:203:14: error: format not a string literal and no format arguments [-Werror=format-security]
  • error 3
  • Ui.cpp:224:14: error: format not a string literal and no format arguments [-Werror=format-security]
  • error 4
  • Ui.cpp:242:16: error: format not a string literal and no format arguments [-Werror=format-security]
  • error 5
  • Ui.cpp:293:16: error: format not a string literal and no format arguments [-Werror=format-security]
  • error 6
  • error: Bad exit status from /tmp/B.q2x_u5th/BUILD/tmp/rpm-tmp.AGSoen (%build)
  • error 7
  • RPM build errors:
  • error 8
  • error: No files produced.

Content:

* Sun Feb 02 2014 Jan Rękorajski <baggins@pld-linux.org> 4bb1ecb
- - rebuild with boost 1.55.0 - release 14 (by relup.sh) * Sun Feb 02 2014 Jan Rękorajski <baggins@pld-linux.org> 4818899
- - rebuild with boost 1.55.0 - release 13 (by relup.sh) * Mon Jul 08 2013 Jan Rękorajski <baggins@pld-linux.org> a9eb451
- release 12 (by relup.sh) * Sun Jul 07 2013 Jan Rękorajski <baggins@pld-linux.org> 7a97dbb
- release 11 (by relup.sh) * Wed Sep 19 2012 Arkadiusz Miśkiewicz <arekm@maven.pl> df6b78e
- release 10 (by relup.sh) * Thu Jul 12 2012 Jan Rękorajski <baggins@pld-linux.org> 9da8bc3
- Rebuild with boost 1.50 Release 9 * Sun Mar 11 2012 Arkadiusz Miśkiewicz <arekm@maven.pl> c136dc7
- release 8 * Wed Aug 31 2011 Arkadiusz Miśkiewicz <arekm@maven.pl> 5215597
- release 7 * Wed May 04 2011 Arkadiusz Miśkiewicz <arekm@maven.pl> 2fcf3a7
- release 6 * Mon Nov 15 2010 Arkadiusz Miśkiewicz <arekm@maven.pl> 5019020
- release 5 + rpm -Uhv --nodeps --define '_topdir /tmp/B.q2x_u5th' --define '_specdir %{_topdir}' --define '_sourcedir %{_specdir}' --define '_rpmdir %{_topdir}/RPMS' --define '_builddir %{_topdir}/BUILD' bastet-0.43.2-2.src.rpm Updating / installing... bastet-0.43.2-2 ######################################## + rm -f bastet-0.43.2-2.src.rpm + install -m 700 -d /tmp/B.q2x_u5th/BUILD/tmp + TMPDIR=/tmp/B.q2x_u5th/BUILD/tmp + exec nice -n 0 rpmbuild -bp --short-circuit --nodeps --define '_topdir /tmp/B.q2x_u5th' --define '_specdir %{_topdir}' --define '_sourcedir %{_specdir}' --define '_rpmdir %{_topdir}/RPMS' --define '_builddir %{_topdir}/BUILD' --target x86_64-pld-linux --define 'prep exit 0' /tmp/B.q2x_u5th/bastet.spec warning: Could not canonicalize hostname: ymir Building target platforms: x86_64-pld-linux Building for target x86_64-pld-linux checking BuildConflict-ing packages rpm: warning: Could not canonicalize hostname: ymir rpm: Building target platforms: x86_64-pld-linux rpm: Building for target x86_64-pld-linux no BuildConflicts found checking BR rpm: warning: Could not canonicalize hostname: ymir rpm: Building target platforms: x86_64-pld-linux rpm: Building for target x86_64-pld-linux no BR needed building RPM using: set -ex; : build-id: d415893b-e5c6-429d-a0b9-13209057829b; TMPDIR=/tmp/B.q2x_u5th/BUILD/tmp exec nice -n 0 rpmbuild -bb --define '_smp_mflags -j9' --define '_make_opts -Otarget' --define '_pld_builder 1' --define '_topdir /tmp/B.q2x_u5th' --define '_specdir %{_topdir}' --define '_sourcedir %{_specdir}' --define '_rpmdir %{_topdir}/RPMS' --define '_builddir %{_topdir}/BUILD' --target x86_64-pld-linux /tmp/B.q2x_u5th/bastet.spec + : build-id: d415893b-e5c6-429d-a0b9-13209057829b + TMPDIR=/tmp/B.q2x_u5th/BUILD/tmp + exec nice -n 0 rpmbuild -bb --define '_smp_mflags -j9' --define '_make_opts -Otarget' --define '_pld_builder 1' --define '_topdir /tmp/B.q2x_u5th' --define '_specdir %{_topdir}' --define '_sourcedir %{_specdir}' --define '_rpmdir %{_topdir}/RPMS' --define '_builddir %{_topdir}/BUILD' --target x86_64-pld-linux /tmp/B.q2x_u5th/bastet.spec warning: Could not canonicalize hostname: ymir Building target platforms: x86_64-pld-linux Building for target x86_64-pld-linux Executing(%prep): /bin/sh -e /tmp/B.q2x_u5th/BUILD/tmp/rpm-tmp.jlZuB8 + umask 022 + cd /tmp/B.q2x_u5th/BUILD + cd /tmp/B.q2x_u5th/BUILD + rm -rf bastet-0.43.2 + /bin/gzip -dc /tmp/B.q2x_u5th/bastet-0.43.2.tar.gz + /bin/tar -xof - + STATUS=0 + '[' 0 -ne 0 ']' + cd bastet-0.43.2 + /bin/chmod -Rf a+rX,u+w,g-w,o-w . + echo 'Patch #0 (bastet-boost.patch):' Patch #0 (bastet-boost.patch): + </tmp/B.q2x_u5th/bastet-boost.patch + /usr/bin/patch -s -p1 '--fuzz=0' + RPM_EC=0 + jobs -p + exit 0 Executing(%build): /bin/sh -e /tmp/B.q2x_u5th/BUILD/tmp/rpm-tmp.AGSoen TMP=/home/users/builder/tmp HOME=/home/users/builder PATH=/home/users/builder/GNUstep/Tools:/bin:/usr/bin:/usr/local/bin:/home/users/builder/bin TMPDIR=/tmp/B.q2x_u5th/BUILD/tmp + umask 022 + cd /tmp/B.q2x_u5th/BUILD + cd bastet-0.43.2 + ncurses6-config --libs + NCURSES_LIBS='-Wl,--as-needed -Wl,--no-copy-dt-needed-entries -lncurses' + /usr/bin/make -Otarget -j9 'CXX=x86_64-pld-linux-g++' 'CXXFLAGS=-O2 -fwrapv -pipe -Wformat -Werror=format-security -gdwarf-4 -fno-debug-types-section -fvar-tracking-assignments -g2 -Wp,-D_FORTIFY_SOURCE=2 -fstack-protector-strong --param=ssp-buffer-size=4 -Werror=trampolines -fPIC -march=x86-64 -mtune=generic -gdwarf-4 -fno-debug-types-section -fvar-tracking-assignments -g2 ' 'LDFLAGS=-Wl,--as-needed -Wl,--no-copy-dt-needed-entries -Wl,-z,relro -Wl,-z,combreloc -Wl,--as-needed -Wl,--no-copy-dt-needed-entries -lncurses -lboost_program_options' x86_64-pld-linux-g++ -MM Ui.cpp Block.cpp Well.cpp BlockPosition.cpp Config.cpp BlockChooser.cpp BastetBlockChooser.cpp main.cpp Test.cpp> depend x86_64-pld-linux-g++ -O2 -fwrapv -pipe -Wformat -Werror=format-security -gdwarf-4 -fno-debug-types-section -fvar-tracking-assignments -g2 -Wp,-D_FORTIFY_SOURCE=2 -fstack-protector-strong --param=ssp-buffer-size=4 -Werror=trampolines -fPIC -march=x86-64 -mtune=generic -gdwarf-4 -fno-debug-types-section -fvar-tracking-assignments -g2 -c -o Block.o Block.cpp x86_64-pld-linux-g++ -O2 -fwrapv -pipe -Wformat -Werror=format-security -gdwarf-4 -fno-debug-types-section -fvar-tracking-assignments -g2 -Wp,-D_FORTIFY_SOURCE=2 -fstack-protector-strong --param=ssp-buffer-size=4 -Werror=trampolines -fPIC -march=x86-64 -mtune=generic -gdwarf-4 -fno-debug-types-section -fvar-tracking-assignments -g2 -c -o BlockChooser.o BlockChooser.cpp x86_64-pld-linux-g++ -O2 -fwrapv -pipe -Wformat -Werror=format-security -gdwarf-4 -fno-debug-types-section -fvar-tracking-assignments -g2 -Wp,-D_FORTIFY_SOURCE=2 -fstack-protector-strong --param=ssp-buffer-size=4 -Werror=trampolines -fPIC -march=x86-64 -mtune=generic -gdwarf-4 -fno-debug-types-section -fvar-tracking-assignments -g2 -c -o BlockPosition.o BlockPosition.cpp x86_64-pld-linux-g++ -O2 -fwrapv -pipe -Wformat -Werror=format-security -gdwarf-4 -fno-debug-types-section -fvar-tracking-assignments -g2 -Wp,-D_FORTIFY_SOURCE=2 -fstack-protector-strong --param=ssp-buffer-size=4 -Werror=trampolines -fPIC -march=x86-64 -mtune=generic -gdwarf-4 -fno-debug-types-section -fvar-tracking-assignments -g2 -c -o Well.o Well.cpp x86_64-pld-linux-g++ -O2 -fwrapv -pipe -Wformat -Werror=format-security -gdwarf-4 -fno-debug-types-section -fvar-tracking-assignments -g2 -Wp,-D_FORTIFY_SOURCE=2 -fstack-protector-strong --param=ssp-buffer-size=4 -Werror=trampolines -fPIC -march=x86-64 -mtune=generic -gdwarf-4 -fno-debug-types-section -fvar-tracking-assignments -g2 -c -o Test.o Test.cpp x86_64-pld-linux-g++ -O2 -fwrapv -pipe -Wformat -Werror=format-security -gdwarf-4 -fno-debug-types-section -fvar-tracking-assignments -g2 -Wp,-D_FORTIFY_SOURCE=2 -fstack-protector-strong --param=ssp-buffer-size=4 -Werror=trampolines -fPIC -march=x86-64 -mtune=generic -gdwarf-4 -fno-debug-types-section -fvar-tracking-assignments -g2 -c -o main.o main.cpp x86_64-pld-linux-g++ -O2 -fwrapv -pipe -Wformat -Werror=format-security -gdwarf-4 -fno-debug-types-section -fvar-tracking-assignments -g2 -Wp,-D_FORTIFY_SOURCE=2 -fstack-protector-strong --param=ssp-buffer-size=4 -Werror=trampolines -fPIC -march=x86-64 -mtune=generic -gdwarf-4 -fno-debug-types-section -fvar-tracking-assignments -g2 -c -o BastetBlockChooser.o BastetBlockChooser.cpp x86_64-pld-linux-g++ -O2 -fwrapv -pipe -Wformat -Werror=format-security -gdwarf-4 -fno-debug-types-section -fvar-tracking-assignments -g2 -Wp,-D_FORTIFY_SOURCE=2 -fstack-protector-strong --param=ssp-buffer-size=4 -Werror=trampolines -fPIC -march=x86-64 -mtune=generic -gdwarf-4 -fno-debug-types-section -fvar-tracking-assignments -g2 -c -o Ui.o Ui.cpp Ui.cpp: In member function 'void Bastet::Ui::MessageDialog(const string&)': Ui.cpp:186:14: error: format not a string literal and no format arguments [-Werror=format-security] 186 | mvwprintw(w,0,0,message.c_str()); | ~~~~~~~~~^~~~~~~~~~~~~~~~~~~~~~~ Ui.cpp: In member function 'std::string Bastet::Ui::InputDialog(const string&)': Ui.cpp:203:14: error: format not a string literal and no format arguments [-Werror=format-security] 203 | mvwprintw(w,0,0,message.c_str()); | ~~~~~~~~~^~~~~~~~~~~~~~~~~~~~~~~ Ui.cpp: In member function 'int Bastet::Ui::KeyDialog(const string&)': Ui.cpp:224:14: error: format not a string literal and no format arguments [-Werror=format-security] 224 | mvwprintw(w,0,0,message.c_str()); | ~~~~~~~~~^~~~~~~~~~~~~~~~~~~~~~~ Ui.cpp: In member function 'int Bastet::Ui::MenuDialog(const std::vector<std::__cxx11::basic_string<char> >&)': Ui.cpp:242:16: error: format not a string literal and no format arguments [-Werror=format-security] 242 | mvwprintw(w,i,4,choices[i].c_str()); | ~~~~~~~~~^~~~~~~~~~~~~~~~~~~~~~~~~~ Ui.cpp: In member function 'void Bastet::Ui::ChooseLevel()': Ui.cpp:293:16: error: format not a string literal and no format arguments [-Werror=format-security] 293 | mvwprintw(w,0,0,msg.c_str()); | ~~~~~~~~~^~~~~~~~~~~~~~~~~~~ cc1plus: some warnings being treated as errors make: *** [<builtin>: Ui.o] Error 1 make: *** Waiting for unfinished jobs.... x86_64-pld-linux-g++ -O2 -fwrapv -pipe -Wformat -Werror=format-security -gdwarf-4 -fno-debug-types-section -fvar-tracking-assignments -g2 -Wp,-D_FORTIFY_SOURCE=2 -fstack-protector-strong --param=ssp-buffer-size=4 -Werror=trampolines -fPIC -march=x86-64 -mtune=generic -gdwarf-4 -fno-debug-types-section -fvar-tracking-assignments -g2 -c -o Config.o Config.cpp error: Bad exit status from /tmp/B.q2x_u5th/BUILD/tmp/rpm-tmp.AGSoen (%build) RPM build errors: Could not canonicalize hostname: ymir Bad exit status from /tmp/B.q2x_u5th/BUILD/tmp/rpm-tmp.AGSoen (%build) ended at: Fri Jan 14 21:12:10 2022, done in 0:00:09.612459 error: No files produced. + chmod -R u+rwX /tmp/B.q2x_u5th/BUILD + rm -rf /tmp/B.q2x_u5th/tmp /tmp/B.q2x_u5th/BUILD + rm -rf /tmp/B.q2x_u5th Begin-PLD-Builder-Info Build-Time: user:26.05s sys:2.61s real:11.58s (faults io:4 non-io:545088) End-PLD-Builder-Info
[Back to list of logs] [View rpm -qa of builder]