FailedOk

th/SRPMS[OK]
th/x32[OK]
th/i686[OK]
th/x86_64[OK]

ac/SRPMS[OK]
ac/i386[OK]
ac/i586[OK]
ac/i686[OK]
ac/alpha[OK]
ac/amd64[OK]
ac/athlon[OK]
ac/ppc[OK]
ac/sparc[OK]
ac/sparc64[OK]

Advanced Search
main()
Powered by PLD Linux
(c) 2002-2021 PLD Team
$Revision: 1.37 $
Powered by PDP-11.
Your IP: 3.80.5.103

crossmingw32-atkmm ee81dbe6-0765-4df3-a851-a84ee40c9d9c

Status:Failed
Source URL:https://buildlogs.pld-linux.org/pld/th/x86_64/FAIL/crossmingw32-atkmm,ee81dbe6-0765-4df3-a851-a84ee40c9d9c.bz2
text/plain URL:View!
full text:View!
rpm -qa of builder:View!
Date:2021/05/22 10:01:59
Runtime:0:00:12.232740

Toc:

  • error 1
  • libtool: error: Could not determine the host path corresponding to
  • error 2
  • libtool: error: '/usr/i386-mingw32/lib'
  • error 3
  • libtool: error: Continuing, but uninstalled executables may not work.
  • error 4
  • libtool: error: Could not determine the host path corresponding to
  • error 5
  • libtool: error: '/usr/i386-mingw32/lib:/usr/i386-mingw32/bin'
  • error 6
  • libtool: error: Continuing, but uninstalled executables may not work.
  • error 7
  • make[1]: *** [Makefile:572: ../atkmm/wrap_init.cc] Error 2
  • error 8
  • make[1]: *** [Makefile:577: .stamps/component.stamp] Error 2
  • error 9
  • make[1]: *** [Makefile:577: .stamps/action.stamp] Error 2
  • error 10
  • make[1]: *** [Makefile:577: .stamps/document.stamp] Error 2
  • error 11
  • make[1]: *** [Makefile:577: .stamps/editabletext.stamp] Error 2
  • error 12
  • make[1]: *** [Makefile:577: .stamps/hyperlink.stamp] Error 2
  • error 13
  • make[1]: *** [Makefile:577: .stamps/hypertext.stamp] Error 2
  • error 14
  • make[1]: *** [Makefile:577: .stamps/image.stamp] Error 2
  • error 15
  • error: Bad exit status from /tmp/B.GPQkwj/BUILD/tmp/rpm-tmp.0plKMs (%build)
  • error 16
  • RPM build errors:
  • error 17
  • error: No files produced.

Content:

checking whether ln -s works... yes
checking the maximum length of command line arguments... 1572864
checking how to convert x86_64-pld-linux-gnu file names to i386-pc-mingw32 format... func_convert_file_nix_to_w32
checking how to convert x86_64-pld-linux-gnu file names to toolchain format... func_convert_file_noop
checking for /usr/i386-mingw32/bin/ld option to reload object files... -r
checking for i386-mingw32-objdump... i386-mingw32-objdump
checking how to recognize dependent libraries... file_magic ^x86 archive import|^x86 DLL
checking for i386-mingw32-dlltool... i386-mingw32-dlltool
checking how to associate runtime and link libraries... func_cygming_dll_for_implib
checking for i386-mingw32-ar... i386-mingw32-ar
checking for archiver @FILE support... @
checking for i386-mingw32-strip... (cached) i386-mingw32-strip
checking for i386-mingw32-ranlib... i386-mingw32-ranlib
checking command to parse /usr/bin/i386-mingw32-nm -B output from i386-mingw32-gcc object... ok
checking for sysroot... no
checking for a working dd... /bin/dd
checking how to truncate binary pipes... /bin/dd bs=4096 count=1
checking for i386-mingw32-mt... no
checking for mt... no
checking if : is a manifest tool... no
checking for stdio.h... yes
checking for stdlib.h... yes
checking for string.h... yes
checking for inttypes.h... yes
checking for stdint.h... yes
checking for strings.h... yes
checking for sys/stat.h... yes
checking for sys/types.h... yes
checking for unistd.h... yes
checking for dlfcn.h... yes
checking for i386-mingw32-as... i386-mingw32-as
checking for i386-mingw32-dlltool... (cached) i386-mingw32-dlltool
checking for i386-mingw32-objdump... (cached) i386-mingw32-objdump
checking for objdir... .libs
checking if i386-mingw32-gcc supports -fno-rtti -fno-exceptions... no
checking for i386-mingw32-gcc option to produce PIC... -DDLL_EXPORT -DPIC
checking if i386-mingw32-gcc PIC flag -DDLL_EXPORT -DPIC works... yes
checking if i386-mingw32-gcc static flag -static works... yes
checking if i386-mingw32-gcc supports -c -o file.o... yes
checking if i386-mingw32-gcc supports -c -o file.o... (cached) yes
checking whether the i386-mingw32-gcc linker (/usr/i386-mingw32/bin/ld) supports shared libraries... yes
checking whether -lc should be explicitly linked in... yes
checking dynamic linker characteristics... Win32 ld.exe
checking how to hardcode library paths into programs... immediate
checking whether stripping libraries is possible... yes
checking if libtool supports shared libraries... yes
checking whether to build shared libraries... yes
checking whether to build static libraries... yes
checking how to run the C++ preprocessor... i386-mingw32-g++ -std=c++11 -E
checking for ld used by i386-mingw32-g++ -std=c++11... /usr/i386-mingw32/bin/ld
checking if the linker (/usr/i386-mingw32/bin/ld) is GNU ld... yes
checking whether the i386-mingw32-g++ -std=c++11 linker (/usr/i386-mingw32/bin/ld) supports shared libraries... yes
checking for i386-mingw32-g++ -std=c++11 option to produce PIC... -DDLL_EXPORT -DPIC
checking if i386-mingw32-g++ -std=c++11 PIC flag -DDLL_EXPORT -DPIC works... yes
checking if i386-mingw32-g++ -std=c++11 static flag -static works... no
checking if i386-mingw32-g++ -std=c++11 supports -c -o file.o... yes
checking if i386-mingw32-g++ -std=c++11 supports -c -o file.o... (cached) yes
checking whether the i386-mingw32-g++ -std=c++11 linker (/usr/i386-mingw32/bin/ld) supports shared libraries... yes
checking dynamic linker characteristics... Win32 ld.exe
checking how to hardcode library paths into programs... immediate
checking for i386-mingw32-pkg-config... no
checking for pkg-config... /usr/bin/pkg-config
configure: WARNING: using cross tools not prefixed with host triplet
checking pkg-config is at least version 0.9.0... yes
checking for atk >= 1.18 glibmm-2.4 >= 2.46.2... yes
checking for GTHREAD_CFLAGS... -mms-bitfields
checking for GMMPROC_DIR... /usr/i386-mingw32/lib/glibmm-2.4/proc
configure: Deprecated API will be built, for backwards-compatibility.
checking for perl... /usr/bin/perl
checking for dot... /usr/bin/dot
checking for doxygen... /usr/bin/doxygen
checking for xsltproc... /usr/bin/xsltproc
checking which C++ compiler warning flags to use... -Wall
checking that generated files are newer than configure... done
configure: creating ./config.status
config.status: creating Makefile
config.status: creating codegen/Makefile
config.status: creating atk/atkmm-1.6.pc
config.status: creating atk/atkmm-1.6-uninstalled.pc
config.status: creating atk/src/Makefile
config.status: creating atk/atkmm/Makefile
config.status: creating doc/Makefile
config.status: creating doc/reference/Doxyfile
config.status: creating MSVC_NMake/atkmm/atkmm.rc
config.status: creating build/config.h
config.status: creating atk/atkmmconfig.h
config.status: executing depfiles commands
config.status: executing libtool commands
config.status: executing MSVC_NMake/atkmm/atkmmconfig.h commands
+ /usr/bin/make -Otarget -j9 'GMMPROC_DIR=/usr/i386-mingw32/lib/glibmm-2.4/proc'
Making all in codegen
make[1]: Entering directory '/tmp/B.GPQkwj/BUILD/atkmm-2.28.2/codegen'
depbase=`echo extradefs/generate_extra_defs_atk.o | sed 's|[^/]*$|.deps/&|;s|\.o$||'`;\
i386-mingw32-g++ -std=c++11 -DHAVE_CONFIG_H   -I.. -mms-bitfields -mms-bitfields -I/usr/i386-mingw32/include/atk-1.0 -I/usr/i386-mingw32/include/glibmm-2.4 -I/usr/i386-mingw32/lib/glibmm-2.4/include -I/usr/i386-mingw32/include -I/usr/i386-mingw32/lib/libffi-3.2.1/include -I/usr/i386-mingw32/include/glib-2.0 -I/usr/i386-mingw32/lib/glib-2.0/include -I/usr/i386-mingw32/include -I/usr/i386-mingw32/include/sigc++-2.0 -I/usr/i386-mingw32/lib/sigc++-2.0/include -DWINVER=0x0501 -Wall -O2  -MT extradefs/generate_extra_defs_atk.o -MD -MP -MF $depbase.Tpo -c -o extradefs/generate_extra_defs_atk.o extradefs/generate_extra_defs_atk.cc &&\
mv -f $depbase.Tpo $depbase.Po
make[1]: Leaving directory '/tmp/B.GPQkwj/BUILD/atkmm-2.28.2/codegen'
make[1]: Entering directory '/tmp/B.GPQkwj/BUILD/atkmm-2.28.2/codegen'
/bin/sh ../libtool  --tag=CXX   --mode=link i386-mingw32-g++ -std=c++11 -Wall -O2  -no-undefined -avoid-version -Wl,--as-needed -Wl,--no-copy-dt-needed-entries  -o extradefs/generate_extra_defs.exe extradefs/generate_extra_defs_atk.o -L/usr/i386-mingw32/lib -latk-1.0 -lglibmm-2.4 -lgobject-2.0 -lglib-2.0 -lintl -lsigc-2.0 -lglibmm_generate_extra_defs-2.4 
libtool: link: i386-mingw32-g++ -std=c++11 -Wall -O2 -Wl,--as-needed -Wl,--no-copy-dt-needed-entries -o extradefs/.libs/generate_extra_defs.exe extradefs/generate_extra_defs_atk.o  -L/usr/i386-mingw32/lib -latk-1.0 -lglibmm-2.4 -lgobject-2.0 -lglib-2.0 /usr/i386-mingw32/lib/libintl.dll.a /usr/i386-mingw32/lib/libiconv.dll.a -ladvapi32 /usr/i386-mingw32/lib/libsigc-2.0.dll.a /usr/i386-mingw32/lib/libstdc++.dll.a -lglibmm_generate_extra_defs-2.4 -L/usr/i386-mingw32/lib
libtool:   error: Could not determine the host path corresponding to
libtool:   error:   '/usr/i386-mingw32/lib'
libtool:   error: Continuing, but uninstalled executables may not work.
libtool:   error: Could not determine the host path corresponding to
libtool:   error:   '/usr/i386-mingw32/lib:/usr/i386-mingw32/bin'
libtool:   error: Continuing, but uninstalled executables may not work.
make[1]: Leaving directory '/tmp/B.GPQkwj/BUILD/atkmm-2.28.2/codegen'
Making all in atk/src
make[1]: Entering directory '/tmp/B.GPQkwj/BUILD/atkmm-2.28.2/atk/src'
/bin/mkdir -p .stamps
make[1]: Leaving directory '/tmp/B.GPQkwj/BUILD/atkmm-2.28.2/atk/src'
make[1]: *** Deleting file '../atkmm/wrap_init.cc'
make[1]: Entering directory '/tmp/B.GPQkwj/BUILD/atkmm-2.28.2/atk/src'
/usr/bin/perl -- "/usr/i386-mingw32/lib/glibmm-2.4/proc/generate_wrap_init.pl" --namespace=Atk --parent_dir=atkmm ./action.hg ./component.hg ./document.hg ./editabletext.hg ./hyperlink.hg ./hypertext.hg ./image.hg ./implementor.hg ./noopobject.hg ./object.hg ./objectaccessible.hg ./range.hg ./relation.hg ./relationset.hg ./selection.hg ./stateset.hg ./streamablecontent.hg ./table.hg ./text.hg ./value.hg >../atkmm/wrap_init.cc
Can't open perl script "/usr/i386-mingw32/lib/glibmm-2.4/proc/generate_wrap_init.pl": No such file or directory
make[1]: *** [Makefile:572: ../atkmm/wrap_init.cc] Error 2
make[1]: Leaving directory '/tmp/B.GPQkwj/BUILD/atkmm-2.28.2/atk/src'
make[1]: *** Waiting for unfinished jobs....
make[1]: *** Deleting file '.stamps/component.stamp'
make[1]: Entering directory '/tmp/B.GPQkwj/BUILD/atkmm-2.28.2/atk/src'
/usr/bin/perl -I"/usr/i386-mingw32/lib/glibmm-2.4/proc/pm" -- "/usr/i386-mingw32/lib/glibmm-2.4/proc/gmmproc" -I ../../codegen/m4 --defs . component . ../atkmm
Can't open perl script "/usr/i386-mingw32/lib/glibmm-2.4/proc/gmmproc": No such file or directory
make[1]: *** [Makefile:577: .stamps/component.stamp] Error 2
make[1]: Leaving directory '/tmp/B.GPQkwj/BUILD/atkmm-2.28.2/atk/src'
make[1]: *** Deleting file '.stamps/action.stamp'
make[1]: Entering directory '/tmp/B.GPQkwj/BUILD/atkmm-2.28.2/atk/src'
/usr/bin/perl -I"/usr/i386-mingw32/lib/glibmm-2.4/proc/pm" -- "/usr/i386-mingw32/lib/glibmm-2.4/proc/gmmproc" -I ../../codegen/m4 --defs . action . ../atkmm
Can't open perl script "/usr/i386-mingw32/lib/glibmm-2.4/proc/gmmproc": No such file or directory
make[1]: *** [Makefile:577: .stamps/action.stamp] Error 2
make[1]: Leaving directory '/tmp/B.GPQkwj/BUILD/atkmm-2.28.2/atk/src'
make[1]: *** Deleting file '.stamps/document.stamp'
make[1]: Entering directory '/tmp/B.GPQkwj/BUILD/atkmm-2.28.2/atk/src'
/usr/bin/perl -I"/usr/i386-mingw32/lib/glibmm-2.4/proc/pm" -- "/usr/i386-mingw32/lib/glibmm-2.4/proc/gmmproc" -I ../../codegen/m4 --defs . document . ../atkmm
Can't open perl script "/usr/i386-mingw32/lib/glibmm-2.4/proc/gmmproc": No such file or directory
make[1]: *** [Makefile:577: .stamps/document.stamp] Error 2
make[1]: Leaving directory '/tmp/B.GPQkwj/BUILD/atkmm-2.28.2/atk/src'
make[1]: *** Deleting file '.stamps/editabletext.stamp'
make[1]: Entering directory '/tmp/B.GPQkwj/BUILD/atkmm-2.28.2/atk/src'
/usr/bin/perl -I"/usr/i386-mingw32/lib/glibmm-2.4/proc/pm" -- "/usr/i386-mingw32/lib/glibmm-2.4/proc/gmmproc" -I ../../codegen/m4 --defs . editabletext . ../atkmm
Can't open perl script "/usr/i386-mingw32/lib/glibmm-2.4/proc/gmmproc": No such file or directory
make[1]: *** [Makefile:577: .stamps/editabletext.stamp] Error 2
make[1]: Leaving directory '/tmp/B.GPQkwj/BUILD/atkmm-2.28.2/atk/src'
make[1]: *** Deleting file '.stamps/hyperlink.stamp'
make[1]: Entering directory '/tmp/B.GPQkwj/BUILD/atkmm-2.28.2/atk/src'
/usr/bin/perl -I"/usr/i386-mingw32/lib/glibmm-2.4/proc/pm" -- "/usr/i386-mingw32/lib/glibmm-2.4/proc/gmmproc" -I ../../codegen/m4 --defs . hyperlink . ../atkmm
Can't open perl script "/usr/i386-mingw32/lib/glibmm-2.4/proc/gmmproc": No such file or directory
make[1]: *** [Makefile:577: .stamps/hyperlink.stamp] Error 2
make[1]: Leaving directory '/tmp/B.GPQkwj/BUILD/atkmm-2.28.2/atk/src'
make[1]: *** Deleting file '.stamps/hypertext.stamp'
make[1]: Entering directory '/tmp/B.GPQkwj/BUILD/atkmm-2.28.2/atk/src'
/usr/bin/perl -I"/usr/i386-mingw32/lib/glibmm-2.4/proc/pm" -- "/usr/i386-mingw32/lib/glibmm-2.4/proc/gmmproc" -I ../../codegen/m4 --defs . hypertext . ../atkmm
Can't open perl script "/usr/i386-mingw32/lib/glibmm-2.4/proc/gmmproc": No such file or directory
make[1]: *** [Makefile:577: .stamps/hypertext.stamp] Error 2
make[1]: Leaving directory '/tmp/B.GPQkwj/BUILD/atkmm-2.28.2/atk/src'
make[1]: *** Deleting file '.stamps/image.stamp'
make[1]: Entering directory '/tmp/B.GPQkwj/BUILD/atkmm-2.28.2/atk/src'
/usr/bin/perl -I"/usr/i386-mingw32/lib/glibmm-2.4/proc/pm" -- "/usr/i386-mingw32/lib/glibmm-2.4/proc/gmmproc" -I ../../codegen/m4 --defs . image . ../atkmm
Can't open perl script "/usr/i386-mingw32/lib/glibmm-2.4/proc/gmmproc": No such file or directory
make[1]: *** [Makefile:577: .stamps/image.stamp] Error 2
make[1]: Leaving directory '/tmp/B.GPQkwj/BUILD/atkmm-2.28.2/atk/src'
make: *** [Makefile:609: all-recursive] Error 1
error: Bad exit status from /tmp/B.GPQkwj/BUILD/tmp/rpm-tmp.0plKMs (%build)


RPM build errors:
    line 27: It's not recommended to have unversioned Obsoletes: Obsoletes:	crossmingw32-gtkmm-atk
    line 67: It's not recommended to have unversioned Obsoletes: Obsoletes:	crossmingw32-gtkmm-atk-static
    line 83: It's not recommended to have unversioned Obsoletes: Obsoletes:	crossmingw32-gtkmm-atk-dll
    Could not canonicalize hostname: ymir
    Bad exit status from /tmp/B.GPQkwj/BUILD/tmp/rpm-tmp.0plKMs (%build)
ended at: Sat May 22 10:01:59 2021, done in 0:00:12.232740
error: No files produced.
+ chmod -R u+rwX /tmp/B.GPQkwj/BUILD
+ rm -rf /tmp/B.GPQkwj/tmp /tmp/B.GPQkwj/BUILD
+ rm -rf /tmp/B.GPQkwj
Begin-PLD-Builder-Info
Build-Time: user:11.46s sys:2.89s real:13.99s (faults io:1 non-io:833526)

End-PLD-Builder-Info
[Back to list of logs] [View rpm -qa of builder]